#69657 TC10 — Late cancellation from the client account gives the same No-show outcome¶
test_account_late_cancel_no_show_parity
Failures in last 30 days: 11
Generated at 2026-10-08 03:53 MSK
Last failure: 2026-10-02 11:50 MSK
Filter: pipelines with sandbox_biz_erp ∈ {master, testops-dev} AND autotests_branch ∈ {master, main} only (testops-dev — daytime ticks since 2026-08-05).
By exception class:
- SigninRedirectMissingError — 8
- TimeoutError — 3
Failure signatures (grouped by exception + full message):
SigninRedirectMissingError — 1 occurrence(s) across 1 pipeline(s)¶
autotests.lib.exception.SigninRedirectMissingError: login-XHR завершился со статусом 200, но редиректа со /signin/ не случилось за 30 с — подозрение на фронт biz.erp
--- причина (playwright) ---
Timeout 30000ms exceeded.
=========================== logs ===========================
waiting for navigation to "<function ImplToApiMapping.wrap_handler.<locals>.wrapper_func at 0x7f69a20ae200>" until 'commit'
navigated to "https://erp-testops-dev.infra.altegio.cloud/signin/"
navigated to "https://erp-testops-dev.infra.altegio.cloud/signin/"
navigated to "https://erp-testops-dev.infra.altegio.cloud/signin/JTJGdGltZXRhYmxlJTJGMTYzNTczNjAlMkY="
navigated to "https://erp-testops-dev.infra.altegio.cloud/signin/JTJGdGltZXRhYmxlJTJGMTYzNTczNjAlMkY="
navigated to "https://erp-testops-dev.infra.altegio.cloud/signin/JTJGdGltZXRhYmxlJTJGMTYzNTczNjAlMkY="
============================================================
Stacktrace:
suite/yclients/client/booking/web/cancel_with_membership/test_client_account_pw.py:97 in test_account_late_cancel_no_show_parity
lib/apps_pw/yclients/biz/erp/web/pages/guest/signin.py:115 in sign_in
Seen in: - altegio/biz.erp#227722 — shard 4 — launch 171516 (×1, last 2026-10-02 04:26 MSK)
SigninRedirectMissingError — 1 occurrence(s) across 1 pipeline(s)¶
autotests.lib.exception.SigninRedirectMissingError: login-XHR завершился со статусом 200, но редиректа со /signin/ не случилось за 30 с — подозрение на фронт biz.erp
--- причина (playwright) ---
Timeout 30000ms exceeded.
=========================== logs ===========================
waiting for navigation to "<function ImplToApiMapping.wrap_handler.<locals>.wrapper_func at 0x7f364a462ca0>" until 'commit'
navigated to "https://erp-testops-dev.infra.altegio.cloud/signin/"
navigated to "https://erp-testops-dev.infra.altegio.cloud/signin/"
navigated to "https://erp-testops-dev.infra.altegio.cloud/signin/JTJGdGltZXRhYmxlJTJGMTYzNjAxMTIlMkY="
navigated to "https://erp-testops-dev.infra.altegio.cloud/signin/JTJGdGltZXRhYmxlJTJGMTYzNjAxMTIlMkY="
navigated to "https://erp-testops-dev.infra.altegio.cloud/signin/JTJGdGltZXRhYmxlJTJGMTYzNjAxMTIlMkY="
============================================================
Stacktrace:
suite/yclients/client/booking/web/cancel_with_membership/test_client_account_pw.py:97 in test_account_late_cancel_no_show_parity
lib/apps_pw/yclients/biz/erp/web/pages/guest/signin.py:115 in sign_in
Seen in: - altegio/biz.erp#227722 — shard 4 — launch 171516 (×1, last 2026-10-02 04:26 MSK)
SigninRedirectMissingError — 1 occurrence(s) across 1 pipeline(s)¶
autotests.lib.exception.SigninRedirectMissingError: login-XHR завершился со статусом 200, но редиректа со /signin/ не случилось за 30 с — подозрение на фронт biz.erp
--- причина (playwright) ---
Timeout 30000ms exceeded.
=========================== logs ===========================
waiting for navigation to "<function ImplToApiMapping.wrap_handler.<locals>.wrapper_func at 0x7fde739afc40>" until 'commit'
navigated to "https://erp-testops-dev.infra.altegio.cloud/signin/"
navigated to "https://erp-testops-dev.infra.altegio.cloud/signin/"
navigated to "https://erp-testops-dev.infra.altegio.cloud/signin/JTJGdGltZXRhYmxlJTJGMTYzNjE3MDYlMkY="
navigated to "https://erp-testops-dev.infra.altegio.cloud/signin/JTJGdGltZXRhYmxlJTJGMTYzNjE3MDYlMkY="
navigated to "https://erp-testops-dev.infra.altegio.cloud/signin/JTJGdGltZXRhYmxlJTJGMTYzNjE3MDYlMkY="
============================================================
Stacktrace:
suite/yclients/client/booking/web/cancel_with_membership/test_client_account_pw.py:97 in test_account_late_cancel_no_show_parity
lib/apps_pw/yclients/biz/erp/web/pages/guest/signin.py:115 in sign_in
Seen in: - altegio/biz.erp#227735 — shard 4 — launch 171549 (×1, last 2026-10-02 06:23 MSK)
SigninRedirectMissingError — 1 occurrence(s) across 1 pipeline(s)¶
autotests.lib.exception.SigninRedirectMissingError: login-XHR завершился со статусом 200, но редиректа со /signin/ не случилось за 30 с — подозрение на фронт biz.erp
--- причина (playwright) ---
Timeout 30000ms exceeded.
=========================== logs ===========================
waiting for navigation to "<function ImplToApiMapping.wrap_handler.<locals>.wrapper_func at 0x7f6ec467a8e0>" until 'commit'
navigated to "https://erp-testops-dev.infra.altegio.cloud/signin/"
navigated to "https://erp-testops-dev.infra.altegio.cloud/signin/"
navigated to "https://erp-testops-dev.infra.altegio.cloud/signin/JTJGdGltZXRhYmxlJTJGMTYzNjQzNDYlMkY="
navigated to "https://erp-testops-dev.infra.altegio.cloud/signin/JTJGdGltZXRhYmxlJTJGMTYzNjQzNDYlMkY="
navigated to "https://erp-testops-dev.infra.altegio.cloud/signin/JTJGdGltZXRhYmxlJTJGMTYzNjQzNDYlMkY="
============================================================
Stacktrace:
suite/yclients/client/booking/web/cancel_with_membership/test_client_account_pw.py:97 in test_account_late_cancel_no_show_parity
lib/apps_pw/yclients/biz/erp/web/pages/guest/signin.py:115 in sign_in
Seen in: - altegio/biz.erp#227735 — shard 4 — launch 171549 (×1, last 2026-10-02 06:23 MSK)
SigninRedirectMissingError — 1 occurrence(s) across 1 pipeline(s)¶
autotests.lib.exception.SigninRedirectMissingError: login-XHR завершился со статусом 200, но редиректа со /signin/ не случилось за 30 с — подозрение на фронт biz.erp
--- причина (playwright) ---
Timeout 30000ms exceeded.
=========================== logs ===========================
waiting for navigation to "<function ImplToApiMapping.wrap_handler.<locals>.wrapper_func at 0x7fd7f030a340>" until 'commit'
navigated to "https://erp-testops-dev.infra.altegio.cloud/signin/"
navigated to "https://erp-testops-dev.infra.altegio.cloud/signin/"
navigated to "https://erp-testops-dev.infra.altegio.cloud/signin/JTJGdGltZXRhYmxlJTJGMTYzNjY0NjUlMkY="
navigated to "https://erp-testops-dev.infra.altegio.cloud/signin/JTJGdGltZXRhYmxlJTJGMTYzNjY0NjUlMkY="
navigated to "https://erp-testops-dev.infra.altegio.cloud/signin/JTJGdGltZXRhYmxlJTJGMTYzNjY0NjUlMkY="
============================================================
Stacktrace:
suite/yclients/client/booking/web/cancel_with_membership/test_client_account_pw.py:97 in test_account_late_cancel_no_show_parity
lib/apps_pw/yclients/biz/erp/web/pages/guest/signin.py:115 in sign_in
Seen in: - altegio/biz.erp#227749 — shard 7 — launch 171616 (×1, last 2026-10-02 08:20 MSK)
SigninRedirectMissingError — 1 occurrence(s) across 1 pipeline(s)¶
autotests.lib.exception.SigninRedirectMissingError: login-XHR завершился со статусом 200, но редиректа со /signin/ не случилось за 30 с — подозрение на фронт biz.erp
--- причина (playwright) ---
Timeout 30000ms exceeded.
=========================== logs ===========================
waiting for navigation to "<function ImplToApiMapping.wrap_handler.<locals>.wrapper_func at 0x7fc6983dae80>" until 'commit'
navigated to "https://erp-testops-dev.infra.altegio.cloud/signin/"
navigated to "https://erp-testops-dev.infra.altegio.cloud/signin/"
navigated to "https://erp-testops-dev.infra.altegio.cloud/signin/JTJGdGltZXRhYmxlJTJGMTYzNjc4NTIlMkY="
navigated to "https://erp-testops-dev.infra.altegio.cloud/signin/JTJGdGltZXRhYmxlJTJGMTYzNjc4NTIlMkY="
navigated to "https://erp-testops-dev.infra.altegio.cloud/signin/JTJGdGltZXRhYmxlJTJGMTYzNjc4NTIlMkY="
============================================================
Stacktrace:
suite/yclients/client/booking/web/cancel_with_membership/test_client_account_pw.py:97 in test_account_late_cancel_no_show_parity
lib/apps_pw/yclients/biz/erp/web/pages/guest/signin.py:115 in sign_in
Seen in: - altegio/biz.erp#227749 — shard 7 — launch 171616 (×1, last 2026-10-02 08:20 MSK)
SigninRedirectMissingError — 1 occurrence(s) across 1 pipeline(s)¶
autotests.lib.exception.SigninRedirectMissingError: login-XHR завершился со статусом 200, но редиректа со /signin/ не случилось за 30 с — подозрение на фронт biz.erp
--- причина (playwright) ---
Timeout 30000ms exceeded.
=========================== logs ===========================
waiting for navigation to "<function ImplToApiMapping.wrap_handler.<locals>.wrapper_func at 0x7f74a0c92340>" until 'commit'
navigated to "https://erp-testops-dev.infra.altegio.cloud/signin/"
navigated to "https://erp-testops-dev.infra.altegio.cloud/signin/"
navigated to "https://erp-testops-dev.infra.altegio.cloud/signin/JTJGdGltZXRhYmxlJTJGMTYzNjg5MDklMkY="
navigated to "https://erp-testops-dev.infra.altegio.cloud/signin/JTJGdGltZXRhYmxlJTJGMTYzNjg5MDklMkY="
navigated to "https://erp-testops-dev.infra.altegio.cloud/signin/JTJGdGltZXRhYmxlJTJGMTYzNjg5MDklMkY="
============================================================
Stacktrace:
suite/yclients/client/booking/web/cancel_with_membership/test_client_account_pw.py:97 in test_account_late_cancel_no_show_parity
lib/apps_pw/yclients/biz/erp/web/pages/guest/signin.py:115 in sign_in
Seen in: - altegio/biz.erp#227749 — shard 7 — launch 171616 (×1, last 2026-10-02 08:20 MSK)
SigninRedirectMissingError — 1 occurrence(s) across 1 pipeline(s)¶
autotests.lib.exception.SigninRedirectMissingError: login-XHR завершился со статусом 200, но редиректа со /signin/ не случилось за 30 с — подозрение на фронт biz.erp
--- причина (playwright) ---
Timeout 30000ms exceeded.
=========================== logs ===========================
waiting for navigation to "<function ImplToApiMapping.wrap_handler.<locals>.wrapper_func at 0x7f44af550180>" until 'commit'
navigated to "https://erp-testops-dev.infra.altegio.cloud/signin/"
navigated to "https://erp-testops-dev.infra.altegio.cloud/signin/"
navigated to "https://erp-testops-dev.infra.altegio.cloud/signin/JTJGdGltZXRhYmxlJTJGMTYzNzA1MDUlMkY="
navigated to "https://erp-testops-dev.infra.altegio.cloud/signin/JTJGdGltZXRhYmxlJTJGMTYzNzA1MDUlMkY="
navigated to "https://erp-testops-dev.infra.altegio.cloud/signin/JTJGdGltZXRhYmxlJTJGMTYzNzA1MDUlMkY="
============================================================
Stacktrace:
suite/yclients/client/booking/web/cancel_with_membership/test_client_account_pw.py:97 in test_account_late_cancel_no_show_parity
lib/apps_pw/yclients/biz/erp/web/pages/guest/signin.py:115 in sign_in
Seen in: - altegio/biz.erp#227787 — shard 2 — launch 171752 (×1, last 2026-10-02 11:50 MSK)
TimeoutError — 1 occurrence(s) across 1 pipeline(s)¶
playwright._impl._errors.TimeoutError: Page.wait_for_function: Timeout 30000ms exceeded.
AssertionError: Failed to navigate through menu item MENU_ITEM_CLIENTS_DB. Browser diagnostics:
{
"url": "https://erp-testops-dev.infra.altegio.cloud/signin/JTJGYW5hbHl0aWNzJTJGMTYzNTQ0ODUlMkY=",
"observer": {
"installed": true,
"first_js_error": null,
"js_errors": [],
"js_errors_by_location": {},
"xhr_queue": []
},
"page_errors": [],
"console": [
{
"type": "warning",
"text": "Web Vitals polyfill required",
"location": {
"url": "https://erp-testops-dev.infra.altegio.cloud/js/vue-vite-app/chunk-CmfuiQN82.js",
"lineNumber": 0,
"columnNumber": 11949
}
}
],
"active_page_url": "https://erp-testops-dev.infra.altegio.cloud/signin/JTJGYW5hbHl0aWNzJTJGMTYzNTQ0ODUlMkY=",
"pages": [
{
"active": false,
"url": "https://erp-testops-dev.infra.altegio.cloud/timetable/16354485/#mode=1&main_date=2026-10-01",
"observer": {
"installed": true,
"first_js_error": null,
"js_errors": [],
"js_errors_by_location": {},
"xhr_queue": []
},
"page_errors": [],
"console": [
{
"type": "warning",
"text": "Web Vitals polyfill required",
"location": {
"url": "https://erp-testops-dev.infra.altegio.cloud/js/vue-vite-app/chunk-CmfuiQN82.js",
"lineNumber": 0,
"columnNumber": 11949
}
},
{
"type": "warning",
"text": "Web Vitals polyfill required",
"location": {
"url": "https://erp-testops-dev.infra.altegio.cloud/js/vue-vite-app/chunk-CmfuiQN82.js",
"lineNumber": 0,
"columnNumber": 11949
}
}
]
},
{
"active": false,
"url": "https://n10990689--client-booking-testops-dev.infra.altegio.cloud/profile/record/record/16354485/20457795?o=",
"observer": {
"installed": true,
"first_js_error": null,
"js_errors": [],
"js_errors_by_location": {},
"xhr_queue": []
},
"page_errors": [],
"console": []
},
{
"active": true,
"url": "https://erp-testops-dev.infra.altegio.cloud/signin/JTJGYW5hbHl0aWNzJTJGMTYzNTQ0ODUlMkY=",
"observer": {
"installed": true,
"first_js_error": null,
"js_errors": [],
"js_errors_by_location": {},
"xhr_queue": []
},
"page_errors": [],
"console": [
{
"type": "warning",
"text": "Web Vitals polyfill required",
"location": {
"url": "https://erp-testops-dev.infra.altegio.cloud/js/vue-vite-app/chunk-CmfuiQN82.js",
"lineNumber": 0,
"columnNumber": 11949
}
}
]
}
]
}
Stacktrace:
lib/apps_pw/yclients/biz/erp/web/components/menu.py:214 in click_menu
lib/apps_pw/yclients/biz/erp/web/components/menu.py:228 in _click_menu
lib/apps_pw/yclients/biz/erp/web/pages/user.py:472 in _ensure_administration_mode_for_legacy_menu
suite/yclients/client/booking/web/cancel_with_membership/test_client_account_pw.py:158 in test_account_late_cancel_no_show_parity
lib/apps_pw/yclients/biz/erp/web/components/menu.py:216 in click_menu
Seen in: - altegio/biz.erp#227558 — shard 6 — launch 171165 (×1, last 2026-10-01 15:20 MSK)
TimeoutError — 1 occurrence(s) across 1 pipeline(s)¶
playwright._impl._errors.TimeoutError: Locator.click: Timeout 30000ms exceeded.
Call log:
- waiting for locator("[class*=\"erp-nav-menu-mode-switch-footer-button\"]:visible, [class*=\"erp-nav-menu-mode-switch-mini__button\"]:visible").first
- locator resolved to <div data-locator="nav_menu_mode_switch_btn" class="erp-nav-menu-mode-switch-footer-button">…</div>
- attempting click action
2 × waiting for element to be visible, enabled and stable
- element is visible, enabled and stable
- scrolling into view if needed
- done scrolling
- <div class="v-error-modal v-error-modal--unauthorized">…</div> intercepts pointer events
- retrying click action
- waiting 20ms
2 × waiting for element to be visible, enabled and stable
- element is visible, enabled and stable
- scrolling into view if needed
- done scrolling
- <div class="v-error-modal v-error-modal--unauthorized">…</div> intercepts pointer events
- retrying click action
- waiting 100ms
56 × waiting for element to be visible, enabled and stable
- element is visible, enabled and stable
- scrolling into view if needed
- done scrolling
- <div class="v-error-modal v-error-modal--unauthorized">…</div> intercepts pointer events
- retrying click action
- waiting 500ms
AssertionError: Failed to navigate through menu item MENU_ITEM_CLIENTS_DB. Browser diagnostics:
{
"url": "https://n10995149--client-booking-testops-dev.infra.altegio.cloud/profile/record/record/16359014/20460638?o=",
"observer": {
"installed": true,
"first_js_error": null,
"js_errors": [],
"js_errors_by_location": {},
"xhr_queue": []
},
"page_errors": [],
"console": [],
"active_page_url": "https://n10995149--client-booking-testops-dev.infra.altegio.cloud/profile/record/record/16359014/20460638?o=",
"pages": [
{
"active": false,
"url": "https://erp-testops-dev.infra.altegio.cloud/timetable/16359014/#mode=1",
"observer": {
"installed": true,
"first_js_error": null,
"js_errors": [],
"js_errors_by_location": {},
"xhr_queue": []
},
"page_errors": [],
"console": [
{
"type": "warning",
"text": "Web Vitals polyfill required",
"location": {
"url": "https://erp-testops-dev.infra.altegio.cloud/js/vue-vite-app/chunk-a6Oo9G3y2.js",
"lineNumber": 0,
"columnNumber": 11968
}
},
{
"type": "error",
"text": "Failed to load resource: the server responded with a status of 401 ()",
"location": {
"url": "https://erp-testops-dev.infra.altegio.cloud/api/v1/company/16359014/timetable/attendance_day?dates%5B%5D=2026-10-02&include%5B%5D=records&include%5B%5D=records.services&include%5B%5D=records.labels&include%5B%5D=records.master&include%5B%5D=records.client&include%5B%5D=records.client.first_successful_visit&include%5B%5D=records.comer&include%5B%5D=records.comer.vehicle&include%5B%5D=records.resource_instances.resource&include%5B%5D=records.resource_instances&include%5B%5D=records.acceptance_free&include%5B%5D=records.attendance_service_items.attendance_service_composite.composite_service&include%5B%5D=records.duration_details&include%5B%5D=activities&include%5B%5D=activities.service&include%5B%5D=activities.labels&include%5B%5D=activities.master&include%5B%5D=activities.resource_instances.resource&include%5B%5D=activities.resource_instances&include%5B%5D=activities.duration_details&new_timetable_attendance_from_legacy=1&_=1790902169553",
"lineNumber": 0,
"columnNumber": 0
}
},
{
"type": "error",
"text": "Failed to load resource: the server responded with a status of 401 ()",
"location": {
"url": "https://erp-testops-dev.infra.altegio.cloud/api/v1/company/16359014/timetable/schedule?... [truncated]
Stacktrace:
lib/apps_pw/yclients/biz/erp/web/components/menu.py:214 in click_menu
lib/apps_pw/yclients/biz/erp/web/components/menu.py:228 in _click_menu
lib/apps_pw/yclients/biz/erp/web/pages/user.py:464 in _ensure_administration_mode_for_legacy_menu
suite/yclients/client/booking/web/cancel_with_membership/test_client_account_pw.py:158 in test_account_late_cancel_no_show_parity
lib/apps_pw/yclients/biz/erp/web/components/menu.py:216 in click_menu
Seen in: - altegio/biz.erp#227722 — shard 4 — launch 171516 (×1, last 2026-10-02 04:26 MSK)
TimeoutError — 1 occurrence(s) across 1 pipeline(s)¶
playwright._impl._errors.TimeoutError: Locator.click: Timeout 30000ms exceeded.
Call log:
- waiting for locator("[class*=\"erp-nav-menu-mode-switch-footer-button\"]:visible, [class*=\"erp-nav-menu-mode-switch-mini__button\"]:visible").first
- locator resolved to <div data-locator="nav_menu_mode_switch_btn" class="erp-nav-menu-mode-switch-footer-button">…</div>
- attempting click action
2 × waiting for element to be visible, enabled and stable
- element is visible, enabled and stable
- scrolling into view if needed
- done scrolling
- <div class="v-error-modal v-error-modal--unauthorized">…</div> intercepts pointer events
- retrying click action
- waiting 20ms
2 × waiting for element to be visible, enabled and stable
- element is visible, enabled and stable
- scrolling into view if needed
- done scrolling
- <div class="v-error-modal v-error-modal--unauthorized">…</div> intercepts pointer events
- retrying click action
- waiting 100ms
58 × waiting for element to be visible, enabled and stable
- element is visible, enabled and stable
- scrolling into view if needed
- done scrolling
- <div class="v-error-modal v-error-modal--unauthorized">…</div> intercepts pointer events
- retrying click action
- waiting 500ms
AssertionError: Failed to navigate through menu item MENU_ITEM_CLIENTS_DB. Browser diagnostics:
{
"url": "https://n10999266--client-booking-testops-dev.infra.altegio.cloud/profile/record/record/16363180/20463501?o=",
"observer": {
"installed": true,
"first_js_error": null,
"js_errors": [],
"js_errors_by_location": {},
"xhr_queue": []
},
"page_errors": [],
"console": [],
"active_page_url": "https://n10999266--client-booking-testops-dev.infra.altegio.cloud/profile/record/record/16363180/20463501?o=",
"pages": [
{
"active": false,
"url": "https://erp-testops-dev.infra.altegio.cloud/timetable/16363180/#mode=1&main_date=2026-10-02",
"observer": {
"installed": true,
"first_js_error": null,
"js_errors": [],
"js_errors_by_location": {},
"xhr_queue": []
},
"page_errors": [],
"console": [
{
"type": "warning",
"text": "Web Vitals polyfill required",
"location": {
"url": "https://erp-testops-dev.infra.altegio.cloud/js/vue-vite-app/chunk-a6Oo9G3y2.js",
"lineNumber": 0,
"columnNumber": 11968
}
},
{
"type": "error",
"text": "Failed to load resource: the server responded with a status of 401 ()",
"location": {
"url": "https://erp-testops-dev.infra.altegio.cloud/api/v1/company/16363180/timetable/schedule?dates%5B%5D=2026-09-01&dates%5B%5D=2026-09-02&dates%5B%5D=2026-09-03&dates%5B%5D=2026-09-04&dates%5B%5D=2026-09-05&dates%5B%5D=2026-09-06&dates%5B%5D=2026-09-07&dates%5B%5D=2026-09-08&dates%5B%5D=2026-09-09&dates%5B%5D=2026-09-10&dates%5B%5D=2026-09-11&dates%5B%5D=2026-09-12&dates%5B%5D=2026-09-13&dates%5B%5D=2026-09-14&dates%5B%5D=2026-09-15&dates%5B%5D=2026-09-16&dates%5B%5D=2026-09-17&dates%5B%5D=2026-09-18&dates%5B%5D=2026-09-19&dates%5B%5D=2026-09-20&dates%5B%5D=2026-09-21&dates%5B%5D=2026-09-22&dates%5B%5D=2026-09-23&dates%5B%5D=2026-09-24&dates%5B%5D=2026-09-25&dates%5B%5D=2026-09-26&dates%5B%5D=2026-09-27&dates%5B%5D=2026-09-28&dates%5B%5D=2026-09-29&dates%5B%5D=2026-09-30&dates%5B%5D=2026-10-01&dates%5B%5D=2026-10-02&dates%5B%5D=2026-10-03&dates%5B%5D=2026-10-04&dates%5B%5D=2026-10-05&dates%5B%5D=2026-10-06&dates%5B%5D=2026-10-07&dates%5B%5D=2026-10-08&dates%5B%5D=2026-10-09&dates%5B%5D=2026-10-10&dates%5B%5D=2026-10-11&dates%5B%5D=2026-10-12&dates%5B%5D=2026-10-13&dates%5B%5D=2026-10-14&dates%5B%5D=2026-10-15&dates%5B%5D=2026-10-16&dates%5B%5D=2026-10-17&dates%5B%5D=2026-10-18&dates%5B%5D=2026-10-19&dates%5B%5D=2026-10-20&dates%5B%5D=2026-10-21&dates%5B%5D=... [truncated]
Stacktrace:
lib/apps_pw/yclients/biz/erp/web/components/menu.py:214 in click_menu
lib/apps_pw/yclients/biz/erp/web/components/menu.py:228 in _click_menu
lib/apps_pw/yclients/biz/erp/web/pages/user.py:464 in _ensure_administration_mode_for_legacy_menu
suite/yclients/client/booking/web/cancel_with_membership/test_client_account_pw.py:158 in test_account_late_cancel_no_show_parity
lib/apps_pw/yclients/biz/erp/web/components/menu.py:216 in click_menu
Seen in: - altegio/biz.erp#227735 — shard 4 — launch 171549 (×1, last 2026-10-02 06:23 MSK)