Skip to content

#22571 По умолч. Групповая. Нет расписания

test_activities_no_schedule

Failures in last 30 days: 6

Generated at 2026-10-08 03:48 MSK

Last failure: 2026-10-01 00:53 MSK

Filter: pipelines with sandbox_biz_erp ∈ {master, testops-dev} AND autotests_branch ∈ {master, main} only (testops-dev — daytime ticks since 2026-08-05).

By exception class: - WebDriverException — 3 - AssertionError — 3

Failure signatures (grouped by exception + full message):

AssertionError — 3 occurrence(s) across 1 pipeline(s)

AssertionError: На календаре отображается не текущий месяц
Expected: 'October'
     but: was 'September'

Stacktrace:

suite/yclients/client/booking/web/online_booking/activity/test_activity.py:678 in test_activities_no_schedule
lib/utils/hamcrest/__init__.py:20 in assert_that
lib/utils/hamcrest/__init__.py:35 in _assert_match

Seen in: - altegio/client.booking#227407 — shard 6 — launch 170831 (×3, last 2026-10-01 00:53 MSK)

WebDriverException — 1 occurrence(s) across 1 pipeline(s)

selenium.common.exceptions.WebDriverException: Message: <unknown>: Failed to read the 'localStorage' property from 'Window': Access is denied for this document.
  (Session info: headless chrome=119.0.6045.199)
Stacktrace:
#0 0x55b59142b5e3 <unknown>
#1 0x55b5910ee0b7 <unknown>
#2 0x55b5910f42b5 <unknown>
#3 0x55b5910f69b1 <unknown>
#4 0x55b59117f71f <unknown>
#5 0x55b591162ef2 <unknown>
#6 0x55b59117eb3d <unknown>
#7 0x55b591162cc3 <unknown>
#8 0x55b59112e0e4 <unknown>
#9 0x55b59112f0ae <unknown>
#10 0x55b5913f1ce1 <unknown>
#11 0x55b5913f5b7e <unknown>
#12 0x55b5913df4b5 <unknown>
#13 0x55b5913f67d6 <unknown>
#14 0x55b5913c2dbf <unknown>
#15 0x55b591419748 <unknown>
#16 0x55b591419917 <unknown>
#17 0x55b59142a773 <unknown>
#18 0x7f0e2f0b6aa4 <unknown>
#19 0x7f0e2f143a64 __clone

Stacktrace:

lib/common/ui/pages/web.py:61 in decorated
lib/apps/yclients/client/booking/web/pages/__init__.py:80 in open
lib/common/ui/pages/web.py:61 in decorated
lib/apps/yclients/client/booking/web/pages/__init__.py:41 in set_environment
lib/ui/selenium/webdriver/__init__.py:52 in execute_script

Seen in: - altegio/client.booking#224668 — shard 6 — launch 165208 (×1, last 2026-09-21 08:16 MSK)

WebDriverException — 1 occurrence(s) across 1 pipeline(s)

selenium.common.exceptions.WebDriverException: Message: <unknown>: Failed to read the 'localStorage' property from 'Window': Access is denied for this document.
  (Session info: headless chrome=119.0.6045.199)
Stacktrace:
#0 0x55c5160d55e3 <unknown>
#1 0x55c515d980b7 <unknown>
#2 0x55c515d9e2b5 <unknown>
#3 0x55c515da09b1 <unknown>
#4 0x55c515e2971f <unknown>
#5 0x55c515e0cef2 <unknown>
#6 0x55c515e28b3d <unknown>
#7 0x55c515e0ccc3 <unknown>
#8 0x55c515dd80e4 <unknown>
#9 0x55c515dd90ae <unknown>
#10 0x55c51609bce1 <unknown>
#11 0x55c51609fb7e <unknown>
#12 0x55c5160894b5 <unknown>
#13 0x55c5160a07d6 <unknown>
#14 0x55c51606cdbf <unknown>
#15 0x55c5160c3748 <unknown>
#16 0x55c5160c3917 <unknown>
#17 0x55c5160d4773 <unknown>
#18 0x7f5c2e8caaa4 <unknown>
#19 0x7f5c2e957a64 __clone

Stacktrace:

lib/common/ui/pages/web.py:61 in decorated
lib/apps/yclients/client/booking/web/pages/__init__.py:80 in open
lib/common/ui/pages/web.py:61 in decorated
lib/apps/yclients/client/booking/web/pages/__init__.py:41 in set_environment
lib/ui/selenium/webdriver/__init__.py:52 in execute_script

Seen in: - altegio/client.booking#224668 — shard 6 — launch 165208 (×1, last 2026-09-21 08:16 MSK)

WebDriverException — 1 occurrence(s) across 1 pipeline(s)

selenium.common.exceptions.WebDriverException: Message: <unknown>: Failed to read the 'localStorage' property from 'Window': Access is denied for this document.
  (Session info: headless chrome=119.0.6045.199)
Stacktrace:
#0 0x5595b6b835e3 <unknown>
#1 0x5595b68460b7 <unknown>
#2 0x5595b684c2b5 <unknown>
#3 0x5595b684e9b1 <unknown>
#4 0x5595b68d771f <unknown>
#5 0x5595b68baef2 <unknown>
#6 0x5595b68d6b3d <unknown>
#7 0x5595b68bacc3 <unknown>
#8 0x5595b68860e4 <unknown>
#9 0x5595b68870ae <unknown>
#10 0x5595b6b49ce1 <unknown>
#11 0x5595b6b4db7e <unknown>
#12 0x5595b6b374b5 <unknown>
#13 0x5595b6b4e7d6 <unknown>
#14 0x5595b6b1adbf <unknown>
#15 0x5595b6b71748 <unknown>
#16 0x5595b6b71917 <unknown>
#17 0x5595b6b82773 <unknown>
#18 0x7ff40f83caa4 <unknown>
#19 0x7ff40f8c9a64 __clone

Stacktrace:

lib/common/ui/pages/web.py:61 in decorated
lib/apps/yclients/client/booking/web/pages/__init__.py:80 in open
lib/common/ui/pages/web.py:61 in decorated
lib/apps/yclients/client/booking/web/pages/__init__.py:41 in set_environment
lib/ui/selenium/webdriver/__init__.py:52 in execute_script

Seen in: - altegio/client.booking#224668 — shard 6 — launch 165208 (×1, last 2026-09-21 08:16 MSK)