#19184 Перенос группового события (перетягиванием в журнале) -¶
этот же ресурс - время занято другой записью
test_activity_drag_n_drop_same_resource_on_busy_time
Failures in last 30 days: 15
Generated at 2026-10-08 03:53 MSK
Last failure: 2026-10-07 03:40 MSK
Filter: pipelines with sandbox_biz_erp ∈ {master, testops-dev} AND autotests_branch ∈ {master, main} only (testops-dev — daytime ticks since 2026-08-05).
By exception class:
- SigninRedirectMissingError — 10
- AssertionError — 4
- TimeoutError — 1
Failure signatures (grouped by exception + full message):
AssertionError — 1 occurrence(s) across 1 pipeline(s)¶
AssertionError: Drag не стартовал за 3 попытки: не дождались seam: record_id=None ts=1789563600 length=None resource=+None/-None master=None; попытки: ['#1: drop не отправил сохранение', '#2: drop не отправил сохранение', '#3: drop не отправил сохранение']; боксы: [{'timestamp': '1789563600', 'length': '3600', 'resource-instances': '980603', 'master-id': '15976458'}]; seam-состояние: None
Stacktrace:
suite/yclients/biz/erp/web/activities/test_manage_activities_pw.py:3028 in test_activity_drag_n_drop_same_resource_on_busy_time
lib/apps_pw/yclients/biz/erp/web/pages/__init__.py:76 in decorated
lib/apps_pw/yclients/biz/erp/web/pages/timetable.py:1851 in move_activity
lib/apps_pw/yclients/biz/erp/web/pages/timetable.py:2278 in _drag_box_to_slot
Seen in: - altegio/biz.erp#223888 — shard 4 — launch 163153 (×1, last 2026-09-16 11:49 MSK)
AssertionError — 1 occurrence(s) across 1 pipeline(s)¶
AssertionError: Drag не стартовал за 3 попытки: не дождались seam: record_id=None ts=1790691300 length=None resource=+None/-None master=None; попытки: ['#1: drop не отправил сохранение', '#2: drop не отправил сохранение', '#3: drop не отправил сохранение']; боксы: [{'timestamp': '1790691300', 'length': '3600', 'resource-instances': '990336', 'master-id': '16042400'}]; seam-состояние: None
Stacktrace:
suite/yclients/biz/erp/web/activities/test_manage_activities_pw.py:3028 in test_activity_drag_n_drop_same_resource_on_busy_time
lib/apps_pw/yclients/biz/erp/web/pages/__init__.py:77 in decorated
lib/apps_pw/yclients/biz/erp/web/pages/timetable.py:1947 in move_activity
lib/apps_pw/yclients/biz/erp/web/pages/timetable.py:2374 in _drag_box_to_slot
Seen in: - altegio/biz.erp#226954 — shard 1 — launch 170045 (×1, last 2026-09-29 18:38 MSK)
AssertionError — 1 occurrence(s) across 1 pipeline(s)¶
AssertionError: Drag не стартовал за 3 попытки: не дождались seam: record_id=None ts=1791126900 length=None resource=+None/-None master=None; попытки: ['#1: drop не отправил сохранение', '#2: drop не отправил сохранение', '#3: drop не отправил сохранение']; боксы: [{'timestamp': '1791126900', 'length': '3600', 'resource-instances': '1017013', 'master-id': '16362908'}]; seam-состояние: None
Stacktrace:
suite/yclients/biz/erp/web/activities/test_manage_activities_pw.py:3028 in test_activity_drag_n_drop_same_resource_on_busy_time
lib/apps_pw/yclients/biz/erp/web/pages/__init__.py:77 in decorated
lib/apps_pw/yclients/biz/erp/web/pages/timetable.py:1947 in move_activity
lib/apps_pw/yclients/biz/erp/web/pages/timetable.py:2374 in _drag_box_to_slot
Seen in: - altegio/biz.erp#228170 — shard 3 — launch 172433 (×1, last 2026-10-04 05:36 MSK)
AssertionError — 1 occurrence(s) across 1 pipeline(s)¶
AssertionError: Drag не стартовал за 3 попытки: не дождались seam: record_id=None ts=1791367200 length=None resource=+None/-None master=None; попытки: ['#1: drop не отправил сохранение', '#2: drop не отправил сохранение', '#3: drop не отправил сохранение']; боксы: [{'timestamp': '1791367200', 'length': '3600', 'resource-instances': '1019830', 'master-id': '16391910'}]; seam-состояние: None
Stacktrace:
suite/yclients/biz/erp/web/activities/test_manage_activities_pw.py:3028 in test_activity_drag_n_drop_same_resource_on_busy_time
lib/apps_pw/yclients/biz/erp/web/pages/__init__.py:77 in decorated
lib/apps_pw/yclients/biz/erp/web/pages/timetable.py:1947 in move_activity
lib/apps_pw/yclients/biz/erp/web/pages/timetable.py:2374 in _drag_box_to_slot
Seen in: - altegio/biz.erp#229084 — shard 5 — launch 173671 (×1, last 2026-10-07 03:40 MSK)
SigninRedirectMissingError — 1 occurrence(s) across 1 pipeline(s)¶
autotests.lib.exception.SigninRedirectMissingError: login-XHR завершился со статусом 200, но редиректа со /signin/ не случилось за 30 с — подозрение на фронт biz.erp
--- причина (playwright) ---
Timeout 30000ms exceeded.
=========================== logs ===========================
waiting for navigation to "<function ImplToApiMapping.wrap_handler.<locals>.wrapper_func at 0x7f9fc265f100>" until 'commit'
navigated to "https://erp-testops-dev.infra.altegio.cloud/signin/"
navigated to "https://erp-testops-dev.infra.altegio.cloud/signin/"
navigated to "https://erp-testops-dev.infra.altegio.cloud/signin/JTJGdGltZXRhYmxlJTJGMTYzNTczODklMkY="
navigated to "https://erp-testops-dev.infra.altegio.cloud/signin/JTJGdGltZXRhYmxlJTJGMTYzNTczODklMkY="
navigated to "https://erp-testops-dev.infra.altegio.cloud/signin/JTJGdGltZXRhYmxlJTJGMTYzNTczODklMkY="
============================================================
Stacktrace:
suite/yclients/biz/erp/web/activities/test_manage_activities_pw.py:3014 in test_activity_drag_n_drop_same_resource_on_busy_time
lib/apps_pw/yclients/biz/erp/web/pages/guest/signin.py:115 in sign_in
Seen in: - altegio/biz.erp#227722 — shard 6 — launch 171516 (×1, last 2026-10-02 04:26 MSK)
SigninRedirectMissingError — 1 occurrence(s) across 1 pipeline(s)¶
autotests.lib.exception.SigninRedirectMissingError: login-XHR завершился со статусом 200, но редиректа со /signin/ не случилось за 30 с — подозрение на фронт biz.erp
--- причина (playwright) ---
Timeout 30000ms exceeded.
=========================== logs ===========================
waiting for navigation to "<function ImplToApiMapping.wrap_handler.<locals>.wrapper_func at 0x7fb76c93be20>" until 'commit'
navigated to "https://erp-testops-dev.infra.altegio.cloud/signin/"
navigated to "https://erp-testops-dev.infra.altegio.cloud/signin/"
navigated to "https://erp-testops-dev.infra.altegio.cloud/signin/JTJGdGltZXRhYmxlJTJGMTYzNjAyOTklMkY="
navigated to "https://erp-testops-dev.infra.altegio.cloud/signin/JTJGdGltZXRhYmxlJTJGMTYzNjAyOTklMkY="
navigated to "https://erp-testops-dev.infra.altegio.cloud/signin/JTJGdGltZXRhYmxlJTJGMTYzNjAyOTklMkY="
============================================================
Stacktrace:
suite/yclients/biz/erp/web/activities/test_manage_activities_pw.py:3014 in test_activity_drag_n_drop_same_resource_on_busy_time
lib/apps_pw/yclients/biz/erp/web/pages/guest/signin.py:115 in sign_in
Seen in: - altegio/biz.erp#227722 — shard 6 — launch 171516 (×1, last 2026-10-02 04:26 MSK)
SigninRedirectMissingError — 1 occurrence(s) across 1 pipeline(s)¶
autotests.lib.exception.SigninRedirectMissingError: login-XHR завершился со статусом 200, но редиректа со /signin/ не случилось за 30 с — подозрение на фронт biz.erp
--- причина (playwright) ---
Timeout 30000ms exceeded.
=========================== logs ===========================
waiting for navigation to "<function ImplToApiMapping.wrap_handler.<locals>.wrapper_func at 0x7f4db2bb8b80>" until 'commit'
navigated to "https://erp-testops-dev.infra.altegio.cloud/signin/"
navigated to "https://erp-testops-dev.infra.altegio.cloud/signin/"
navigated to "https://erp-testops-dev.infra.altegio.cloud/signin/JTJGdGltZXRhYmxlJTJGMTYzNjIyODMlMkY="
navigated to "https://erp-testops-dev.infra.altegio.cloud/signin/JTJGdGltZXRhYmxlJTJGMTYzNjIyODMlMkY="
navigated to "https://erp-testops-dev.infra.altegio.cloud/signin/JTJGdGltZXRhYmxlJTJGMTYzNjIyODMlMkY="
============================================================
Stacktrace:
suite/yclients/biz/erp/web/activities/test_manage_activities_pw.py:3014 in test_activity_drag_n_drop_same_resource_on_busy_time
lib/apps_pw/yclients/biz/erp/web/pages/guest/signin.py:115 in sign_in
Seen in: - altegio/biz.erp#227735 — shard 3 — launch 171549 (×1, last 2026-10-02 06:23 MSK)
SigninRedirectMissingError — 1 occurrence(s) across 1 pipeline(s)¶
autotests.lib.exception.SigninRedirectMissingError: login-XHR завершился со статусом 200, но редиректа со /signin/ не случилось за 30 с — подозрение на фронт biz.erp
--- причина (playwright) ---
Timeout 30000ms exceeded.
=========================== logs ===========================
waiting for navigation to "<function ImplToApiMapping.wrap_handler.<locals>.wrapper_func at 0x7fa1d4a3a020>" until 'commit'
navigated to "https://erp-testops-dev.infra.altegio.cloud/signin/"
navigated to "https://erp-testops-dev.infra.altegio.cloud/signin/"
navigated to "https://erp-testops-dev.infra.altegio.cloud/signin/JTJGdGltZXRhYmxlJTJGMTYzNjM3NDIlMkY="
navigated to "https://erp-testops-dev.infra.altegio.cloud/signin/JTJGdGltZXRhYmxlJTJGMTYzNjM3NDIlMkY="
navigated to "https://erp-testops-dev.infra.altegio.cloud/signin/JTJGdGltZXRhYmxlJTJGMTYzNjM3NDIlMkY="
============================================================
Stacktrace:
suite/yclients/biz/erp/web/activities/test_manage_activities_pw.py:3014 in test_activity_drag_n_drop_same_resource_on_busy_time
lib/apps_pw/yclients/biz/erp/web/pages/guest/signin.py:115 in sign_in
Seen in: - altegio/biz.erp#227735 — shard 3 — launch 171549 (×1, last 2026-10-02 06:23 MSK)
SigninRedirectMissingError — 1 occurrence(s) across 1 pipeline(s)¶
autotests.lib.exception.SigninRedirectMissingError: login-XHR завершился со статусом 200, но редиректа со /signin/ не случилось за 30 с — подозрение на фронт biz.erp
--- причина (playwright) ---
Timeout 30000ms exceeded.
=========================== logs ===========================
waiting for navigation to "<function ImplToApiMapping.wrap_handler.<locals>.wrapper_func at 0x7f95e0445120>" until 'commit'
navigated to "https://erp-testops-dev.infra.altegio.cloud/signin/"
navigated to "https://erp-testops-dev.infra.altegio.cloud/signin/"
navigated to "https://erp-testops-dev.infra.altegio.cloud/signin/JTJGdGltZXRhYmxlJTJGMTYzNjQ4NjUlMkY="
navigated to "https://erp-testops-dev.infra.altegio.cloud/signin/JTJGdGltZXRhYmxlJTJGMTYzNjQ4NjUlMkY="
navigated to "https://erp-testops-dev.infra.altegio.cloud/signin/JTJGdGltZXRhYmxlJTJGMTYzNjQ4NjUlMkY="
============================================================
Stacktrace:
suite/yclients/biz/erp/web/activities/test_manage_activities_pw.py:3014 in test_activity_drag_n_drop_same_resource_on_busy_time
lib/apps_pw/yclients/biz/erp/web/pages/guest/signin.py:115 in sign_in
Seen in: - altegio/biz.erp#227735 — shard 3 — launch 171549 (×1, last 2026-10-02 06:23 MSK)
SigninRedirectMissingError — 1 occurrence(s) across 1 pipeline(s)¶
autotests.lib.exception.SigninRedirectMissingError: login-XHR завершился со статусом 200, но редиректа со /signin/ не случилось за 30 с — подозрение на фронт biz.erp
--- причина (playwright) ---
Timeout 30000ms exceeded.
=========================== logs ===========================
waiting for navigation to "<function ImplToApiMapping.wrap_handler.<locals>.wrapper_func at 0x7f4a2f6560c0>" until 'commit'
navigated to "https://erp-testops-dev.infra.altegio.cloud/signin/"
navigated to "https://erp-testops-dev.infra.altegio.cloud/signin/"
navigated to "https://erp-testops-dev.infra.altegio.cloud/signin/JTJGdGltZXRhYmxlJTJGMTYzNjU4OTMlMkY="
navigated to "https://erp-testops-dev.infra.altegio.cloud/signin/JTJGdGltZXRhYmxlJTJGMTYzNjU4OTMlMkY="
navigated to "https://erp-testops-dev.infra.altegio.cloud/signin/JTJGdGltZXRhYmxlJTJGMTYzNjU4OTMlMkY="
============================================================
Stacktrace:
suite/yclients/biz/erp/web/activities/test_manage_activities_pw.py:3014 in test_activity_drag_n_drop_same_resource_on_busy_time
lib/apps_pw/yclients/biz/erp/web/pages/guest/signin.py:115 in sign_in
Seen in: - altegio/biz.erp#227749 — shard 8 — launch 171616 (×1, last 2026-10-02 08:20 MSK)
SigninRedirectMissingError — 1 occurrence(s) across 1 pipeline(s)¶
autotests.lib.exception.SigninRedirectMissingError: login-XHR завершился со статусом 200, но редиректа со /signin/ не случилось за 30 с — подозрение на фронт biz.erp
--- причина (playwright) ---
Timeout 30000ms exceeded.
=========================== logs ===========================
waiting for navigation to "<function ImplToApiMapping.wrap_handler.<locals>.wrapper_func at 0x7f3d85c24cc0>" until 'commit'
navigated to "https://erp-testops-dev.infra.altegio.cloud/signin/"
navigated to "https://erp-testops-dev.infra.altegio.cloud/signin/"
navigated to "https://erp-testops-dev.infra.altegio.cloud/signin/JTJGdGltZXRhYmxlJTJGMTYzNjc2MzclMkY="
navigated to "https://erp-testops-dev.infra.altegio.cloud/signin/JTJGdGltZXRhYmxlJTJGMTYzNjc2MzclMkY="
navigated to "https://erp-testops-dev.infra.altegio.cloud/signin/JTJGdGltZXRhYmxlJTJGMTYzNjc2MzclMkY="
============================================================
Stacktrace:
suite/yclients/biz/erp/web/activities/test_manage_activities_pw.py:3014 in test_activity_drag_n_drop_same_resource_on_busy_time
lib/apps_pw/yclients/biz/erp/web/pages/guest/signin.py:115 in sign_in
Seen in: - altegio/biz.erp#227749 — shard 8 — launch 171616 (×1, last 2026-10-02 08:20 MSK)
SigninRedirectMissingError — 1 occurrence(s) across 1 pipeline(s)¶
autotests.lib.exception.SigninRedirectMissingError: login-XHR завершился со статусом 200, но редиректа со /signin/ не случилось за 30 с — подозрение на фронт biz.erp
--- причина (playwright) ---
Timeout 30000ms exceeded.
=========================== logs ===========================
waiting for navigation to "<function ImplToApiMapping.wrap_handler.<locals>.wrapper_func at 0x7fb930242480>" until 'commit'
navigated to "https://erp-testops-dev.infra.altegio.cloud/signin/"
navigated to "https://erp-testops-dev.infra.altegio.cloud/signin/"
navigated to "https://erp-testops-dev.infra.altegio.cloud/signin/JTJGdGltZXRhYmxlJTJGMTYzNjg3NzQlMkY="
navigated to "https://erp-testops-dev.infra.altegio.cloud/signin/JTJGdGltZXRhYmxlJTJGMTYzNjg3NzQlMkY="
navigated to "https://erp-testops-dev.infra.altegio.cloud/signin/JTJGdGltZXRhYmxlJTJGMTYzNjg3NzQlMkY="
============================================================
Stacktrace:
suite/yclients/biz/erp/web/activities/test_manage_activities_pw.py:3014 in test_activity_drag_n_drop_same_resource_on_busy_time
lib/apps_pw/yclients/biz/erp/web/pages/guest/signin.py:115 in sign_in
Seen in: - altegio/biz.erp#227749 — shard 8 — launch 171616 (×1, last 2026-10-02 08:20 MSK)
SigninRedirectMissingError — 1 occurrence(s) across 1 pipeline(s)¶
autotests.lib.exception.SigninRedirectMissingError: login-XHR завершился со статусом 200, но редиректа со /signin/ не случилось за 30 с — подозрение на фронт biz.erp
--- причина (playwright) ---
Timeout 30000ms exceeded.
=========================== logs ===========================
waiting for navigation to "<function ImplToApiMapping.wrap_handler.<locals>.wrapper_func at 0x7f2a7b214fe0>" until 'commit'
navigated to "https://erp-testops-dev.infra.altegio.cloud/signin/"
navigated to "https://erp-testops-dev.infra.altegio.cloud/signin/"
navigated to "https://erp-testops-dev.infra.altegio.cloud/signin/JTJGdGltZXRhYmxlJTJGMTYzNjk0NDAlMkY="
navigated to "https://erp-testops-dev.infra.altegio.cloud/signin/JTJGdGltZXRhYmxlJTJGMTYzNjk0NDAlMkY="
navigated to "https://erp-testops-dev.infra.altegio.cloud/signin/JTJGdGltZXRhYmxlJTJGMTYzNjk0NDAlMkY="
============================================================
Stacktrace:
suite/yclients/biz/erp/web/activities/test_manage_activities_pw.py:3014 in test_activity_drag_n_drop_same_resource_on_busy_time
lib/apps_pw/yclients/biz/erp/web/pages/guest/signin.py:115 in sign_in
Seen in: - altegio/biz.erp#227787 — shard 6 — launch 171752 (×1, last 2026-10-02 11:50 MSK)
SigninRedirectMissingError — 1 occurrence(s) across 1 pipeline(s)¶
autotests.lib.exception.SigninRedirectMissingError: login-XHR завершился со статусом 200, но редиректа со /signin/ не случилось за 30 с — подозрение на фронт biz.erp
--- причина (playwright) ---
Timeout 30000ms exceeded.
=========================== logs ===========================
waiting for navigation to "<function ImplToApiMapping.wrap_handler.<locals>.wrapper_func at 0x7f42041616c0>" until 'commit'
navigated to "https://erp-testops-dev.infra.altegio.cloud/signin/"
navigated to "https://erp-testops-dev.infra.altegio.cloud/signin/"
navigated to "https://erp-testops-dev.infra.altegio.cloud/signin/JTJGdGltZXRhYmxlJTJGMTYzNzEyNTklMkY="
navigated to "https://erp-testops-dev.infra.altegio.cloud/signin/JTJGdGltZXRhYmxlJTJGMTYzNzEyNTklMkY="
navigated to "https://erp-testops-dev.infra.altegio.cloud/signin/JTJGdGltZXRhYmxlJTJGMTYzNzEyNTklMkY="
============================================================
Stacktrace:
suite/yclients/biz/erp/web/activities/test_manage_activities_pw.py:3014 in test_activity_drag_n_drop_same_resource_on_busy_time
lib/apps_pw/yclients/biz/erp/web/pages/guest/signin.py:115 in sign_in
Seen in: - altegio/biz.erp#227787 — shard 6 — launch 171752 (×1, last 2026-10-02 11:50 MSK)
TimeoutError — 1 occurrence(s) across 1 pipeline(s)¶
playwright._impl._errors.TimeoutError: Locator.click: Timeout 30000ms exceeded.
Call log:
- waiting for locator("div#calendar-block").locator("td[data-handler=\"selectDay\"]:not([class*=\"ui-datepicker-other-month\"])").filter(has=locator("[class*=\"ui-datepicker-day-text\"]").filter(has_text=re.compile(r"^\s*2\s*$"))).first.locator("a")
- locator resolved to <a href="#" class="ui-state-default ui-state-highlight ui-state-active">…</a>
- attempting click action
2 × waiting for element to be visible, enabled and stable
- element is visible, enabled and stable
- scrolling into view if needed
- done scrolling
- <a target="_self" class="yc-link yc-link_light" href="https://erp-testops-dev.infra.altegio.cloud/timetable/16359158/#mode=1">Reload this Page</a> from <div class="v-error-modal v-error-modal--unauthorized v-error-modal__fade-enter-active v-error-modal__fade-enter-to">…</div> subtree intercepts pointer events
- retrying click action
- waiting 20ms
- waiting for element to be visible, enabled and stable
- element is visible, enabled and stable
- scrolling into view if needed
- done scrolling
- <a target="_self" class="yc-link yc-link_light" href="https://erp-testops-dev.infra.altegio.cloud/timetable/16359158/#mode=1">Reload this Page</a> from <div class="v-error-modal v-error-modal--unauthorized v-error-modal__fade-enter-active v-error-modal__fade-enter-to">…</div> subtree intercepts pointer events
2 × retrying click action
- waiting 100ms
- waiting for element to be visible, enabled and stable
- element is visible, enabled and stable
- scrolling into view if needed
- done scrolling
- <div class="v-error-modal v-error-modal--unauthorized">…</div> intercepts pointer events
13 × retrying click action
- waiting 500ms
- waiting for element to be visible, enabled and stable
- element is visible, enabled and stable
- scrolling into view if needed
- done scrolling
- <a target="_self" class="yc-link yc-link_light" href="https://erp-testops-dev.infra.altegio.cloud/timetable/16359158/#mode=1">Reload this Page</a> from <div class="v-error-modal v-error-modal--unauthorized">…</div> subtree intercepts pointer events
- retrying click action
- waiting 500ms
- waiting for element to be visible, enabled and stable
- element is visible, enabled and stable
- scrolling into view if needed
- done scrolling
- <a target="_self" class="yc-link yc-link_light" href="https://erp-testops-dev.infra.altegio.cloud/timetable/16359158/#mode=1">Reload this Page</a> from <div class="v-error-modal v-error-modal--unauthorized">…</div> subtree intercepts pointer events
- retrying click action
- waiting 500ms
- waiting for element to be visible, enabled and stable
- element is visible, enabled and stable
- scrolling into view if needed
- done scrolling
- <div class="v-error-modal v-error-modal--unauthorized">…</div> intercepts pointer events
- retrying click action
- waiting 500ms
- waiting for element to be visible, enabled and stable
- element is visible, enabled and stable
- scrolling into view if needed
- done scrolling
- <div class="v-error-modal v-error-modal--unauthorized">…</div> intercepts pointer events
2 × retrying click action
- waiting 500ms
- waiting for element to be visible, enabled and stable
- element is visible, enabled and stable
- scrolling into view if needed
- done scrolling
- <a target="_self" class="yc-link yc-link_light" href="https://erp-testops-dev.infra.altegio.cloud/timetable/16359158/#mode=1">Reload this Page</a> from <div class="v-error-modal v-error-modal--unauthorized">…</div> subtree intercepts pointer events
- retrying click action
- waiting 500ms
- waiting for element to be visible, enabled and st... [truncated]
Stacktrace:
suite/yclients/biz/erp/web/activities/test_manage_activities_pw.py:3021 in test_activity_drag_n_drop_same_resource_on_busy_time
lib/apps_pw/yclients/biz/erp/web/pages/__init__.py:77 in decorated
lib/apps_pw/yclients/biz/erp/web/pages/user.py:497 in open_timetable
lib/apps_pw/yclients/biz/erp/web/pages/user.py:635 in _set_calendar_date
lib/apps_pw/yclients/biz/erp/web/pages/user.py:621 in _navigate_and_click
Seen in: - altegio/biz.erp#227722 — shard 6 — launch 171516 (×1, last 2026-10-02 04:26 MSK)