#22643 Групповая запись. Экран события. Отображение элементов события¶
test_activity_screen_activity_elements
Failures in last 30 days: 8
Generated at 2026-10-08 03:53 MSK
Last failure: 2026-09-11 05:42 MSK
Filter: pipelines with sandbox_biz_erp ∈ {master, testops-dev} AND autotests_branch ∈ {master, main} only (testops-dev — daytime ticks since 2026-08-05).
By exception class:
- AssertionError — 8
Failure signatures (grouped by exception + full message):
AssertionError — 8 occurrence(s) across 6 pipeline(s)¶
AssertionError: Не отображается изображение услуги
Expected: <True>
but: was <False>
Stacktrace:
suite/yclients/client/booking/web/online_booking/activity/test_activity.py:258 in test_activity_screen_activity_elements
lib/utils/hamcrest/__init__.py:20 in assert_that
lib/utils/hamcrest/__init__.py:35 in _assert_match
Seen in: - altegio/biz.erp#222941 — shard 3 — launch 161116 (×1, last 2026-09-11 05:42 MSK) - altegio/biz.erp#222818 — shard 5 — launch 160944 (×3, last 2026-09-10 17:37 MSK) - altegio/biz.erp#222788 — shard 6 — launch 160801 (×1, last 2026-09-10 15:24 MSK) - altegio/biz.erp#222716 — shard 1 — launch 160569 (×1, last 2026-09-10 11:23 MSK) - altegio/biz.erp#222617 — shard 7 — launch 160048 (×1, last 2026-09-09 17:22 MSK) - altegio/biz.erp#222480 — shard 7 — launch 159497 (×1, last 2026-09-09 03:45 MSK)