Skip to content

Создание товара

test_add_good

Failures in last 30 days: 27

Generated at 2026-10-08 03:48 MSK

Last failure: 2026-10-08 03:42 MSK

Filter: pipelines with sandbox_biz_erp ∈ {master, testops-dev} AND autotests_branch ∈ {master, main} only (testops-dev — daytime ticks since 2026-08-05).

By exception class: - TimeoutError — 18 - SigninRedirectMissingError — 9

Failure signatures (grouped by exception + full message):

TimeoutError — 8 occurrence(s) across 7 pipeline(s)

playwright._impl._errors.TimeoutError: Locator.select_option: Timeout 30000ms exceeded.
Call log:
  - waiting for locator("select[name=\"service_unit_id\"]")
    - locator resolved to <select class="form-control" name="service_unit_id" data-placeholder="Select">…</select>
  - attempting select option action
    2 × waiting for element to be visible and enabled
      - did not find some options
    - retrying select option action
    - waiting 20ms
    2 × waiting for element to be visible and enabled
      - did not find some options
    - retrying select option action
      - waiting 100ms
    60 × waiting for element to be visible and enabled
       - did not find some options
     - retrying select option action
       - waiting 500ms

Stacktrace:

suite/yclients/biz/erp/web/test_entities_pw.py:700 in test_add_good
lib/apps_pw/yclients/biz/erp/web/pages/__init__.py:76 in decorated
lib/apps_pw/yclients/biz/erp/web/pages/goods/edit.py:64 in fill_good_form

Seen in: - altegio/biz.erp#229362 — shard 8 — launch 174336 (×1, last 2026-10-08 03:42 MSK) - altegio/biz.erp#229212 — shard 4 — launch 174057 (×1, last 2026-10-07 15:27 MSK) - altegio/biz.erp#225894 — shard 8 — launch 167979 (×1, last 2026-09-25 15:46 MSK) - altegio/biz.erp#224550 — shard 1 — launch 165104 (×2, last 2026-09-20 07:41 MSK) - altegio/biz.erp#224332 — shard 5 — launch 164435 (×1, last 2026-09-18 11:22 MSK) - altegio/biz.erp#224262 — shard 2 — launch 164129 (×1, last 2026-09-17 19:52 MSK) - altegio/biz.erp#223184 — shard 5 — launch 161849 (×1, last 2026-09-13 05:41 MSK)

TimeoutError — 7 occurrence(s) across 7 pipeline(s)

playwright._impl._errors.TimeoutError: Locator.select_option: Timeout 30000ms exceeded.
Call log:
  - waiting for locator("select[name=\"sale_unit_id\"]")
    - locator resolved to <select name="sale_unit_id" class="form-control" data-placeholder="Select">…</select>
  - attempting select option action
    2 × waiting for element to be visible and enabled
      - did not find some options
    - retrying select option action
    - waiting 20ms
    2 × waiting for element to be visible and enabled
      - did not find some options
    - retrying select option action
      - waiting 100ms
    60 × waiting for element to be visible and enabled
       - did not find some options
     - retrying select option action
       - waiting 500ms

Stacktrace:

suite/yclients/biz/erp/web/test_entities_pw.py:700 in test_add_good
lib/apps_pw/yclients/biz/erp/web/pages/__init__.py:77 in decorated
lib/apps_pw/yclients/biz/erp/web/pages/goods/edit.py:58 in fill_good_form

Seen in: - altegio/biz.erp#229294 — shard 5 — launch 174222 (×1, last 2026-10-07 20:41 MSK) - altegio/biz.erp#228870 — shard 8 — launch 173558 (×1, last 2026-10-06 14:57 MSK) - altegio/biz.erp#228749 — shard 2 — launch 173406 (×1, last 2026-10-06 07:34 MSK) - altegio/biz.erp#226416 — shard 2 — launch 168644 (×1, last 2026-09-28 07:38 MSK) - altegio/biz.erp#226401 — shard 8 — launch 168544 (×1, last 2026-09-28 05:36 MSK) - altegio/biz.erp#225042 — shard 3 — launch 166380 (×1, last 2026-09-22 17:56 MSK) - altegio/biz.erp#224543 — shard 1 — launch 165071 (×1, last 2026-09-20 06:11 MSK)

SigninRedirectMissingError — 1 occurrence(s) across 1 pipeline(s)

autotests.lib.exception.SigninRedirectMissingError: login-XHR завершился со статусом 200, но редиректа со /signin/ не случилось за 30 с — подозрение на фронт biz.erp
--- причина (playwright) ---
Timeout 30000ms exceeded.
=========================== logs ===========================
waiting for navigation to "<function ImplToApiMapping.wrap_handler.<locals>.wrapper_func at 0x7efbe52cb4c0>" until 'commit'
  navigated to "https://erp-testops-dev.infra.altegio.cloud/signin/"
  navigated to "https://erp-testops-dev.infra.altegio.cloud/signin/"
  navigated to "https://erp-testops-dev.infra.altegio.cloud/signin/JTJGdGltZXRhYmxlJTJGMTYzNTY1NDMlMkY="
  navigated to "https://erp-testops-dev.infra.altegio.cloud/signin/JTJGdGltZXRhYmxlJTJGMTYzNTY1NDMlMkY="
  navigated to "https://erp-testops-dev.infra.altegio.cloud/signin/JTJGdGltZXRhYmxlJTJGMTYzNTY1NDMlMkY="
============================================================

Stacktrace:

suite/yclients/biz/erp/web/test_entities_pw.py:678 in test_add_good
lib/apps_pw/yclients/biz/erp/web/pages/guest/signin.py:115 in sign_in

Seen in: - altegio/biz.erp#227596 — shard 5 — launch 171280 (×1, last 2026-10-01 17:40 MSK)

SigninRedirectMissingError — 1 occurrence(s) across 1 pipeline(s)

autotests.lib.exception.SigninRedirectMissingError: login-XHR завершился со статусом 200, но редиректа со /signin/ не случилось за 30 с — подозрение на фронт biz.erp
--- причина (playwright) ---
Timeout 30000ms exceeded.
=========================== logs ===========================
waiting for navigation to "<function ImplToApiMapping.wrap_handler.<locals>.wrapper_func at 0x7f895f6cb4c0>" until 'commit'
  navigated to "https://erp-testops-dev.infra.altegio.cloud/signin/"
  navigated to "https://erp-testops-dev.infra.altegio.cloud/signin/"
  navigated to "https://erp-testops-dev.infra.altegio.cloud/signin/JTJGdGltZXRhYmxlJTJGMTYzNTY3ODclMkY="
  navigated to "https://erp-testops-dev.infra.altegio.cloud/signin/JTJGdGltZXRhYmxlJTJGMTYzNTY3ODclMkY="
  navigated to "https://erp-testops-dev.infra.altegio.cloud/signin/JTJGdGltZXRhYmxlJTJGMTYzNTY3ODclMkY="
============================================================

Stacktrace:

suite/yclients/biz/erp/web/test_entities_pw.py:678 in test_add_good
lib/apps_pw/yclients/biz/erp/web/pages/guest/signin.py:115 in sign_in

Seen in: - altegio/biz.erp#227596 — shard 5 — launch 171280 (×1, last 2026-10-01 17:40 MSK)

SigninRedirectMissingError — 1 occurrence(s) across 1 pipeline(s)

autotests.lib.exception.SigninRedirectMissingError: login-XHR завершился со статусом 200, но редиректа со /signin/ не случилось за 30 с — подозрение на фронт biz.erp
--- причина (playwright) ---
Timeout 30000ms exceeded.
=========================== logs ===========================
waiting for navigation to "<function ImplToApiMapping.wrap_handler.<locals>.wrapper_func at 0x7f3c2010b380>" until 'commit'
  navigated to "https://erp-testops-dev.infra.altegio.cloud/signin/"
  navigated to "https://erp-testops-dev.infra.altegio.cloud/signin/"
  navigated to "https://erp-testops-dev.infra.altegio.cloud/signin/JTJGdGltZXRhYmxlJTJGMTYzNTk1MDElMkY="
  navigated to "https://erp-testops-dev.infra.altegio.cloud/signin/JTJGdGltZXRhYmxlJTJGMTYzNTk1MDElMkY="
  navigated to "https://erp-testops-dev.infra.altegio.cloud/signin/JTJGdGltZXRhYmxlJTJGMTYzNTk1MDElMkY="
============================================================

Stacktrace:

suite/yclients/biz/erp/web/test_entities_pw.py:678 in test_add_good
lib/apps_pw/yclients/biz/erp/web/pages/guest/signin.py:115 in sign_in

Seen in: - altegio/biz.erp#227722 — shard 8 — launch 171516 (×1, last 2026-10-02 04:26 MSK)

SigninRedirectMissingError — 1 occurrence(s) across 1 pipeline(s)

autotests.lib.exception.SigninRedirectMissingError: login-XHR завершился со статусом 200, но редиректа со /signin/ не случилось за 30 с — подозрение на фронт biz.erp
--- причина (playwright) ---
Timeout 30000ms exceeded.
=========================== logs ===========================
waiting for navigation to "<function ImplToApiMapping.wrap_handler.<locals>.wrapper_func at 0x7f415b0e27a0>" until 'commit'
  navigated to "https://erp-testops-dev.infra.altegio.cloud/signin/"
  navigated to "https://erp-testops-dev.infra.altegio.cloud/signin/"
  navigated to "https://erp-testops-dev.infra.altegio.cloud/signin/JTJGdGltZXRhYmxlJTJGMTYzNjI3MzclMkY="
  navigated to "https://erp-testops-dev.infra.altegio.cloud/signin/JTJGdGltZXRhYmxlJTJGMTYzNjI3MzclMkY="
  navigated to "https://erp-testops-dev.infra.altegio.cloud/signin/JTJGdGltZXRhYmxlJTJGMTYzNjI3MzclMkY="
============================================================

Stacktrace:

suite/yclients/biz/erp/web/test_entities_pw.py:678 in test_add_good
lib/apps_pw/yclients/biz/erp/web/pages/guest/signin.py:115 in sign_in

Seen in: - altegio/biz.erp#227735 — shard 4 — launch 171549 (×1, last 2026-10-02 06:23 MSK)

SigninRedirectMissingError — 1 occurrence(s) across 1 pipeline(s)

autotests.lib.exception.SigninRedirectMissingError: login-XHR завершился со статусом 200, но редиректа со /signin/ не случилось за 30 с — подозрение на фронт biz.erp
--- причина (playwright) ---
Timeout 30000ms exceeded.
=========================== logs ===========================
waiting for navigation to "<function ImplToApiMapping.wrap_handler.<locals>.wrapper_func at 0x7fa1ad8489a0>" until 'commit'
  navigated to "https://erp-testops-dev.infra.altegio.cloud/signin/"
  navigated to "https://erp-testops-dev.infra.altegio.cloud/signin/"
  navigated to "https://erp-testops-dev.infra.altegio.cloud/signin/JTJGdGltZXRhYmxlJTJGMTYzNjM4OTElMkY="
  navigated to "https://erp-testops-dev.infra.altegio.cloud/signin/JTJGdGltZXRhYmxlJTJGMTYzNjM4OTElMkY="
  navigated to "https://erp-testops-dev.infra.altegio.cloud/signin/JTJGdGltZXRhYmxlJTJGMTYzNjM4OTElMkY="
============================================================

Stacktrace:

suite/yclients/biz/erp/web/test_entities_pw.py:678 in test_add_good
lib/apps_pw/yclients/biz/erp/web/pages/guest/signin.py:115 in sign_in

Seen in: - altegio/biz.erp#227735 — shard 4 — launch 171549 (×1, last 2026-10-02 06:23 MSK)

SigninRedirectMissingError — 1 occurrence(s) across 1 pipeline(s)

autotests.lib.exception.SigninRedirectMissingError: login-XHR завершился со статусом 200, но редиректа со /signin/ не случилось за 30 с — подозрение на фронт biz.erp
--- причина (playwright) ---
Timeout 30000ms exceeded.
=========================== logs ===========================
waiting for navigation to "<function ImplToApiMapping.wrap_handler.<locals>.wrapper_func at 0x7f8793e5b4c0>" until 'commit'
  navigated to "https://erp-testops-dev.infra.altegio.cloud/signin/"
  navigated to "https://erp-testops-dev.infra.altegio.cloud/signin/"
  navigated to "https://erp-testops-dev.infra.altegio.cloud/signin/JTJGdGltZXRhYmxlJTJGMTYzNjYzOTYlMkY="
  navigated to "https://erp-testops-dev.infra.altegio.cloud/signin/JTJGdGltZXRhYmxlJTJGMTYzNjYzOTYlMkY="
  navigated to "https://erp-testops-dev.infra.altegio.cloud/signin/JTJGdGltZXRhYmxlJTJGMTYzNjYzOTYlMkY="
============================================================

Stacktrace:

suite/yclients/biz/erp/web/test_entities_pw.py:678 in test_add_good
lib/apps_pw/yclients/biz/erp/web/pages/guest/signin.py:115 in sign_in

Seen in: - altegio/biz.erp#227749 — shard 4 — launch 171616 (×1, last 2026-10-02 08:20 MSK)

SigninRedirectMissingError — 1 occurrence(s) across 1 pipeline(s)

autotests.lib.exception.SigninRedirectMissingError: login-XHR завершился со статусом 200, но редиректа со /signin/ не случилось за 30 с — подозрение на фронт biz.erp
--- причина (playwright) ---
Timeout 30000ms exceeded.
=========================== logs ===========================
waiting for navigation to "<function ImplToApiMapping.wrap_handler.<locals>.wrapper_func at 0x7f49a22af1a0>" until 'commit'
  navigated to "https://erp-testops-dev.infra.altegio.cloud/signin/"
  navigated to "https://erp-testops-dev.infra.altegio.cloud/signin/"
  navigated to "https://erp-testops-dev.infra.altegio.cloud/signin/JTJGdGltZXRhYmxlJTJGMTYzNjc4NjElMkY="
  navigated to "https://erp-testops-dev.infra.altegio.cloud/signin/JTJGdGltZXRhYmxlJTJGMTYzNjc4NjElMkY="
  navigated to "https://erp-testops-dev.infra.altegio.cloud/signin/JTJGdGltZXRhYmxlJTJGMTYzNjc4NjElMkY="
============================================================

Stacktrace:

suite/yclients/biz/erp/web/test_entities_pw.py:678 in test_add_good
lib/apps_pw/yclients/biz/erp/web/pages/guest/signin.py:115 in sign_in

Seen in: - altegio/biz.erp#227749 — shard 4 — launch 171616 (×1, last 2026-10-02 08:20 MSK)

SigninRedirectMissingError — 1 occurrence(s) across 1 pipeline(s)

autotests.lib.exception.SigninRedirectMissingError: login-XHR завершился со статусом 200, но редиректа со /signin/ не случилось за 30 с — подозрение на фронт biz.erp
--- причина (playwright) ---
Timeout 30000ms exceeded.
=========================== logs ===========================
waiting for navigation to "<function ImplToApiMapping.wrap_handler.<locals>.wrapper_func at 0x7f71df15f1a0>" until 'commit'
  navigated to "https://erp-testops-dev.infra.altegio.cloud/signin/"
  navigated to "https://erp-testops-dev.infra.altegio.cloud/signin/"
  navigated to "https://erp-testops-dev.infra.altegio.cloud/signin/JTJGdGltZXRhYmxlJTJGMTYzNjg5NjQlMkY="
  navigated to "https://erp-testops-dev.infra.altegio.cloud/signin/JTJGdGltZXRhYmxlJTJGMTYzNjg5NjQlMkY="
  navigated to "https://erp-testops-dev.infra.altegio.cloud/signin/JTJGdGltZXRhYmxlJTJGMTYzNjg5NjQlMkY="
============================================================

Stacktrace:

suite/yclients/biz/erp/web/test_entities_pw.py:678 in test_add_good
lib/apps_pw/yclients/biz/erp/web/pages/guest/signin.py:115 in sign_in

Seen in: - altegio/biz.erp#227749 — shard 4 — launch 171616 (×1, last 2026-10-02 08:20 MSK)

SigninRedirectMissingError — 1 occurrence(s) across 1 pipeline(s)

autotests.lib.exception.SigninRedirectMissingError: login-XHR завершился со статусом 200, но редиректа со /signin/ не случилось за 30 с — подозрение на фронт biz.erp
--- причина (playwright) ---
Timeout 30000ms exceeded.
=========================== logs ===========================
waiting for navigation to "<function ImplToApiMapping.wrap_handler.<locals>.wrapper_func at 0x7f0cc8d45260>" until 'commit'
  navigated to "https://erp-testops-dev.infra.altegio.cloud/signin/"
  navigated to "https://erp-testops-dev.infra.altegio.cloud/signin/"
  navigated to "https://erp-testops-dev.infra.altegio.cloud/signin/JTJGdGltZXRhYmxlJTJGMTYzNjk4NzglMkY="
  navigated to "https://erp-testops-dev.infra.altegio.cloud/signin/JTJGdGltZXRhYmxlJTJGMTYzNjk4NzglMkY="
  navigated to "https://erp-testops-dev.infra.altegio.cloud/signin/JTJGdGltZXRhYmxlJTJGMTYzNjk4NzglMkY="
============================================================

Stacktrace:

suite/yclients/biz/erp/web/test_entities_pw.py:678 in test_add_good
lib/apps_pw/yclients/biz/erp/web/pages/guest/signin.py:115 in sign_in

Seen in: - altegio/biz.erp#227787 — shard 8 — launch 171752 (×1, last 2026-10-02 11:50 MSK)

TimeoutError — 1 occurrence(s) across 1 pipeline(s)

playwright._impl._errors.TimeoutError: Locator.click: Timeout 30000ms exceeded.
Call log:
  - waiting for locator("[class*=\"erp-nav-menu-mode-switch-footer-button\"]:visible, [class*=\"erp-nav-menu-mode-switch-mini__button\"]:visible").first
    - locator resolved to <div data-locator="nav_menu_mode_switch_btn" class="erp-nav-menu-mode-switch-footer-button">…</div>
  - attempting click action
    2 × waiting for element to be visible, enabled and stable
      - element is visible, enabled and stable
      - scrolling into view if needed
      - done scrolling
      - <div class="v-error-modal v-error-modal--unauthorized v-error-modal__fade-enter-active v-error-modal__fade-enter-to">…</div> intercepts pointer events
    - retrying click action
    - waiting 20ms
    - waiting for element to be visible, enabled and stable
    - element is visible, enabled and stable
    - scrolling into view if needed
    - done scrolling
    - <div class="v-error-modal v-error-modal--unauthorized v-error-modal__fade-enter-active v-error-modal__fade-enter-to">…</div> intercepts pointer events
  2 × retrying click action
      - waiting 100ms
      - waiting for element to be visible, enabled and stable
      - element is visible, enabled and stable
      - scrolling into view if needed
      - done scrolling
      - <div class="v-error-modal v-error-modal--unauthorized">…</div> intercepts pointer events
  55 × retrying click action
       - waiting 500ms
       - waiting for element to be visible, enabled and stable
       - element is visible, enabled and stable
       - scrolling into view if needed
       - done scrolling
       - <div class="v-error-modal v-error-modal--unauthorized">…</div> intercepts pointer events
  - retrying click action
    - waiting 500ms
AssertionError: Failed to navigate through menu item MENU_ITEM_STORAGE_GOODS. Browser diagnostics:
{
  "url": "https://erp-testops-dev.infra.altegio.cloud/timetable/16358350/#mode=1",
  "observer": {
    "installed": true,
    "first_js_error": null,
    "js_errors": [],
    "js_errors_by_location": {},
    "xhr_queue": []
  },
  "page_errors": [],
  "console": [
    {
      "type": "warning",
      "text": "Web Vitals polyfill required",
      "location": {
        "url": "https://erp-testops-dev.infra.altegio.cloud/js/vue-vite-app/chunk-a6Oo9G3y2.js",
        "lineNumber": 0,
        "columnNumber": 11968
      }
    },
    {
      "type": "error",
      "text": "Failed to load resource: the server responded with a status of 401 ()",
      "location": {
        "url": "https://erp-testops-dev.infra.altegio.cloud/api/v1/company/16358350/timetable/attendance_day?dates%5B%5D=2026-10-02&include%5B%5D=records&include%5B%5D=records.services&include%5B%5D=records.labels&include%5B%5D=records.master&include%5B%5D=records.client&include%5B%5D=records.client.first_successful_visit&include%5B%5D=records.comer&include%5B%5D=records.comer.vehicle&include%5B%5D=records.resource_instances.resource&include%5B%5D=records.resource_instances&include%5B%5D=records.acceptance_free&include%5B%5D=records.attendance_service_items.attendance_service_composite.composite_service&include%5B%5D=records.duration_details&include%5B%5D=activities&include%5B%5D=activities.service&include%5B%5D=activities.labels&include%5B%5D=activities.master&include%5B%5D=activities.resource_instances.resource&include%5B%5D=activities.resource_instances&include%5B%5D=activities.duration_details&new_timetable_attendance_from_legacy=1&_=1790901658066",
        "lineNumber": 0,
        "columnNumber": 0
      }
    },
    {
      "type": "error",
      "text": "Failed to load resource: the server responded with a status of 401 ()",
      "location": {
        "url": "https://erp-testops-dev.infra.altegio.cloud/api/v1/company/16358350/timetable/schedule?dates%5B%5D=2026-10-02&include%5B%5D=tt_day_schedule_resource_instances.resource_instance.resource&include%5B%5D=tt_day_schedule_resource_instances.resource_instance&include%5B%5D=tt... [truncated]

Stacktrace:

lib/apps_pw/yclients/biz/erp/web/components/menu.py:214 in click_menu
lib/apps_pw/yclients/biz/erp/web/components/menu.py:228 in _click_menu
lib/apps_pw/yclients/biz/erp/web/pages/user.py:464 in _ensure_administration_mode_for_legacy_menu
suite/yclients/biz/erp/web/test_entities_pw.py:685 in test_add_good
lib/apps_pw/yclients/biz/erp/web/components/menu.py:216 in click_menu

Seen in: - altegio/biz.erp#227722 — shard 8 — launch 171516 (×1, last 2026-10-02 04:26 MSK)

TimeoutError — 1 occurrence(s) across 1 pipeline(s)

playwright._impl._errors.TimeoutError: Locator.click: Timeout 30000ms exceeded.
Call log:
  - waiting for locator("[class*=\"erp-nav-menu-mode-switch-footer-button\"]:visible, [class*=\"erp-nav-menu-mode-switch-mini__button\"]:visible").first
    - locator resolved to <div data-locator="nav_menu_mode_switch_btn" class="erp-nav-menu-mode-switch-footer-button">…</div>
  - attempting click action
    2 × waiting for element to be visible, enabled and stable
      - element is visible, enabled and stable
      - scrolling into view if needed
      - done scrolling
      - <div class="v-error-modal v-error-modal--unauthorized v-error-modal__fade-enter-active v-error-modal__fade-enter-to">…</div> intercepts pointer events
    - retrying click action
    - waiting 20ms
    - waiting for element to be visible, enabled and stable
    - element is visible, enabled and stable
    - scrolling into view if needed
    - done scrolling
    - <div class="v-error-modal v-error-modal--unauthorized v-error-modal__fade-enter-active v-error-modal__fade-enter-to">…</div> intercepts pointer events
  2 × retrying click action
      - waiting 100ms
      - waiting for element to be visible, enabled and stable
      - element is visible, enabled and stable
      - scrolling into view if needed
      - done scrolling
      - <div class="v-error-modal v-error-modal--unauthorized">…</div> intercepts pointer events
  55 × retrying click action
       - waiting 500ms
       - waiting for element to be visible, enabled and stable
       - element is visible, enabled and stable
       - scrolling into view if needed
       - done scrolling
       - <div class="v-error-modal v-error-modal--unauthorized">…</div> intercepts pointer events
  - retrying click action
    - waiting 500ms
AssertionError: Failed to navigate through menu item MENU_ITEM_STORAGE_GOODS. Browser diagnostics:
{
  "url": "https://erp-testops-dev.infra.altegio.cloud/timetable/16360607/#mode=1",
  "observer": {
    "installed": true,
    "first_js_error": null,
    "js_errors": [],
    "js_errors_by_location": {},
    "xhr_queue": []
  },
  "page_errors": [],
  "console": [
    {
      "type": "warning",
      "text": "Web Vitals polyfill required",
      "location": {
        "url": "https://erp-testops-dev.infra.altegio.cloud/js/vue-vite-app/chunk-a6Oo9G3y2.js",
        "lineNumber": 0,
        "columnNumber": 11968
      }
    },
    {
      "type": "error",
      "text": "Failed to load resource: the server responded with a status of 401 ()",
      "location": {
        "url": "https://erp-testops-dev.infra.altegio.cloud/api/v1/company/16360607/timetable/schedule?dates%5B%5D=2026-10-02&include%5B%5D=tt_day_schedule_resource_instances.resource_instance.resource&include%5B%5D=tt_day_schedule_resource_instances.resource_instance&include%5B%5D=tt_day_schedule_resource_instances&include%5B%5D=tt_day_schedule_masters.master&include%5B%5D=tt_day_schedule_masters&include%5B%5D=tt_day_schedule_masters.tt_day_master_grid_status&new_timetable_schedule_from_legacy=1&_=1790903558063",
        "lineNumber": 0,
        "columnNumber": 0
      }
    },
    {
      "type": "error",
      "text": "Failed to load resource: the server responded with a status of 401 ()",
      "location": {
        "url": "https://erp-testops-dev.infra.altegio.cloud/api/v1/company/16360607/staff/workload?start_date=2026-10-01&end_date=2026-10-31&_=1790903558061",
        "lineNumber": 0,
        "columnNumber": 0
      }
    },
    {
      "type": "error",
      "text": "Failed to load resource: the server responded with a status of 401 ()",
      "location": {
        "url": "https://erp-testops-dev.infra.altegio.cloud/api/v1/company/16360607/timetable/attendance_day?dates%5B%5D=2026-10-02&include%5B%5D=records&include%5B%5D=records.services&include%5B%5D=records.labels&include%5B%5D=records.master&include%5B%5D=records.client&include%5B%5D=records.client.first_successful_visit&include%5B%5D=records.comer&include%5B%5D=record... [truncated]

Stacktrace:

lib/apps_pw/yclients/biz/erp/web/components/menu.py:214 in click_menu
lib/apps_pw/yclients/biz/erp/web/components/menu.py:228 in _click_menu
lib/apps_pw/yclients/biz/erp/web/pages/user.py:464 in _ensure_administration_mode_for_legacy_menu
suite/yclients/biz/erp/web/test_entities_pw.py:685 in test_add_good
lib/apps_pw/yclients/biz/erp/web/components/menu.py:216 in click_menu

Seen in: - altegio/biz.erp#227722 — shard 8 — launch 171516 (×1, last 2026-10-02 04:26 MSK)

TimeoutError — 1 occurrence(s) across 1 pipeline(s)

playwright._impl._errors.TimeoutError: Locator.click: Timeout 30000ms exceeded.
Call log:
  - waiting for locator("[class*=\"erp-nav-menu-mode-switch-footer-button\"]:visible, [class*=\"erp-nav-menu-mode-switch-mini__button\"]:visible").first
    - locator resolved to <div data-locator="nav_menu_mode_switch_btn" class="erp-nav-menu-mode-switch-footer-button">…</div>
  - attempting click action
    2 × waiting for element to be visible, enabled and stable
      - element is visible, enabled and stable
      - scrolling into view if needed
      - done scrolling
      - <div class="v-error-modal v-error-modal--unauthorized v-error-modal__fade-enter-active v-error-modal__fade-enter-to">…</div> intercepts pointer events
    - retrying click action
    - waiting 20ms
    - waiting for element to be visible, enabled and stable
    - element is visible, enabled and stable
    - scrolling into view if needed
    - done scrolling
    - <div class="v-error-modal v-error-modal--unauthorized v-error-modal__fade-enter-active v-error-modal__fade-enter-to">…</div> intercepts pointer events
  2 × retrying click action
      - waiting 100ms
      - waiting for element to be visible, enabled and stable
      - element is visible, enabled and stable
      - scrolling into view if needed
      - done scrolling
      - <div class="v-error-modal v-error-modal--unauthorized">…</div> intercepts pointer events
  55 × retrying click action
       - waiting 500ms
       - waiting for element to be visible, enabled and stable
       - element is visible, enabled and stable
       - scrolling into view if needed
       - done scrolling
       - <div class="v-error-modal v-error-modal--unauthorized">…</div> intercepts pointer events
  - retrying click action
    - waiting 500ms
AssertionError: Failed to navigate through menu item MENU_ITEM_STORAGE_GOODS. Browser diagnostics:
{
  "url": "https://erp-testops-dev.infra.altegio.cloud/timetable/16360955/#mode=1",
  "observer": {
    "installed": true,
    "first_js_error": null,
    "js_errors": [],
    "js_errors_by_location": {},
    "xhr_queue": []
  },
  "page_errors": [],
  "console": [
    {
      "type": "warning",
      "text": "Web Vitals polyfill required",
      "location": {
        "url": "https://erp-testops-dev.infra.altegio.cloud/js/vue-vite-app/chunk-a6Oo9G3y2.js",
        "lineNumber": 0,
        "columnNumber": 11968
      }
    },
    {
      "type": "error",
      "text": "Failed to load resource: the server responded with a status of 401 ()",
      "location": {
        "url": "https://erp-testops-dev.infra.altegio.cloud/api/v1/company/16360955/staff/workload?start_date=2026-10-01&end_date=2026-10-31&_=1790907771854",
        "lineNumber": 0,
        "columnNumber": 0
      }
    },
    {
      "type": "error",
      "text": "Failed to load resource: the server responded with a status of 401 ()",
      "location": {
        "url": "https://erp-testops-dev.infra.altegio.cloud/api/v1/company/16360955/timetable/schedule?dates%5B%5D=2026-10-02&include%5B%5D=tt_day_schedule_resource_instances.resource_instance.resource&include%5B%5D=tt_day_schedule_resource_instances.resource_instance&include%5B%5D=tt_day_schedule_resource_instances&include%5B%5D=tt_day_schedule_masters.master&include%5B%5D=tt_day_schedule_masters&include%5B%5D=tt_day_schedule_masters.tt_day_master_grid_status&new_timetable_schedule_from_legacy=1&_=1790907771856",
        "lineNumber": 0,
        "columnNumber": 0
      }
    },
    {
      "type": "error",
      "text": "Failed to load resource: the server responded with a status of 401 ()",
      "location": {
        "url": "https://erp-testops-dev.infra.altegio.cloud/api/v1/company/16360955/timetable/attendance_day?dates%5B%5D=2026-10-02&include%5B%5D=records&include%5B%5D=records.services&include%5B%5D=records.labels&include%5B%5D=records.master&include%5B%5D=records.client&include%5B%5D=records.client.first_successful_visit&include%5B%5D=records.comer&include%5B%5D=record... [truncated]

Stacktrace:

lib/apps_pw/yclients/biz/erp/web/components/menu.py:214 in click_menu
lib/apps_pw/yclients/biz/erp/web/components/menu.py:228 in _click_menu
lib/apps_pw/yclients/biz/erp/web/pages/user.py:464 in _ensure_administration_mode_for_legacy_menu
suite/yclients/biz/erp/web/test_entities_pw.py:685 in test_add_good
lib/apps_pw/yclients/biz/erp/web/components/menu.py:216 in click_menu

Seen in: - altegio/biz.erp#227735 — shard 4 — launch 171549 (×1, last 2026-10-02 06:23 MSK)