#22191 Регистрация существующим пользователем с филиалами¶
нового филиала через онбординг
test_add_new_filial_onboarding_existing_user_with_filial_v2
Failures in last 30 days: 12
Generated at 2026-10-08 03:53 MSK
Last failure: 2026-10-07 17:54 MSK
Filter: pipelines with sandbox_biz_erp ∈ {master, testops-dev} AND autotests_branch ∈ {master, main} only (testops-dev — daytime ticks since 2026-08-05).
By exception class:
- TimeoutError — 10
- KeyError — 1
- AssertionError — 1
Failure signatures (grouped by exception + full message):
AssertionError — 1 occurrence(s) across 1 pipeline(s)¶
AssertionError: Locator expected to be visible
Actual value: None
Error: element(s) not found
Call log:
- Expect "to_be_visible" with timeout 30000ms
- waiting for locator("[data-locator$=\"autocomplete_drop-menu_item_15\"] a").first
Stacktrace:
lib/apps_pw/yclients/biz/erp/web/pages/__init__.py:77 in decorated
lib/apps_pw/yclients/biz/erp/web/pages/guest/signup_v2.py:459 in fill_and_submit
lib/apps_pw/yclients/biz/erp/web/pages/__init__.py:77 in decorated
lib/apps_pw/yclients/biz/erp/web/pages/guest/signup_v2.py:426 in set_biz_type
lib/apps_pw/yclients/biz/erp/web/pages/guest/signup_v2.py:751 in _pick_autocomplete_v2_item
Seen in: - altegio/biz.erp#229261 — shard 8 — launch 174180 (×1, last 2026-10-07 17:54 MSK)
KeyError — 1 occurrence(s) across 1 pipeline(s)¶
KeyError: 'salon_clean'
Seen in: - altegio/biz.erp#227735 — shard 8 — launch 171549 (×1, last 2026-10-02 06:23 MSK)
TimeoutError — 1 occurrence(s) across 1 pipeline(s)¶
playwright._impl._errors.TimeoutError: Timeout 30000ms exceeded.
=========================== logs ===========================
waiting for navigation to "<function ImplToApiMapping.wrap_handler.<locals>.wrapper_func at 0x7fb8dc588900>" until 'domcontentloaded'
navigated to "https://erp-testops-dev.infra.altegio.cloud/onboarding/fifth/49552"
navigated to "https://erp-testops-dev.infra.altegio.cloud/onboarding/fifth/49552"
navigated to "https://erp-testops-dev.infra.altegio.cloud/signin/JTJGb25ib2FyZGluZyUyRmNvbXBsZXRlJTJGNDk1NTI="
navigated to "https://erp-testops-dev.infra.altegio.cloud/signin/JTJGb25ib2FyZGluZyUyRmNvbXBsZXRlJTJGNDk1NTI="
navigated to "https://erp-testops-dev.infra.altegio.cloud/signin/JTJGb25ib2FyZGluZyUyRmNvbXBsZXRlJTJGNDk1NTI="
============================================================
Stacktrace:
suite/yclients/biz/erp/web/filial/test_onboarding_v2_pw.py:855 in test_add_new_filial_onboarding_existing_user_with_filial_v2
lib/apps_pw/yclients/biz/erp/web/pages/__init__.py:77 in decorated
lib/apps_pw/yclients/biz/erp/web/pages/guest/signup_v2.py:608 in fill_and_submit
Seen in: - altegio/biz.erp#227722 — shard 4 — launch 171516 (×1, last 2026-10-02 04:26 MSK)
TimeoutError — 1 occurrence(s) across 1 pipeline(s)¶
playwright._impl._errors.TimeoutError: Timeout 30000ms exceeded.
=========================== logs ===========================
waiting for navigation to "<function ImplToApiMapping.wrap_handler.<locals>.wrapper_func at 0x7f926d0f19e0>" until 'domcontentloaded'
navigated to "https://erp-testops-dev.infra.altegio.cloud/onboarding/fifth/49564"
navigated to "https://erp-testops-dev.infra.altegio.cloud/onboarding/fifth/49564"
navigated to "https://erp-testops-dev.infra.altegio.cloud/signin/JTJGb25ib2FyZGluZyUyRmNvbXBsZXRlJTJGNDk1NjQ="
navigated to "https://erp-testops-dev.infra.altegio.cloud/signin/JTJGb25ib2FyZGluZyUyRmNvbXBsZXRlJTJGNDk1NjQ="
navigated to "https://erp-testops-dev.infra.altegio.cloud/signin/JTJGb25ib2FyZGluZyUyRmNvbXBsZXRlJTJGNDk1NjQ="
============================================================
Stacktrace:
suite/yclients/biz/erp/web/filial/test_onboarding_v2_pw.py:855 in test_add_new_filial_onboarding_existing_user_with_filial_v2
lib/apps_pw/yclients/biz/erp/web/pages/__init__.py:77 in decorated
lib/apps_pw/yclients/biz/erp/web/pages/guest/signup_v2.py:608 in fill_and_submit
Seen in: - altegio/biz.erp#227722 — shard 4 — launch 171516 (×1, last 2026-10-02 04:26 MSK)
TimeoutError — 1 occurrence(s) across 1 pipeline(s)¶
playwright._impl._errors.TimeoutError: Timeout 30000ms exceeded.
=========================== logs ===========================
waiting for navigation to "<function ImplToApiMapping.wrap_handler.<locals>.wrapper_func at 0x7fbce8205d00>" until 'domcontentloaded'
navigated to "https://erp-testops-dev.infra.altegio.cloud/onboarding/fifth/49572"
navigated to "https://erp-testops-dev.infra.altegio.cloud/onboarding/fifth/49572"
navigated to "https://erp-testops-dev.infra.altegio.cloud/signin/JTJGb25ib2FyZGluZyUyRmNvbXBsZXRlJTJGNDk1NzI="
navigated to "https://erp-testops-dev.infra.altegio.cloud/signin/JTJGb25ib2FyZGluZyUyRmNvbXBsZXRlJTJGNDk1NzI="
navigated to "https://erp-testops-dev.infra.altegio.cloud/signin/JTJGb25ib2FyZGluZyUyRmNvbXBsZXRlJTJGNDk1NzI="
============================================================
Stacktrace:
suite/yclients/biz/erp/web/filial/test_onboarding_v2_pw.py:855 in test_add_new_filial_onboarding_existing_user_with_filial_v2
lib/apps_pw/yclients/biz/erp/web/pages/__init__.py:77 in decorated
lib/apps_pw/yclients/biz/erp/web/pages/guest/signup_v2.py:608 in fill_and_submit
Seen in: - altegio/biz.erp#227722 — shard 4 — launch 171516 (×1, last 2026-10-02 04:26 MSK)
TimeoutError — 1 occurrence(s) across 1 pipeline(s)¶
playwright._impl._errors.TimeoutError: Timeout 30000ms exceeded.
=========================== logs ===========================
waiting for navigation to "<function ImplToApiMapping.wrap_handler.<locals>.wrapper_func at 0x7ff4d84f76a0>" until 'domcontentloaded'
navigated to "https://erp-testops-dev.infra.altegio.cloud/onboarding/fifth/49596"
navigated to "https://erp-testops-dev.infra.altegio.cloud/onboarding/fifth/49596"
navigated to "https://erp-testops-dev.infra.altegio.cloud/signin/JTJGb25ib2FyZGluZyUyRmNvbXBsZXRlJTJGNDk1OTY="
navigated to "https://erp-testops-dev.infra.altegio.cloud/signin/JTJGb25ib2FyZGluZyUyRmNvbXBsZXRlJTJGNDk1OTY="
navigated to "https://erp-testops-dev.infra.altegio.cloud/signin/JTJGb25ib2FyZGluZyUyRmNvbXBsZXRlJTJGNDk1OTY="
============================================================
Stacktrace:
suite/yclients/biz/erp/web/filial/test_onboarding_v2_pw.py:855 in test_add_new_filial_onboarding_existing_user_with_filial_v2
lib/apps_pw/yclients/biz/erp/web/pages/__init__.py:77 in decorated
lib/apps_pw/yclients/biz/erp/web/pages/guest/signup_v2.py:608 in fill_and_submit
Seen in: - altegio/biz.erp#227735 — shard 8 — launch 171549 (×1, last 2026-10-02 06:23 MSK)
TimeoutError — 1 occurrence(s) across 1 pipeline(s)¶
playwright._impl._errors.TimeoutError: Timeout 30000ms exceeded.
=========================== logs ===========================
waiting for navigation to "<function ImplToApiMapping.wrap_handler.<locals>.wrapper_func at 0x7feb9c13a2a0>" until 'domcontentloaded'
navigated to "https://erp-testops-dev.infra.altegio.cloud/onboarding/fifth/49604"
navigated to "https://erp-testops-dev.infra.altegio.cloud/onboarding/fifth/49604"
navigated to "https://erp-testops-dev.infra.altegio.cloud/signin/JTJGb25ib2FyZGluZyUyRmNvbXBsZXRlJTJGNDk2MDQ="
navigated to "https://erp-testops-dev.infra.altegio.cloud/signin/JTJGb25ib2FyZGluZyUyRmNvbXBsZXRlJTJGNDk2MDQ="
navigated to "https://erp-testops-dev.infra.altegio.cloud/signin/JTJGb25ib2FyZGluZyUyRmNvbXBsZXRlJTJGNDk2MDQ="
============================================================
Stacktrace:
suite/yclients/biz/erp/web/filial/test_onboarding_v2_pw.py:855 in test_add_new_filial_onboarding_existing_user_with_filial_v2
lib/apps_pw/yclients/biz/erp/web/pages/__init__.py:77 in decorated
lib/apps_pw/yclients/biz/erp/web/pages/guest/signup_v2.py:608 in fill_and_submit
Seen in: - altegio/biz.erp#227735 — shard 8 — launch 171549 (×1, last 2026-10-02 06:23 MSK)
TimeoutError — 1 occurrence(s) across 1 pipeline(s)¶
playwright._impl._errors.TimeoutError: Timeout 30000ms exceeded.
=========================== logs ===========================
waiting for navigation to "<function ImplToApiMapping.wrap_handler.<locals>.wrapper_func at 0x7fab59b689a0>" until 'domcontentloaded'
navigated to "https://erp-testops-dev.infra.altegio.cloud/onboarding/fifth/49619"
navigated to "https://erp-testops-dev.infra.altegio.cloud/onboarding/fifth/49619"
navigated to "https://erp-testops-dev.infra.altegio.cloud/signin/JTJGb25ib2FyZGluZyUyRmNvbXBsZXRlJTJGNDk2MTk="
navigated to "https://erp-testops-dev.infra.altegio.cloud/signin/JTJGb25ib2FyZGluZyUyRmNvbXBsZXRlJTJGNDk2MTk="
navigated to "https://erp-testops-dev.infra.altegio.cloud/signin/JTJGb25ib2FyZGluZyUyRmNvbXBsZXRlJTJGNDk2MTk="
============================================================
Stacktrace:
suite/yclients/biz/erp/web/filial/test_onboarding_v2_pw.py:855 in test_add_new_filial_onboarding_existing_user_with_filial_v2
lib/apps_pw/yclients/biz/erp/web/pages/__init__.py:77 in decorated
lib/apps_pw/yclients/biz/erp/web/pages/guest/signup_v2.py:608 in fill_and_submit
Seen in: - altegio/biz.erp#227749 — shard 5 — launch 171616 (×1, last 2026-10-02 08:20 MSK)
TimeoutError — 1 occurrence(s) across 1 pipeline(s)¶
playwright._impl._errors.TimeoutError: Timeout 30000ms exceeded.
=========================== logs ===========================
waiting for navigation to "<function ImplToApiMapping.wrap_handler.<locals>.wrapper_func at 0x7f7ec82af880>" until 'domcontentloaded'
navigated to "https://erp-testops-dev.infra.altegio.cloud/onboarding/fifth/49626"
navigated to "https://erp-testops-dev.infra.altegio.cloud/onboarding/fifth/49626"
navigated to "https://erp-testops-dev.infra.altegio.cloud/signin/JTJGb25ib2FyZGluZyUyRmNvbXBsZXRlJTJGNDk2MjY="
navigated to "https://erp-testops-dev.infra.altegio.cloud/signin/JTJGb25ib2FyZGluZyUyRmNvbXBsZXRlJTJGNDk2MjY="
navigated to "https://erp-testops-dev.infra.altegio.cloud/signin/JTJGb25ib2FyZGluZyUyRmNvbXBsZXRlJTJGNDk2MjY="
============================================================
Stacktrace:
suite/yclients/biz/erp/web/filial/test_onboarding_v2_pw.py:855 in test_add_new_filial_onboarding_existing_user_with_filial_v2
lib/apps_pw/yclients/biz/erp/web/pages/__init__.py:77 in decorated
lib/apps_pw/yclients/biz/erp/web/pages/guest/signup_v2.py:608 in fill_and_submit
Seen in: - altegio/biz.erp#227749 — shard 5 — launch 171616 (×1, last 2026-10-02 08:20 MSK)
TimeoutError — 1 occurrence(s) across 1 pipeline(s)¶
playwright._impl._errors.TimeoutError: Timeout 30000ms exceeded.
=========================== logs ===========================
waiting for navigation to "<function ImplToApiMapping.wrap_handler.<locals>.wrapper_func at 0x7fe21055e2a0>" until 'domcontentloaded'
navigated to "https://erp-testops-dev.infra.altegio.cloud/onboarding/fifth/49633"
navigated to "https://erp-testops-dev.infra.altegio.cloud/onboarding/fifth/49633"
navigated to "https://erp-testops-dev.infra.altegio.cloud/signin/JTJGb25ib2FyZGluZyUyRmNvbXBsZXRlJTJGNDk2MzM="
navigated to "https://erp-testops-dev.infra.altegio.cloud/signin/JTJGb25ib2FyZGluZyUyRmNvbXBsZXRlJTJGNDk2MzM="
navigated to "https://erp-testops-dev.infra.altegio.cloud/signin/JTJGb25ib2FyZGluZyUyRmNvbXBsZXRlJTJGNDk2MzM="
============================================================
Stacktrace:
suite/yclients/biz/erp/web/filial/test_onboarding_v2_pw.py:855 in test_add_new_filial_onboarding_existing_user_with_filial_v2
lib/apps_pw/yclients/biz/erp/web/pages/__init__.py:77 in decorated
lib/apps_pw/yclients/biz/erp/web/pages/guest/signup_v2.py:608 in fill_and_submit
Seen in: - altegio/biz.erp#227749 — shard 5 — launch 171616 (×1, last 2026-10-02 08:20 MSK)
TimeoutError — 1 occurrence(s) across 1 pipeline(s)¶
playwright._impl._errors.TimeoutError: Timeout 30000ms exceeded.
=========================== logs ===========================
waiting for navigation to "<function ImplToApiMapping.wrap_handler.<locals>.wrapper_func at 0x7f7d14e49300>" until 'domcontentloaded'
navigated to "https://erp-testops-dev.infra.altegio.cloud/onboarding/fifth/49641"
navigated to "https://erp-testops-dev.infra.altegio.cloud/onboarding/fifth/49641"
navigated to "https://erp-testops-dev.infra.altegio.cloud/signin/JTJGb25ib2FyZGluZyUyRmNvbXBsZXRlJTJGNDk2NDE="
navigated to "https://erp-testops-dev.infra.altegio.cloud/signin/JTJGb25ib2FyZGluZyUyRmNvbXBsZXRlJTJGNDk2NDE="
navigated to "https://erp-testops-dev.infra.altegio.cloud/signin/JTJGb25ib2FyZGluZyUyRmNvbXBsZXRlJTJGNDk2NDE="
============================================================
Stacktrace:
suite/yclients/biz/erp/web/filial/test_onboarding_v2_pw.py:855 in test_add_new_filial_onboarding_existing_user_with_filial_v2
lib/apps_pw/yclients/biz/erp/web/pages/__init__.py:77 in decorated
lib/apps_pw/yclients/biz/erp/web/pages/guest/signup_v2.py:608 in fill_and_submit
Seen in: - altegio/biz.erp#227787 — shard 4 — launch 171752 (×1, last 2026-10-02 11:50 MSK)
TimeoutError — 1 occurrence(s) across 1 pipeline(s)¶
playwright._impl._errors.TimeoutError: Timeout 30000ms exceeded.
=========================== logs ===========================
waiting for navigation to "<function ImplToApiMapping.wrap_handler.<locals>.wrapper_func at 0x7f23acbefc40>" until 'domcontentloaded'
navigated to "https://erp-testops-dev.infra.altegio.cloud/onboarding/fifth/49650"
navigated to "https://erp-testops-dev.infra.altegio.cloud/onboarding/fifth/49650"
navigated to "https://erp-testops-dev.infra.altegio.cloud/signin/JTJGb25ib2FyZGluZyUyRmNvbXBsZXRlJTJGNDk2NTA="
navigated to "https://erp-testops-dev.infra.altegio.cloud/signin/JTJGb25ib2FyZGluZyUyRmNvbXBsZXRlJTJGNDk2NTA="
navigated to "https://erp-testops-dev.infra.altegio.cloud/signin/JTJGb25ib2FyZGluZyUyRmNvbXBsZXRlJTJGNDk2NTA="
============================================================
Stacktrace:
suite/yclients/biz/erp/web/filial/test_onboarding_v2_pw.py:855 in test_add_new_filial_onboarding_existing_user_with_filial_v2
lib/apps_pw/yclients/biz/erp/web/pages/__init__.py:77 in decorated
lib/apps_pw/yclients/biz/erp/web/pages/guest/signup_v2.py:608 in fill_and_submit
Seen in: - altegio/biz.erp#227787 — shard 4 — launch 171752 (×1, last 2026-10-02 11:50 MSK)