Окно для ввода sms кода. Введен неверный код подтверждения.¶
test_auth_fields_sms_invalid_code
Failures in last 30 days: 13
Generated at 2026-10-08 03:35 MSK
Last failure: 2026-10-02 11:50 MSK
Filter: pipelines with sandbox_biz_erp ∈ {master, testops-dev} AND autotests_branch ∈ {master, main} only (testops-dev — daytime ticks since 2026-08-05).
By exception class:
- AssertionError — 5
- NoResultFound — 5
- WebDriverException — 3
Failure signatures (grouped by exception + full message):
AssertionError — 5 occurrence(s) across 4 pipeline(s)¶
AssertionError: Таймер обратного отсчета НЕ отображается
Expected: <True>
but: was <False>
Stacktrace:
suite/yclients/client/booking/web/online_booking/test_authorization.py:317 in test_auth_fields_sms_invalid_code
Seen in: - altegio/biz.erp#227787 — shard 6 — launch 171752 (×1, last 2026-10-02 11:50 MSK) - altegio/biz.erp#227749 — shard 2 — launch 171616 (×1, last 2026-10-02 08:20 MSK) - altegio/biz.erp#227735 — shard 2 — launch 171549 (×1, last 2026-10-02 06:23 MSK) - altegio/biz.erp#227722 — shard 7 — launch 171516 (×2, last 2026-10-02 04:26 MSK)
NoResultFound — 5 occurrence(s) across 3 pipeline(s)¶
sqlalchemy.orm.exc.NoResultFound: No row was found for one()
Stacktrace:
suite/yclients/client/booking/web/online_booking/test_authorization.py:324 in test_auth_fields_sms_invalid_code
Seen in: - altegio/biz.erp#227749 — shard 2 — launch 171616 (×2, last 2026-10-02 08:20 MSK) - altegio/biz.erp#227735 — shard 2 — launch 171549 (×2, last 2026-10-02 06:23 MSK) - altegio/biz.erp#227722 — shard 7 — launch 171516 (×1, last 2026-10-02 04:26 MSK)
WebDriverException — 1 occurrence(s) across 1 pipeline(s)¶
selenium.common.exceptions.WebDriverException: Message: <unknown>: Failed to read the 'localStorage' property from 'Window': Access is denied for this document.
(Session info: headless chrome=119.0.6045.199)
Stacktrace:
#0 0x563d89c0d5e3 <unknown>
#1 0x563d898d00b7 <unknown>
#2 0x563d898d62b5 <unknown>
#3 0x563d898d89b1 <unknown>
#4 0x563d8996171f <unknown>
#5 0x563d89944ef2 <unknown>
#6 0x563d89960b3d <unknown>
#7 0x563d89944cc3 <unknown>
#8 0x563d899100e4 <unknown>
#9 0x563d899110ae <unknown>
#10 0x563d89bd3ce1 <unknown>
#11 0x563d89bd7b7e <unknown>
#12 0x563d89bc14b5 <unknown>
#13 0x563d89bd87d6 <unknown>
#14 0x563d89ba4dbf <unknown>
#15 0x563d89bfb748 <unknown>
#16 0x563d89bfb917 <unknown>
#17 0x563d89c0c773 <unknown>
#18 0x7f72b088daa4 <unknown>
#19 0x7f72b091aa64 __clone
Stacktrace:
lib/common/ui/pages/web.py:61 in decorated
lib/apps/yclients/client/booking/web/pages/__init__.py:80 in open
lib/common/ui/pages/web.py:61 in decorated
lib/apps/yclients/client/booking/web/pages/__init__.py:41 in set_environment
lib/ui/selenium/webdriver/__init__.py:52 in execute_script
Seen in: - altegio/client.booking#224668 — shard 7 — launch 165208 (×1, last 2026-09-21 08:16 MSK)
WebDriverException — 1 occurrence(s) across 1 pipeline(s)¶
selenium.common.exceptions.WebDriverException: Message: <unknown>: Failed to read the 'localStorage' property from 'Window': Access is denied for this document.
(Session info: headless chrome=119.0.6045.199)
Stacktrace:
#0 0x555d981b05e3 <unknown>
#1 0x555d97e730b7 <unknown>
#2 0x555d97e792b5 <unknown>
#3 0x555d97e7b9b1 <unknown>
#4 0x555d97f0471f <unknown>
#5 0x555d97ee7ef2 <unknown>
#6 0x555d97f03b3d <unknown>
#7 0x555d97ee7cc3 <unknown>
#8 0x555d97eb30e4 <unknown>
#9 0x555d97eb40ae <unknown>
#10 0x555d98176ce1 <unknown>
#11 0x555d9817ab7e <unknown>
#12 0x555d981644b5 <unknown>
#13 0x555d9817b7d6 <unknown>
#14 0x555d98147dbf <unknown>
#15 0x555d9819e748 <unknown>
#16 0x555d9819e917 <unknown>
#17 0x555d981af773 <unknown>
#18 0x7f161e7ebaa4 <unknown>
#19 0x7f161e878a64 __clone
Stacktrace:
lib/common/ui/pages/web.py:61 in decorated
lib/apps/yclients/client/booking/web/pages/__init__.py:80 in open
lib/common/ui/pages/web.py:61 in decorated
lib/apps/yclients/client/booking/web/pages/__init__.py:41 in set_environment
lib/ui/selenium/webdriver/__init__.py:52 in execute_script
Seen in: - altegio/client.booking#224668 — shard 7 — launch 165208 (×1, last 2026-09-21 08:16 MSK)
WebDriverException — 1 occurrence(s) across 1 pipeline(s)¶
selenium.common.exceptions.WebDriverException: Message: <unknown>: Failed to read the 'localStorage' property from 'Window': Access is denied for this document.
(Session info: headless chrome=119.0.6045.199)
Stacktrace:
#0 0x562880d4c5e3 <unknown>
#1 0x562880a0f0b7 <unknown>
#2 0x562880a152b5 <unknown>
#3 0x562880a179b1 <unknown>
#4 0x562880aa071f <unknown>
#5 0x562880a83ef2 <unknown>
#6 0x562880a9fb3d <unknown>
#7 0x562880a83cc3 <unknown>
#8 0x562880a4f0e4 <unknown>
#9 0x562880a500ae <unknown>
#10 0x562880d12ce1 <unknown>
#11 0x562880d16b7e <unknown>
#12 0x562880d004b5 <unknown>
#13 0x562880d177d6 <unknown>
#14 0x562880ce3dbf <unknown>
#15 0x562880d3a748 <unknown>
#16 0x562880d3a917 <unknown>
#17 0x562880d4b773 <unknown>
#18 0x7f3b72070aa4 <unknown>
#19 0x7f3b720fda64 __clone
Stacktrace:
lib/common/ui/pages/web.py:61 in decorated
lib/apps/yclients/client/booking/web/pages/__init__.py:80 in open
lib/common/ui/pages/web.py:61 in decorated
lib/apps/yclients/client/booking/web/pages/__init__.py:41 in set_environment
lib/ui/selenium/webdriver/__init__.py:52 in execute_script
Seen in: - altegio/client.booking#224668 — shard 7 — launch 165208 (×1, last 2026-09-21 08:16 MSK)