#56720 TC04 — EU salon (Poland) with Adyen ON and VAT ON: Adyen offered¶
for license payment and Stripe is not.
test_billing_license_payment_adyen_offered_eu_vat_on
Failures in last 30 days: 6
Generated at 2026-10-08 03:53 MSK
Last failure: 2026-10-02 11:50 MSK
Filter: pipelines with sandbox_biz_erp ∈ {master, testops-dev} AND autotests_branch ∈ {master, main} only (testops-dev — daytime ticks since 2026-08-05).
🏥 3 of these ran under the quarantine tier: XFAIL, pipeline stayed green, excluded from the red statistics and incidents (see Карантин).
By exception class:
- AssertionError — 3
- SigninRedirectMissingError — 3
Failure signatures (grouped by exception + full message):
AssertionError — 3 occurrence(s) across 1 pipeline(s)¶
AssertionError: The Payment method dropdown should be visible on the License payment page
Actual value: None
Error: element(s) not found
Call log:
- Expect "to_be_visible" with timeout 30000ms
- waiting for locator("[data-locator=\"change_another_link\"]").first
Stacktrace:
suite/yclients/biz/erp/web/billing/license/test_billing_license_payment_adyen_offered_eu_vat_on_pw.py:87 in test_billing_license_payment_adyen_offered_eu_vat_on
Seen in: - altegio/biz.erp#227596 — shard 2 — launch 171280 (×3, last 2026-10-01 17:40 MSK)
🏥 SigninRedirectMissingError — 1 occurrence(s) across 1 pipeline(s)¶
autotests.lib.exception.SigninRedirectMissingError: login-XHR завершился со статусом 200, но редиректа со /signin/ не случилось за 30 с — подозрение на фронт biz.erp
--- причина (playwright) ---
Timeout 30000ms exceeded.
=========================== logs ===========================
waiting for navigation to "<function ImplToApiMapping.wrap_handler.<locals>.wrapper_func at 0x7f65677f6340>" until 'commit'
navigated to "https://erp-testops-dev.infra.altegio.cloud/signin/"
navigated to "https://erp-testops-dev.infra.altegio.cloud/signin/"
navigated to "https://erp-testops-dev.infra.altegio.cloud/signin/JTJGdGltZXRhYmxlJTJGMTUzMjM2NTYlMkY="
navigated to "https://erp-testops-dev.infra.altegio.cloud/signin/JTJGdGltZXRhYmxlJTJGMTUzMjM2NTYlMkY="
navigated to "https://erp-testops-dev.infra.altegio.cloud/signin/JTJGdGltZXRhYmxlJTJGMTUzMjM2NTYlMkY="
============================================================
Stacktrace:
suite/yclients/biz/erp/web/billing/license/test_billing_license_payment_adyen_offered_eu_vat_on_pw.py:63 in test_billing_license_payment_adyen_offered_eu_vat_on
lib/apps_pw/yclients/biz/erp/web/pages/guest/signin.py:115 in sign_in
Seen in: - altegio/biz.erp#227722 — shard 6 — launch 171516 (×1, last 2026-10-02 04:26 MSK)
🏥 SigninRedirectMissingError — 1 occurrence(s) across 1 pipeline(s)¶
autotests.lib.exception.SigninRedirectMissingError: login-XHR завершился со статусом 200, но редиректа со /signin/ не случилось за 30 с — подозрение на фронт biz.erp
--- причина (playwright) ---
Timeout 30000ms exceeded.
=========================== logs ===========================
waiting for navigation to "<function ImplToApiMapping.wrap_handler.<locals>.wrapper_func at 0x7f0c83e20d60>" until 'commit'
navigated to "https://erp-testops-dev.infra.altegio.cloud/signin/"
navigated to "https://erp-testops-dev.infra.altegio.cloud/signin/"
navigated to "https://erp-testops-dev.infra.altegio.cloud/signin/JTJGdGltZXRhYmxlJTJGMTUzMjM2NTYlMkY="
navigated to "https://erp-testops-dev.infra.altegio.cloud/signin/JTJGdGltZXRhYmxlJTJGMTUzMjM2NTYlMkY="
navigated to "https://erp-testops-dev.infra.altegio.cloud/signin/JTJGdGltZXRhYmxlJTJGMTUzMjM2NTYlMkY="
============================================================
Stacktrace:
suite/yclients/biz/erp/web/billing/license/test_billing_license_payment_adyen_offered_eu_vat_on_pw.py:63 in test_billing_license_payment_adyen_offered_eu_vat_on
lib/apps_pw/yclients/biz/erp/web/pages/guest/signin.py:115 in sign_in
Seen in: - altegio/biz.erp#227749 — shard 6 — launch 171616 (×1, last 2026-10-02 08:20 MSK)
🏥 SigninRedirectMissingError — 1 occurrence(s) across 1 pipeline(s)¶
autotests.lib.exception.SigninRedirectMissingError: login-XHR завершился со статусом 200, но редиректа со /signin/ не случилось за 30 с — подозрение на фронт biz.erp
--- причина (playwright) ---
Timeout 30000ms exceeded.
=========================== logs ===========================
waiting for navigation to "<function ImplToApiMapping.wrap_handler.<locals>.wrapper_func at 0x7faadf65df80>" until 'commit'
navigated to "https://erp-testops-dev.infra.altegio.cloud/signin/"
navigated to "https://erp-testops-dev.infra.altegio.cloud/signin/"
navigated to "https://erp-testops-dev.infra.altegio.cloud/signin/JTJGdGltZXRhYmxlJTJGMTUzMjM2NTYlMkY="
navigated to "https://erp-testops-dev.infra.altegio.cloud/signin/JTJGdGltZXRhYmxlJTJGMTUzMjM2NTYlMkY="
navigated to "https://erp-testops-dev.infra.altegio.cloud/signin/JTJGdGltZXRhYmxlJTJGMTUzMjM2NTYlMkY="
============================================================
Stacktrace:
suite/yclients/biz/erp/web/billing/license/test_billing_license_payment_adyen_offered_eu_vat_on_pw.py:63 in test_billing_license_payment_adyen_offered_eu_vat_on
lib/apps_pw/yclients/biz/erp/web/pages/guest/signin.py:115 in sign_in
Seen in: - altegio/biz.erp#227787 — shard 1 — launch 171752 (×1, last 2026-10-02 11:50 MSK)