Skip to content

#61597 TC07 — saved billing address persists after reload.

test_billing_non_eu_address_persist

Failures in last 30 days: 7

Generated at 2026-10-08 03:48 MSK

Last failure: 2026-10-02 11:50 MSK

Filter: pipelines with sandbox_biz_erp ∈ {master, testops-dev} AND autotests_branch ∈ {master, main} only (testops-dev — daytime ticks since 2026-08-05).

🏥 4 of these ran under the quarantine tier: XFAIL, pipeline stayed green, excluded from the red statistics and incidents (see Карантин).

By exception class: - SigninRedirectMissingError — 4 - AssertionError — 3

Failure signatures (grouped by exception + full message):

AssertionError — 2 occurrence(s) across 2 pipeline(s) (🏥 1 of 2 quarantined)

AssertionError: Locator expected to be visible
Actual value: None
Error: element(s) not found
Call log:
  - Expect "to_be_visible" with timeout 30000ms
  - waiting for locator("[data-locator=\"billing_address_edit_btn\"]")

Stacktrace:

suite/yclients/biz/erp/web/billing/license/test_billing_non_eu_address_persist_pw.py:69 in test_billing_non_eu_address_persist
lib/apps_pw/yclients/biz/erp/web/pages/__init__.py:77 in decorated
lib/apps_pw/yclients/biz/erp/web/pages/billing/topup.py:225 in wait_edit_button_visible

Seen in: - altegio/biz.erp#227749 — shard 6 — launch 171616 (×1, last 2026-10-02 08:20 MSK) - altegio/biz.erp#227596 — shard 5 — launch 171280 (×1, last 2026-10-01 17:40 MSK)

AssertionError — 1 occurrence(s) across 1 pipeline(s)

AssertionError: Locator expected to have text 'Welch, Delgado and Dillon'
Actual value: —
Call log:
  - Expect "to_have_text" with timeout 30000ms
  - waiting for locator("[data-locator=\"billing_address_business_name_value\"]").first
    34 × locator resolved to <div title="Business name" data-locator="billing_address_business_name_value" class="ag-erp-billing-topup-license-form-legals-eu__value">—</div>
       - unexpected value "—"

Stacktrace:

suite/yclients/biz/erp/web/billing/license/test_billing_non_eu_address_persist_pw.py:87 in test_billing_non_eu_address_persist
lib/apps_pw/yclients/biz/erp/web/pages/__init__.py:77 in decorated
lib/apps_pw/yclients/biz/erp/web/pages/billing/topup.py:348 in wait_business_name_value

Seen in: - altegio/biz.erp#227596 — shard 5 — launch 171280 (×1, last 2026-10-01 17:40 MSK)

SigninRedirectMissingError — 1 occurrence(s) across 1 pipeline(s)

autotests.lib.exception.SigninRedirectMissingError: login-XHR завершился со статусом 200, но редиректа со /signin/ не случилось за 30 с — подозрение на фронт biz.erp
--- причина (playwright) ---
Timeout 30000ms exceeded.
=========================== logs ===========================
waiting for navigation to "<function ImplToApiMapping.wrap_handler.<locals>.wrapper_func at 0x7fa43d677c40>" until 'commit'
  navigated to "https://erp-testops-dev.infra.altegio.cloud/signin/"
  navigated to "https://erp-testops-dev.infra.altegio.cloud/signin/"
  navigated to "https://erp-testops-dev.infra.altegio.cloud/signin/JTJGdGltZXRhYmxlJTJGMTYzNTY1MTIlMkY="
  navigated to "https://erp-testops-dev.infra.altegio.cloud/signin/JTJGdGltZXRhYmxlJTJGMTYzNTY1MTIlMkY="
  navigated to "https://erp-testops-dev.infra.altegio.cloud/signin/JTJGdGltZXRhYmxlJTJGMTYzNTY1MTIlMkY="
============================================================

Stacktrace:

suite/yclients/biz/erp/web/billing/license/test_billing_non_eu_address_persist_pw.py:56 in test_billing_non_eu_address_persist
lib/apps_pw/yclients/biz/erp/web/pages/guest/signin.py:115 in sign_in

Seen in: - altegio/biz.erp#227596 — shard 5 — launch 171280 (×1, last 2026-10-01 17:40 MSK)

🏥 SigninRedirectMissingError — 1 occurrence(s) across 1 pipeline(s)

autotests.lib.exception.SigninRedirectMissingError: login-XHR завершился со статусом 200, но редиректа со /signin/ не случилось за 30 с — подозрение на фронт biz.erp
--- причина (playwright) ---
Timeout 30000ms exceeded.
=========================== logs ===========================
waiting for navigation to "<function ImplToApiMapping.wrap_handler.<locals>.wrapper_func at 0x7f9314a520c0>" until 'commit'
  navigated to "https://erp-testops-dev.infra.altegio.cloud/signin/"
  navigated to "https://erp-testops-dev.infra.altegio.cloud/signin/"
  navigated to "https://erp-testops-dev.infra.altegio.cloud/signin/JTJGdGltZXRhYmxlJTJGMTYzNTgyMDQlMkY="
  navigated to "https://erp-testops-dev.infra.altegio.cloud/signin/JTJGdGltZXRhYmxlJTJGMTYzNTgyMDQlMkY="
  navigated to "https://erp-testops-dev.infra.altegio.cloud/signin/JTJGdGltZXRhYmxlJTJGMTYzNTgyMDQlMkY="
============================================================

Stacktrace:

suite/yclients/biz/erp/web/billing/license/test_billing_non_eu_address_persist_pw.py:56 in test_billing_non_eu_address_persist
lib/apps_pw/yclients/biz/erp/web/pages/guest/signin.py:115 in sign_in

Seen in: - altegio/biz.erp#227722 — shard 6 — launch 171516 (×1, last 2026-10-02 04:26 MSK)

🏥 SigninRedirectMissingError — 1 occurrence(s) across 1 pipeline(s)

autotests.lib.exception.SigninRedirectMissingError: login-XHR завершился со статусом 200, но редиректа со /signin/ не случилось за 30 с — подозрение на фронт biz.erp
--- причина (playwright) ---
Timeout 30000ms exceeded.
=========================== logs ===========================
waiting for navigation to "<function ImplToApiMapping.wrap_handler.<locals>.wrapper_func at 0x7ff5688bb060>" until 'commit'
  navigated to "https://erp-testops-dev.infra.altegio.cloud/signin/"
  navigated to "https://erp-testops-dev.infra.altegio.cloud/signin/"
  navigated to "https://erp-testops-dev.infra.altegio.cloud/signin/JTJGdGltZXRhYmxlJTJGMTYzNjI4MTQlMkY="
  navigated to "https://erp-testops-dev.infra.altegio.cloud/signin/JTJGdGltZXRhYmxlJTJGMTYzNjI4MTQlMkY="
  navigated to "https://erp-testops-dev.infra.altegio.cloud/signin/JTJGdGltZXRhYmxlJTJGMTYzNjI4MTQlMkY="
============================================================

Stacktrace:

suite/yclients/biz/erp/web/billing/license/test_billing_non_eu_address_persist_pw.py:56 in test_billing_non_eu_address_persist
lib/apps_pw/yclients/biz/erp/web/pages/guest/signin.py:115 in sign_in

Seen in: - altegio/biz.erp#227735 — shard 8 — launch 171549 (×1, last 2026-10-02 06:23 MSK)

🏥 SigninRedirectMissingError — 1 occurrence(s) across 1 pipeline(s)

autotests.lib.exception.SigninRedirectMissingError: login-XHR завершился со статусом 200, но редиректа со /signin/ не случилось за 30 с — подозрение на фронт biz.erp
--- причина (playwright) ---
Timeout 30000ms exceeded.
=========================== logs ===========================
waiting for navigation to "<function ImplToApiMapping.wrap_handler.<locals>.wrapper_func at 0x7ff3bc3e67a0>" until 'commit'
  navigated to "https://erp-testops-dev.infra.altegio.cloud/signin/"
  navigated to "https://erp-testops-dev.infra.altegio.cloud/signin/"
  navigated to "https://erp-testops-dev.infra.altegio.cloud/signin/JTJGdGltZXRhYmxlJTJGMTYzNzAyNTMlMkY="
  navigated to "https://erp-testops-dev.infra.altegio.cloud/signin/JTJGdGltZXRhYmxlJTJGMTYzNzAyNTMlMkY="
  navigated to "https://erp-testops-dev.infra.altegio.cloud/signin/JTJGdGltZXRhYmxlJTJGMTYzNzAyNTMlMkY="
============================================================

Stacktrace:

suite/yclients/biz/erp/web/billing/license/test_billing_non_eu_address_persist_pw.py:56 in test_billing_non_eu_address_persist
lib/apps_pw/yclients/biz/erp/web/pages/guest/signin.py:115 in sign_in

Seen in: - altegio/biz.erp#227787 — shard 3 — launch 171752 (×1, last 2026-10-02 11:50 MSK)