#61601 TC13 — saved billing address survives segment round-trip.¶
test_billing_non_eu_address_segment_roundtrip
Failures in last 30 days: 7
Generated at 2026-10-08 03:48 MSK
Last failure: 2026-10-02 11:50 MSK
Filter: pipelines with sandbox_biz_erp ∈ {master, testops-dev} AND autotests_branch ∈ {master, main} only (testops-dev — daytime ticks since 2026-08-05).
🏥 4 of these ran under the quarantine tier: XFAIL, pipeline stayed green, excluded from the red statistics and incidents (see Карантин).
By exception class:
- SigninRedirectMissingError — 4
- AssertionError — 3
Failure signatures (grouped by exception + full message):
AssertionError — 3 occurrence(s) across 1 pipeline(s)¶
AssertionError: Locator expected to be visible
Actual value: None
Error: element(s) not found
Call log:
- Expect "to_be_visible" with timeout 30000ms
- waiting for locator("[data-locator=\"billing_address_edit_btn\"]")
Stacktrace:
suite/yclients/biz/erp/web/billing/license/test_billing_non_eu_address_segment_roundtrip_pw.py:142 in test_billing_non_eu_address_segment_roundtrip
lib/apps_pw/yclients/biz/erp/web/pages/__init__.py:77 in decorated
lib/apps_pw/yclients/biz/erp/web/pages/billing/topup.py:225 in wait_edit_button_visible
Seen in: - altegio/biz.erp#223983 — shard 6 — launch 163501 (×3, last 2026-09-16 18:05 MSK)
🏥 SigninRedirectMissingError — 1 occurrence(s) across 1 pipeline(s)¶
autotests.lib.exception.SigninRedirectMissingError: login-XHR завершился со статусом 200, но редиректа со /signin/ не случилось за 30 с — подозрение на фронт biz.erp
--- причина (playwright) ---
Timeout 30000ms exceeded.
=========================== logs ===========================
waiting for navigation to "<function ImplToApiMapping.wrap_handler.<locals>.wrapper_func at 0x7fb8bd57b920>" until 'commit'
navigated to "https://erp-testops-dev.infra.altegio.cloud/signin/"
navigated to "https://erp-testops-dev.infra.altegio.cloud/signin/"
navigated to "https://erp-testops-dev.infra.altegio.cloud/signin/JTJGdGltZXRhYmxlJTJGMTYzNTc0NTklMkY="
navigated to "https://erp-testops-dev.infra.altegio.cloud/signin/JTJGdGltZXRhYmxlJTJGMTYzNTc0NTklMkY="
navigated to "https://erp-testops-dev.infra.altegio.cloud/signin/JTJGdGltZXRhYmxlJTJGMTYzNTc0NTklMkY="
============================================================
Stacktrace:
suite/yclients/biz/erp/web/billing/license/test_billing_non_eu_address_segment_roundtrip_pw.py:84 in test_billing_non_eu_address_segment_roundtrip
lib/apps_pw/yclients/biz/erp/web/pages/guest/signin.py:115 in sign_in
Seen in: - altegio/biz.erp#227722 — shard 3 — launch 171516 (×1, last 2026-10-02 04:26 MSK)
🏥 SigninRedirectMissingError — 1 occurrence(s) across 1 pipeline(s)¶
autotests.lib.exception.SigninRedirectMissingError: login-XHR завершился со статусом 200, но редиректа со /signin/ не случилось за 30 с — подозрение на фронт biz.erp
--- причина (playwright) ---
Timeout 30000ms exceeded.
=========================== logs ===========================
waiting for navigation to "<function ImplToApiMapping.wrap_handler.<locals>.wrapper_func at 0x7fc70ab8db20>" until 'commit'
navigated to "https://erp-testops-dev.infra.altegio.cloud/signin/"
navigated to "https://erp-testops-dev.infra.altegio.cloud/signin/"
navigated to "https://erp-testops-dev.infra.altegio.cloud/signin/JTJGdGltZXRhYmxlJTJGMTYzNjEyNjElMkY="
navigated to "https://erp-testops-dev.infra.altegio.cloud/signin/JTJGdGltZXRhYmxlJTJGMTYzNjEyNjElMkY="
navigated to "https://erp-testops-dev.infra.altegio.cloud/signin/JTJGdGltZXRhYmxlJTJGMTYzNjEyNjElMkY="
============================================================
Stacktrace:
suite/yclients/biz/erp/web/billing/license/test_billing_non_eu_address_segment_roundtrip_pw.py:84 in test_billing_non_eu_address_segment_roundtrip
lib/apps_pw/yclients/biz/erp/web/pages/guest/signin.py:115 in sign_in
Seen in: - altegio/biz.erp#227735 — shard 2 — launch 171549 (×1, last 2026-10-02 06:23 MSK)
🏥 SigninRedirectMissingError — 1 occurrence(s) across 1 pipeline(s)¶
autotests.lib.exception.SigninRedirectMissingError: login-XHR завершился со статусом 200, но редиректа со /signin/ не случилось за 30 с — подозрение на фронт biz.erp
--- причина (playwright) ---
Timeout 30000ms exceeded.
=========================== logs ===========================
waiting for navigation to "<function ImplToApiMapping.wrap_handler.<locals>.wrapper_func at 0x7f9672996de0>" until 'commit'
navigated to "https://erp-testops-dev.infra.altegio.cloud/signin/"
navigated to "https://erp-testops-dev.infra.altegio.cloud/signin/"
navigated to "https://erp-testops-dev.infra.altegio.cloud/signin/JTJGdGltZXRhYmxlJTJGMTYzNjYzMTklMkY="
navigated to "https://erp-testops-dev.infra.altegio.cloud/signin/JTJGdGltZXRhYmxlJTJGMTYzNjYzMTklMkY="
navigated to "https://erp-testops-dev.infra.altegio.cloud/signin/JTJGdGltZXRhYmxlJTJGMTYzNjYzMTklMkY="
============================================================
Stacktrace:
suite/yclients/biz/erp/web/billing/license/test_billing_non_eu_address_segment_roundtrip_pw.py:84 in test_billing_non_eu_address_segment_roundtrip
lib/apps_pw/yclients/biz/erp/web/pages/guest/signin.py:115 in sign_in
Seen in: - altegio/biz.erp#227749 — shard 3 — launch 171616 (×1, last 2026-10-02 08:20 MSK)
🏥 SigninRedirectMissingError — 1 occurrence(s) across 1 pipeline(s)¶
autotests.lib.exception.SigninRedirectMissingError: login-XHR завершился со статусом 200, но редиректа со /signin/ не случилось за 30 с — подозрение на фронт biz.erp
--- причина (playwright) ---
Timeout 30000ms exceeded.
=========================== logs ===========================
waiting for navigation to "<function ImplToApiMapping.wrap_handler.<locals>.wrapper_func at 0x7faadfdc3ce0>" until 'commit'
navigated to "https://erp-testops-dev.infra.altegio.cloud/signin/"
navigated to "https://erp-testops-dev.infra.altegio.cloud/signin/"
navigated to "https://erp-testops-dev.infra.altegio.cloud/signin/JTJGdGltZXRhYmxlJTJGMTYzNzA5MjQlMkY="
navigated to "https://erp-testops-dev.infra.altegio.cloud/signin/JTJGdGltZXRhYmxlJTJGMTYzNzA5MjQlMkY="
navigated to "https://erp-testops-dev.infra.altegio.cloud/signin/JTJGdGltZXRhYmxlJTJGMTYzNzA5MjQlMkY="
============================================================
Stacktrace:
suite/yclients/biz/erp/web/billing/license/test_billing_non_eu_address_segment_roundtrip_pw.py:84 in test_billing_non_eu_address_segment_roundtrip
lib/apps_pw/yclients/biz/erp/web/pages/guest/signin.py:115 in sign_in
Seen in: - altegio/biz.erp#227787 — shard 1 — launch 171752 (×1, last 2026-10-02 11:50 MSK)