#61596 TC04 — incomplete billing address blocks checkout on the FE.¶
test_billing_non_eu_incomplete_address_blocked
Failures in last 30 days: 7
Generated at 2026-10-08 03:48 MSK
Last failure: 2026-10-02 11:50 MSK
Filter: pipelines with sandbox_biz_erp ∈ {master, testops-dev} AND autotests_branch ∈ {master, main} only (testops-dev — daytime ticks since 2026-08-05).
🏥 4 of these ran under the quarantine tier: XFAIL, pipeline stayed green, excluded from the red statistics and incidents (see Карантин).
By exception class:
- SigninRedirectMissingError — 4
- AssertionError — 3
Failure signatures (grouped by exception + full message):
AssertionError — 3 occurrence(s) across 2 pipeline(s) (🏥 1 of 3 quarantined)¶
AssertionError: Locator expected to be visible
Actual value: None
Error: element(s) not found
Call log:
- Expect "to_be_visible" with timeout 30000ms
- waiting for locator("[data-locator=\"billing_address_required_hint_non_eu\"]")
Stacktrace:
suite/yclients/biz/erp/web/billing/license/test_billing_non_eu_incomplete_address_blocked_pw.py:70 in test_billing_non_eu_incomplete_address_blocked
lib/apps_pw/yclients/biz/erp/web/pages/__init__.py:77 in decorated
lib/apps_pw/yclients/biz/erp/web/pages/billing/topup.py:233 in wait_required_hint_visible
Seen in: - altegio/biz.erp#227735 — shard 4 — launch 171549 (×1, last 2026-10-02 06:23 MSK) - altegio/biz.erp#227596 — shard 7 — launch 171280 (×2, last 2026-10-01 17:40 MSK)
SigninRedirectMissingError — 1 occurrence(s) across 1 pipeline(s)¶
autotests.lib.exception.SigninRedirectMissingError: login-XHR завершился со статусом 200, но редиректа со /signin/ не случилось за 30 с — подозрение на фронт biz.erp
--- причина (playwright) ---
Timeout 30000ms exceeded.
=========================== logs ===========================
waiting for navigation to "<function ImplToApiMapping.wrap_handler.<locals>.wrapper_func at 0x7f551c50fce0>" until 'commit'
navigated to "https://erp-testops-dev.infra.altegio.cloud/signin/"
navigated to "https://erp-testops-dev.infra.altegio.cloud/signin/"
navigated to "https://erp-testops-dev.infra.altegio.cloud/signin/JTJGdGltZXRhYmxlJTJGMTYzNTU3NjclMkY="
navigated to "https://erp-testops-dev.infra.altegio.cloud/signin/JTJGdGltZXRhYmxlJTJGMTYzNTU3NjclMkY="
navigated to "https://erp-testops-dev.infra.altegio.cloud/signin/JTJGdGltZXRhYmxlJTJGMTYzNTU3NjclMkY="
============================================================
Stacktrace:
suite/yclients/biz/erp/web/billing/license/test_billing_non_eu_incomplete_address_blocked_pw.py:56 in test_billing_non_eu_incomplete_address_blocked
lib/apps_pw/yclients/biz/erp/web/pages/guest/signin.py:115 in sign_in
Seen in: - altegio/biz.erp#227596 — shard 7 — launch 171280 (×1, last 2026-10-01 17:40 MSK)
🏥 SigninRedirectMissingError — 1 occurrence(s) across 1 pipeline(s)¶
autotests.lib.exception.SigninRedirectMissingError: login-XHR завершился со статусом 200, но редиректа со /signin/ не случилось за 30 с — подозрение на фронт biz.erp
--- причина (playwright) ---
Timeout 30000ms exceeded.
=========================== logs ===========================
waiting for navigation to "<function ImplToApiMapping.wrap_handler.<locals>.wrapper_func at 0x7fd3210f5300>" until 'commit'
navigated to "https://erp-testops-dev.infra.altegio.cloud/signin/"
navigated to "https://erp-testops-dev.infra.altegio.cloud/signin/"
navigated to "https://erp-testops-dev.infra.altegio.cloud/signin/JTJGdGltZXRhYmxlJTJGMTYzNTg1NjclMkY="
navigated to "https://erp-testops-dev.infra.altegio.cloud/signin/JTJGdGltZXRhYmxlJTJGMTYzNTg1NjclMkY="
navigated to "https://erp-testops-dev.infra.altegio.cloud/signin/JTJGdGltZXRhYmxlJTJGMTYzNTg1NjclMkY="
============================================================
Stacktrace:
suite/yclients/biz/erp/web/billing/license/test_billing_non_eu_incomplete_address_blocked_pw.py:56 in test_billing_non_eu_incomplete_address_blocked
lib/apps_pw/yclients/biz/erp/web/pages/guest/signin.py:115 in sign_in
Seen in: - altegio/biz.erp#227722 — shard 6 — launch 171516 (×1, last 2026-10-02 04:26 MSK)
🏥 SigninRedirectMissingError — 1 occurrence(s) across 1 pipeline(s)¶
autotests.lib.exception.SigninRedirectMissingError: login-XHR завершился со статусом 200, но редиректа со /signin/ не случилось за 30 с — подозрение на фронт biz.erp
--- причина (playwright) ---
Timeout 30000ms exceeded.
=========================== logs ===========================
waiting for navigation to "<function ImplToApiMapping.wrap_handler.<locals>.wrapper_func at 0x7fa81854ca40>" until 'commit'
navigated to "https://erp-testops-dev.infra.altegio.cloud/signin/"
navigated to "https://erp-testops-dev.infra.altegio.cloud/signin/"
navigated to "https://erp-testops-dev.infra.altegio.cloud/signin/JTJGdGltZXRhYmxlJTJGMTYzNjU2MjUlMkY="
navigated to "https://erp-testops-dev.infra.altegio.cloud/signin/JTJGdGltZXRhYmxlJTJGMTYzNjU2MjUlMkY="
navigated to "https://erp-testops-dev.infra.altegio.cloud/signin/JTJGdGltZXRhYmxlJTJGMTYzNjU2MjUlMkY="
============================================================
Stacktrace:
suite/yclients/biz/erp/web/billing/license/test_billing_non_eu_incomplete_address_blocked_pw.py:56 in test_billing_non_eu_incomplete_address_blocked
lib/apps_pw/yclients/biz/erp/web/pages/guest/signin.py:115 in sign_in
Seen in: - altegio/biz.erp#227749 — shard 4 — launch 171616 (×1, last 2026-10-02 08:20 MSK)
🏥 SigninRedirectMissingError — 1 occurrence(s) across 1 pipeline(s)¶
autotests.lib.exception.SigninRedirectMissingError: login-XHR завершился со статусом 200, но редиректа со /signin/ не случилось за 30 с — подозрение на фронт biz.erp
--- причина (playwright) ---
Timeout 30000ms exceeded.
=========================== logs ===========================
waiting for navigation to "<function ImplToApiMapping.wrap_handler.<locals>.wrapper_func at 0x7f868befdbc0>" until 'commit'
navigated to "https://erp-testops-dev.infra.altegio.cloud/signin/"
navigated to "https://erp-testops-dev.infra.altegio.cloud/signin/"
navigated to "https://erp-testops-dev.infra.altegio.cloud/signin/JTJGdGltZXRhYmxlJTJGMTYzNjk3NjYlMkY="
navigated to "https://erp-testops-dev.infra.altegio.cloud/signin/JTJGdGltZXRhYmxlJTJGMTYzNjk3NjYlMkY="
navigated to "https://erp-testops-dev.infra.altegio.cloud/signin/JTJGdGltZXRhYmxlJTJGMTYzNjk3NjYlMkY="
============================================================
Stacktrace:
suite/yclients/biz/erp/web/billing/license/test_billing_non_eu_incomplete_address_blocked_pw.py:56 in test_billing_non_eu_incomplete_address_blocked
lib/apps_pw/yclients/biz/erp/web/pages/guest/signin.py:115 in sign_in
Seen in: - altegio/biz.erp#227787 — shard 6 — launch 171752 (×1, last 2026-10-02 11:50 MSK)