Запись клиента без телефона на событие¶
test_biz_erp_activity_record_client_without_phone
Failures in last 30 days: 8
Generated at 2026-10-08 03:53 MSK
Last failure: 2026-10-02 11:50 MSK
Filter: pipelines with sandbox_biz_erp ∈ {master, testops-dev} AND autotests_branch ∈ {master, main} only (testops-dev — daytime ticks since 2026-08-05).
🏥 4 of these ran under the quarantine tier: XFAIL, pipeline stayed green, excluded from the red statistics and incidents (see Карантин).
By exception class:
- TimeoutError — 4
- SigninRedirectMissingError — 2
- AssertionError — 1
- KeyError — 1
Failure signatures (grouped by exception + full message):
AssertionError — 1 occurrence(s) across 1 pipeline(s)¶
AssertionError: Locator expected to be visible
Actual value: None
Error: element(s) not found
Call log:
- Expect "to_be_visible" with timeout 30000ms
- waiting for locator("[data-locator~='alert_item']").first
Stacktrace:
suite/yclients/biz/erp/web/activities/test_record_on_activities_pw.py:1200 in test_biz_erp_activity_record_client_without_phone
lib/apps_pw/yclients/biz/erp/web/pages/__init__.py:77 in decorated
lib/apps_pw/yclients/biz/erp/web/pages/popup/tabs/timetable/activities.py:1547 in click_add_record
Seen in: - altegio/biz.erp#226698 — shard 7 — launch 169315 (×1, last 2026-09-28 22:50 MSK)
🏥 KeyError — 1 occurrence(s) across 1 pipeline(s)¶
KeyError: 'salon_with_entities'
Seen in: - altegio/biz.erp#227749 — shard 5 — launch 171616 (×1, last 2026-10-02 08:20 MSK)
🏥 SigninRedirectMissingError — 1 occurrence(s) across 1 pipeline(s)¶
autotests.lib.exception.SigninRedirectMissingError: login-XHR завершился со статусом 200, но редиректа со /signin/ не случилось за 30 с — подозрение на фронт biz.erp
--- причина (playwright) ---
Timeout 30000ms exceeded.
=========================== logs ===========================
waiting for navigation to "<function ImplToApiMapping.wrap_handler.<locals>.wrapper_func at 0x7f2d4045cd60>" until 'commit'
navigated to "https://erp-testops-dev.infra.altegio.cloud/signin/"
navigated to "https://erp-testops-dev.infra.altegio.cloud/signin/"
navigated to "https://erp-testops-dev.infra.altegio.cloud/signin/JTJGdGltZXRhYmxlJTJGMTYzNjE4NzglMkY="
navigated to "https://erp-testops-dev.infra.altegio.cloud/signin/JTJGdGltZXRhYmxlJTJGMTYzNjE4NzglMkY="
navigated to "https://erp-testops-dev.infra.altegio.cloud/signin/JTJGdGltZXRhYmxlJTJGMTYzNjE4NzglMkY="
============================================================
Stacktrace:
suite/yclients/biz/erp/web/activities/test_record_on_activities_pw.py:1184 in test_biz_erp_activity_record_client_without_phone
lib/apps_pw/yclients/biz/erp/web/pages/guest/signin.py:115 in sign_in
Seen in: - altegio/biz.erp#227735 — shard 1 — launch 171549 (×1, last 2026-10-02 06:23 MSK)
🏥 SigninRedirectMissingError — 1 occurrence(s) across 1 pipeline(s)¶
autotests.lib.exception.SigninRedirectMissingError: login-XHR завершился со статусом 200, но редиректа со /signin/ не случилось за 30 с — подозрение на фронт biz.erp
--- причина (playwright) ---
Timeout 30000ms exceeded.
=========================== logs ===========================
waiting for navigation to "<function ImplToApiMapping.wrap_handler.<locals>.wrapper_func at 0x7fa26031f740>" until 'commit'
navigated to "https://erp-testops-dev.infra.altegio.cloud/signin/"
navigated to "https://erp-testops-dev.infra.altegio.cloud/signin/"
navigated to "https://erp-testops-dev.infra.altegio.cloud/signin/JTJGdGltZXRhYmxlJTJGMTYzNzEwMjQlMkY="
navigated to "https://erp-testops-dev.infra.altegio.cloud/signin/JTJGdGltZXRhYmxlJTJGMTYzNzEwMjQlMkY="
navigated to "https://erp-testops-dev.infra.altegio.cloud/signin/JTJGdGltZXRhYmxlJTJGMTYzNzEwMjQlMkY="
============================================================
Stacktrace:
suite/yclients/biz/erp/web/activities/test_record_on_activities_pw.py:1184 in test_biz_erp_activity_record_client_without_phone
lib/apps_pw/yclients/biz/erp/web/pages/guest/signin.py:115 in sign_in
Seen in: - altegio/biz.erp#227787 — shard 8 — launch 171752 (×1, last 2026-10-02 11:50 MSK)
TimeoutError — 1 occurrence(s) across 1 pipeline(s)¶
playwright._impl._errors.TimeoutError: Locator.click: Timeout 30000ms exceeded.
Call log:
- waiting for locator("[data-locator~='alert_item']").first.locator("[data-locator='alert_close_btn']").first
- locator resolved to <button tabindex="0" type="button" data-locator="alert_close_btn" class="q-btn q-btn-item non-selectable no-outline q-btn--flat q-btn--rectangle q-btn--actionable q-focusable q-hoverable yc-toast__close-button yc-btn yc-btn_variant-ghost-dark yc-btn_ghost yc-btn_small yc-btn_default yc-btn_align-center">…</button>
- attempting click action
2 × waiting for element to be visible, enabled and stable
- element is not stable
- retrying click action
- waiting 20ms
2 × waiting for element to be visible, enabled and stable
- element is visible, enabled and stable
- scrolling into view if needed
- done scrolling
- <h1>There was an automatic logout</h1> from <div class="v-error-modal v-error-modal--unauthorized v-error-modal__fade-enter-active v-error-modal__fade-enter-to">…</div> subtree intercepts pointer events
- retrying click action
- waiting 100ms
40 × waiting for element to be visible, enabled and stable
- element is visible, enabled and stable
- scrolling into view if needed
- done scrolling
- <h1>There was an automatic logout</h1> from <div class="v-error-modal v-error-modal--unauthorized">…</div> subtree intercepts pointer events
- retrying click action
- waiting 500ms
- waiting for element to be visible, enabled and stable
- element is not stable
- retrying click action
- waiting 500ms
- waiting for element to be visible, enabled and stable
- element was detached from the DOM, retrying
Stacktrace:
suite/yclients/biz/erp/web/activities/test_record_on_activities_pw.py:1200 in test_biz_erp_activity_record_client_without_phone
lib/apps_pw/yclients/biz/erp/web/pages/__init__.py:77 in decorated
lib/apps_pw/yclients/biz/erp/web/pages/popup/tabs/timetable/activities.py:1553 in click_add_record
Seen in: - altegio/biz.erp#227596 — shard 4 — launch 171280 (×1, last 2026-10-01 17:40 MSK)
TimeoutError — 1 occurrence(s) across 1 pipeline(s)¶
playwright._impl._errors.TimeoutError: Locator.click: Timeout 30000ms exceeded.
Call log:
- waiting for locator("div#calendar-block").locator("td[data-handler=\"selectDay\"]:not([class*=\"ui-datepicker-other-month\"])").filter(has=locator("[class*=\"ui-datepicker-day-text\"]").filter(has_text=re.compile(r"^\s*2\s*$"))).first.locator("a")
- locator resolved to <a href="#" class="ui-state-default">…</a>
- attempting click action
2 × waiting for element to be visible, enabled and stable
- element is visible, enabled and stable
- scrolling into view if needed
- done scrolling
- <a target="_self" class="yc-link yc-link_light" href="https://erp-testops-dev.infra.altegio.cloud/timetable/16356281/#mode=1">Reload this Page</a> from <div class="v-error-modal v-error-modal--unauthorized v-error-modal__fade-enter-active v-error-modal__fade-enter-to">…</div> subtree intercepts pointer events
- retrying click action
- waiting 20ms
- waiting for element to be visible, enabled and stable
- element is visible, enabled and stable
- scrolling into view if needed
- done scrolling
- <a target="_self" class="yc-link yc-link_light" href="https://erp-testops-dev.infra.altegio.cloud/timetable/16356281/#mode=1">Reload this Page</a> from <div class="v-error-modal v-error-modal--unauthorized v-error-modal__fade-enter-active v-error-modal__fade-enter-to">…</div> subtree intercepts pointer events
2 × retrying click action
- waiting 100ms
- waiting for element to be visible, enabled and stable
- element is visible, enabled and stable
- scrolling into view if needed
- done scrolling
- <div class="v-error-modal v-error-modal--unauthorized">…</div> intercepts pointer events
13 × retrying click action
- waiting 500ms
- waiting for element to be visible, enabled and stable
- element is visible, enabled and stable
- scrolling into view if needed
- done scrolling
- <a target="_self" class="yc-link yc-link_light" href="https://erp-testops-dev.infra.altegio.cloud/timetable/16356281/#mode=1">Reload this Page</a> from <div class="v-error-modal v-error-modal--unauthorized">…</div> subtree intercepts pointer events
- retrying click action
- waiting 500ms
- waiting for element to be visible, enabled and stable
- element is visible, enabled and stable
- scrolling into view if needed
- done scrolling
- <a target="_self" class="yc-link yc-link_light" href="https://erp-testops-dev.infra.altegio.cloud/timetable/16356281/#mode=1">Reload this Page</a> from <div class="v-error-modal v-error-modal--unauthorized">…</div> subtree intercepts pointer events
- retrying click action
- waiting 500ms
- waiting for element to be visible, enabled and stable
- element is visible, enabled and stable
- scrolling into view if needed
- done scrolling
- <div class="v-error-modal v-error-modal--unauthorized">…</div> intercepts pointer events
- retrying click action
- waiting 500ms
- waiting for element to be visible, enabled and stable
- element is visible, enabled and stable
- scrolling into view if needed
- done scrolling
- <div class="v-error-modal v-error-modal--unauthorized">…</div> intercepts pointer events
2 × retrying click action
- waiting 500ms
- waiting for element to be visible, enabled and stable
- element is visible, enabled and stable
- scrolling into view if needed
- done scrolling
- <a target="_self" class="yc-link yc-link_light" href="https://erp-testops-dev.infra.altegio.cloud/timetable/16356281/#mode=1">Reload this Page</a> from <div class="v-error-modal v-error-modal--unauthorized">…</div> subtree intercepts pointer events
- retrying click action
- waiting 500ms
- waiting for element to be visible, enabled and stable
- element is visible, enab... [truncated]
Stacktrace:
suite/yclients/biz/erp/web/activities/test_record_on_activities_pw.py:1191 in test_biz_erp_activity_record_client_without_phone
lib/apps_pw/yclients/biz/erp/web/pages/__init__.py:77 in decorated
lib/apps_pw/yclients/biz/erp/web/pages/user.py:497 in open_timetable
lib/apps_pw/yclients/biz/erp/web/pages/user.py:635 in _set_calendar_date
lib/apps_pw/yclients/biz/erp/web/pages/user.py:621 in _navigate_and_click
Seen in: - altegio/biz.erp#227596 — shard 4 — launch 171280 (×1, last 2026-10-01 17:40 MSK)
TimeoutError — 1 occurrence(s) across 1 pipeline(s)¶
playwright._impl._errors.TimeoutError: Locator.click: Timeout 30000ms exceeded.
Call log:
- waiting for locator("[data-locator~='alert_item']").first.locator("[data-locator='alert_close_btn']").first
- locator resolved to <button tabindex="0" type="button" data-locator="alert_close_btn" class="q-btn q-btn-item non-selectable no-outline q-btn--flat q-btn--rectangle q-btn--actionable q-focusable q-hoverable yc-toast__close-button yc-btn yc-btn_variant-ghost-dark yc-btn_ghost yc-btn_small yc-btn_default yc-btn_align-center">…</button>
- attempting click action
2 × waiting for element to be visible, enabled and stable
- element is not stable
- retrying click action
- waiting 20ms
- waiting for element to be visible, enabled and stable
- element is not stable
- retrying click action
- waiting 100ms
- waiting for element to be visible, enabled and stable
- element is visible, enabled and stable
- scrolling into view if needed
- done scrolling
- <h1>There was an automatic logout</h1> from <div class="v-error-modal v-error-modal--unauthorized v-error-modal__fade-enter-active v-error-modal__fade-enter-to">…</div> subtree intercepts pointer events
- retrying click action
- waiting 100ms
40 × waiting for element to be visible, enabled and stable
- element is visible, enabled and stable
- scrolling into view if needed
- done scrolling
- <h1>There was an automatic logout</h1> from <div class="v-error-modal v-error-modal--unauthorized">…</div> subtree intercepts pointer events
- retrying click action
- waiting 500ms
- waiting for element to be visible, enabled and stable
- element is not stable
- retrying click action
- waiting 500ms
- waiting for element to be visible, enabled and stable
- element was detached from the DOM, retrying
Stacktrace:
suite/yclients/biz/erp/web/activities/test_record_on_activities_pw.py:1200 in test_biz_erp_activity_record_client_without_phone
lib/apps_pw/yclients/biz/erp/web/pages/__init__.py:77 in decorated
lib/apps_pw/yclients/biz/erp/web/pages/popup/tabs/timetable/activities.py:1553 in click_add_record
Seen in: - altegio/biz.erp#227596 — shard 4 — launch 171280 (×1, last 2026-10-01 17:40 MSK)
🏥 TimeoutError — 1 occurrence(s) across 1 pipeline(s)¶
playwright._impl._errors.TimeoutError: Locator.click: Timeout 30000ms exceeded.
Call log:
- waiting for locator("div#calendar-block").locator("td[data-handler=\"selectDay\"]:not([class*=\"ui-datepicker-other-month\"])").filter(has=locator("[class*=\"ui-datepicker-day-text\"]").filter(has_text=re.compile(r"^\s*3\s*$"))).first.locator("a")
- locator resolved to <a href="#" class="ui-state-default">…</a>
- attempting click action
2 × waiting for element to be visible, enabled and stable
- element is visible, enabled and stable
- scrolling into view if needed
- done scrolling
- <a target="_self" class="yc-link yc-link_light" href="https://erp-testops-dev.infra.altegio.cloud/timetable/16357902/#mode=1">Reload this Page</a> from <div class="v-error-modal v-error-modal--unauthorized v-error-modal__fade-enter-active v-error-modal__fade-enter-to">…</div> subtree intercepts pointer events
- retrying click action
- waiting 20ms
- waiting for element to be visible, enabled and stable
- element is visible, enabled and stable
- scrolling into view if needed
- done scrolling
- <a target="_self" class="yc-link yc-link_light" href="https://erp-testops-dev.infra.altegio.cloud/timetable/16357902/#mode=1">Reload this Page</a> from <div class="v-error-modal v-error-modal--unauthorized v-error-modal__fade-enter-active v-error-modal__fade-enter-to">…</div> subtree intercepts pointer events
2 × retrying click action
- waiting 100ms
- waiting for element to be visible, enabled and stable
- element is visible, enabled and stable
- scrolling into view if needed
- done scrolling
- <div class="v-error-modal v-error-modal--unauthorized">…</div> intercepts pointer events
13 × retrying click action
- waiting 500ms
- waiting for element to be visible, enabled and stable
- element is visible, enabled and stable
- scrolling into view if needed
- done scrolling
- <a target="_self" class="yc-link yc-link_light" href="https://erp-testops-dev.infra.altegio.cloud/timetable/16357902/#mode=1">Reload this Page</a> from <div class="v-error-modal v-error-modal--unauthorized">…</div> subtree intercepts pointer events
- retrying click action
- waiting 500ms
- waiting for element to be visible, enabled and stable
- element is visible, enabled and stable
- scrolling into view if needed
- done scrolling
- <a target="_self" class="yc-link yc-link_light" href="https://erp-testops-dev.infra.altegio.cloud/timetable/16357902/#mode=1">Reload this Page</a> from <div class="v-error-modal v-error-modal--unauthorized">…</div> subtree intercepts pointer events
- retrying click action
- waiting 500ms
- waiting for element to be visible, enabled and stable
- element is visible, enabled and stable
- scrolling into view if needed
- done scrolling
- <div class="v-error-modal v-error-modal--unauthorized">…</div> intercepts pointer events
- retrying click action
- waiting 500ms
- waiting for element to be visible, enabled and stable
- element is visible, enabled and stable
- scrolling into view if needed
- done scrolling
- <div class="v-error-modal v-error-modal--unauthorized">…</div> intercepts pointer events
2 × retrying click action
- waiting 500ms
- waiting for element to be visible, enabled and stable
- element is visible, enabled and stable
- scrolling into view if needed
- done scrolling
- <a target="_self" class="yc-link yc-link_light" href="https://erp-testops-dev.infra.altegio.cloud/timetable/16357902/#mode=1">Reload this Page</a> from <div class="v-error-modal v-error-modal--unauthorized">…</div> subtree intercepts pointer events
- retrying click action
- waiting 500ms
- waiting for element to be visible, enabled and stable
- element is visible, enab... [truncated]
Stacktrace:
suite/yclients/biz/erp/web/activities/test_record_on_activities_pw.py:1191 in test_biz_erp_activity_record_client_without_phone
lib/apps_pw/yclients/biz/erp/web/pages/__init__.py:77 in decorated
lib/apps_pw/yclients/biz/erp/web/pages/user.py:497 in open_timetable
lib/apps_pw/yclients/biz/erp/web/pages/user.py:635 in _set_calendar_date
lib/apps_pw/yclients/biz/erp/web/pages/user.py:621 in _navigate_and_click
Seen in: - altegio/biz.erp#227722 — shard 5 — launch 171516 (×1, last 2026-10-02 04:26 MSK)