Skip to content

Записаться повторно, когда услуга не менялась - Запись уже прошла

test_book_again_booking_is_gone

Failures in last 30 days: 29

Generated at 2026-10-08 03:53 MSK

Last failure: 2026-10-05 15:26 MSK

Filter: pipelines with sandbox_biz_erp ∈ {master, testops-dev} AND autotests_branch ∈ {master, main} only (testops-dev — daytime ticks since 2026-08-05).

By exception class: - TimeoutException — 26 - WebDriverException — 3

Failure signatures (grouped by exception + full message):

TimeoutException — 1 occurrence(s) across 1 pipeline(s)

selenium.common.exceptions.TimeoutException: Message: Ожидаем элемент в DOM: "[class="header-addition-sticky-inner-container"]", параметры метода ожидания: ([
    "css selector",
    "None",
    "[class=\"header-addition-sticky-inner-container\"]",
    "<autotests.lib.apps.yclients.client.booking.web.pages.select_time.SelectTimePage object at 0x7f803c552660>"
]), условия ожидания: ([
    "timeout: 25s"
])
Stacktrace:
#0 0x557dc7a565e3 <unknown>
#1 0x557dc77190b7 <unknown>
#2 0x557dc7766f53 <unknown>
#3 0x557dc7767051 <unknown>
#4 0x557dc77ac9c4 <unknown>
#5 0x557dc778df1d <unknown>
#6 0x557dc77a9b3d <unknown>
#7 0x557dc778dcc3 <unknown>
#8 0x557dc77590e4 <unknown>
#9 0x557dc775a0ae <unknown>
#10 0x557dc7a1cce1 <unknown>
#11 0x557dc7a20b7e <unknown>
#12 0x557dc7a0a4b5 <unknown>
#13 0x557dc7a217d6 <unknown>
#14 0x557dc79eddbf <unknown>
#15 0x557dc7a44748 <unknown>
#16 0x557dc7a44917 <unknown>
#17 0x557dc7a55773 <unknown>
#18 0x7f63a8814aa4 <unknown>
#19 0x7f63a88a1a64 __clone

Stacktrace:

lib/common/ui/pages/web.py:61 in decorated
lib/apps/yclients/client/booking/web/pages/select_time.py:267 in get_days_list
lib/common/ui/pages/web.py:61 in decorated
lib/common/ui/pages/web.py:148 in wait_for_element
lib/ui/selenium/webdriver/support/wait.py:28 in until

Seen in: - altegio/biz.erp#222716 — shard 1 — launch 160569 (×1, last 2026-09-10 11:23 MSK)

TimeoutException — 1 occurrence(s) across 1 pipeline(s)

selenium.common.exceptions.TimeoutException: Message: Ожидаем элемент в DOM: "[class="header-addition-sticky-inner-container"]", параметры метода ожидания: ([
    "css selector",
    "None",
    "[class=\"header-addition-sticky-inner-container\"]",
    "<autotests.lib.apps.yclients.client.booking.web.pages.select_time.SelectTimePage object at 0x7fb25fe1df70>"
]), условия ожидания: ([
    "timeout: 25s"
])
Stacktrace:
#0 0x562c907fa5e3 <unknown>
#1 0x562c904bd0b7 <unknown>
#2 0x562c9050af53 <unknown>
#3 0x562c9050b051 <unknown>
#4 0x562c905509c4 <unknown>
#5 0x562c90531f1d <unknown>
#6 0x562c9054db3d <unknown>
#7 0x562c90531cc3 <unknown>
#8 0x562c904fd0e4 <unknown>
#9 0x562c904fe0ae <unknown>
#10 0x562c907c0ce1 <unknown>
#11 0x562c907c4b7e <unknown>
#12 0x562c907ae4b5 <unknown>
#13 0x562c907c57d6 <unknown>
#14 0x562c90791dbf <unknown>
#15 0x562c907e8748 <unknown>
#16 0x562c907e8917 <unknown>
#17 0x562c907f9773 <unknown>
#18 0x7f02ecbaaaa4 <unknown>
#19 0x7f02ecc37a64 __clone

Stacktrace:

lib/common/ui/pages/web.py:61 in decorated
lib/apps/yclients/client/booking/web/pages/select_time.py:267 in get_days_list
lib/common/ui/pages/web.py:61 in decorated
lib/common/ui/pages/web.py:148 in wait_for_element
lib/ui/selenium/webdriver/support/wait.py:28 in until

Seen in: - testops/autotests#222743 — shard 8 — launch 160683 (×1, last 2026-09-10 12:45 MSK)

TimeoutException — 1 occurrence(s) across 1 pipeline(s)

selenium.common.exceptions.TimeoutException: Message: Ожидаем элемент в DOM: "[class="header-addition-sticky-inner-container"]", параметры метода ожидания: ([
    "css selector",
    "None",
    "[class=\"header-addition-sticky-inner-container\"]",
    "<autotests.lib.apps.yclients.client.booking.web.pages.select_time.SelectTimePage object at 0x7fd35937e150>"
]), условия ожидания: ([
    "timeout: 25s"
])
Stacktrace:
#0 0x5589428f05e3 <unknown>
#1 0x5589425b30b7 <unknown>
#2 0x558942600f53 <unknown>
#3 0x558942601051 <unknown>
#4 0x5589426469c4 <unknown>
#5 0x558942627f1d <unknown>
#6 0x558942643b3d <unknown>
#7 0x558942627cc3 <unknown>
#8 0x5589425f30e4 <unknown>
#9 0x5589425f40ae <unknown>
#10 0x5589428b6ce1 <unknown>
#11 0x5589428bab7e <unknown>
#12 0x5589428a44b5 <unknown>
#13 0x5589428bb7d6 <unknown>
#14 0x558942887dbf <unknown>
#15 0x5589428de748 <unknown>
#16 0x5589428de917 <unknown>
#17 0x5589428ef773 <unknown>
#18 0x7fc3997e1aa4 <unknown>
#19 0x7fc39986ea64 __clone

Stacktrace:

lib/common/ui/pages/web.py:61 in decorated
lib/apps/yclients/client/booking/web/pages/select_time.py:267 in get_days_list
lib/common/ui/pages/web.py:61 in decorated
lib/common/ui/pages/web.py:148 in wait_for_element
lib/ui/selenium/webdriver/support/wait.py:28 in until

Seen in: - testops/autotests#222743 — shard 8 — launch 160683 (×1, last 2026-09-10 12:45 MSK)

TimeoutException — 1 occurrence(s) across 1 pipeline(s)

selenium.common.exceptions.TimeoutException: Message: Ожидаем элемент в DOM: "[class="header-addition-sticky-inner-container"]", параметры метода ожидания: ([
    "css selector",
    "None",
    "[class=\"header-addition-sticky-inner-container\"]",
    "<autotests.lib.apps.yclients.client.booking.web.pages.select_time.SelectTimePage object at 0x7f38a451c1d0>"
]), условия ожидания: ([
    "timeout: 25s"
])
Stacktrace:
#0 0x564b80e135e3 <unknown>
#1 0x564b80ad60b7 <unknown>
#2 0x564b80b23f53 <unknown>
#3 0x564b80b24051 <unknown>
#4 0x564b80b699c4 <unknown>
#5 0x564b80b4af1d <unknown>
#6 0x564b80b66b3d <unknown>
#7 0x564b80b4acc3 <unknown>
#8 0x564b80b160e4 <unknown>
#9 0x564b80b170ae <unknown>
#10 0x564b80dd9ce1 <unknown>
#11 0x564b80dddb7e <unknown>
#12 0x564b80dc74b5 <unknown>
#13 0x564b80dde7d6 <unknown>
#14 0x564b80daadbf <unknown>
#15 0x564b80e01748 <unknown>
#16 0x564b80e01917 <unknown>
#17 0x564b80e12773 <unknown>
#18 0x7f2cc2b38aa4 <unknown>
#19 0x7f2cc2bc5a64 __clone

Stacktrace:

lib/common/ui/pages/web.py:61 in decorated
lib/apps/yclients/client/booking/web/pages/select_time.py:267 in get_days_list
lib/common/ui/pages/web.py:61 in decorated
lib/common/ui/pages/web.py:148 in wait_for_element
lib/ui/selenium/webdriver/support/wait.py:28 in until

Seen in: - testops/autotests#222822 — shard 7 — launch 160945 (×1, last 2026-09-10 17:43 MSK)

TimeoutException — 1 occurrence(s) across 1 pipeline(s)

selenium.common.exceptions.TimeoutException: Message: Ожидаем элемент в DOM: "[class="header-addition-sticky-inner-container"]", параметры метода ожидания: ([
    "css selector",
    "None",
    "[class=\"header-addition-sticky-inner-container\"]",
    "<autotests.lib.apps.yclients.client.booking.web.pages.select_time.SelectTimePage object at 0x7fc7209c9370>"
]), условия ожидания: ([
    "timeout: 25s"
])
Stacktrace:
#0 0x564be25635e3 <unknown>
#1 0x564be22260b7 <unknown>
#2 0x564be2273f53 <unknown>
#3 0x564be2274051 <unknown>
#4 0x564be22b99c4 <unknown>
#5 0x564be229af1d <unknown>
#6 0x564be22b6b3d <unknown>
#7 0x564be229acc3 <unknown>
#8 0x564be22660e4 <unknown>
#9 0x564be22670ae <unknown>
#10 0x564be2529ce1 <unknown>
#11 0x564be252db7e <unknown>
#12 0x564be25174b5 <unknown>
#13 0x564be252e7d6 <unknown>
#14 0x564be24fadbf <unknown>
#15 0x564be2551748 <unknown>
#16 0x564be2551917 <unknown>
#17 0x564be2562773 <unknown>
#18 0x7fe21d08faa4 <unknown>
#19 0x7fe21d11ca64 __clone

Stacktrace:

lib/common/ui/pages/web.py:61 in decorated
lib/apps/yclients/client/booking/web/pages/select_time.py:267 in get_days_list
lib/common/ui/pages/web.py:61 in decorated
lib/common/ui/pages/web.py:148 in wait_for_element
lib/ui/selenium/webdriver/support/wait.py:28 in until

Seen in: - altegio/biz.erp#222961 — shard 1 — launch 161285 (×1, last 2026-09-11 11:27 MSK)

TimeoutException — 1 occurrence(s) across 1 pipeline(s)

selenium.common.exceptions.TimeoutException: Message: Ожидаем элемент в DOM: "[class="header-addition-sticky-inner-container"]", параметры метода ожидания: ([
    "css selector",
    "None",
    "[class=\"header-addition-sticky-inner-container\"]",
    "<autotests.lib.apps.yclients.client.booking.web.pages.select_time.SelectTimePage object at 0x7fcd83c85400>"
]), условия ожидания: ([
    "timeout: 25s"
])
Stacktrace:
#0 0x5625ac5555e3 <unknown>
#1 0x5625ac2180b7 <unknown>
#2 0x5625ac265f53 <unknown>
#3 0x5625ac266051 <unknown>
#4 0x5625ac2ab9c4 <unknown>
#5 0x5625ac28cf1d <unknown>
#6 0x5625ac2a8b3d <unknown>
#7 0x5625ac28ccc3 <unknown>
#8 0x5625ac2580e4 <unknown>
#9 0x5625ac2590ae <unknown>
#10 0x5625ac51bce1 <unknown>
#11 0x5625ac51fb7e <unknown>
#12 0x5625ac5094b5 <unknown>
#13 0x5625ac5207d6 <unknown>
#14 0x5625ac4ecdbf <unknown>
#15 0x5625ac543748 <unknown>
#16 0x5625ac543917 <unknown>
#17 0x5625ac554773 <unknown>
#18 0x7f556ad7baa4 <unknown>
#19 0x7f556ae08a64 __clone

Stacktrace:

lib/common/ui/pages/web.py:61 in decorated
lib/apps/yclients/client/booking/web/pages/select_time.py:267 in get_days_list
lib/common/ui/pages/web.py:61 in decorated
lib/common/ui/pages/web.py:148 in wait_for_element
lib/ui/selenium/webdriver/support/wait.py:28 in until

Seen in: - altegio/biz.erp#223006 — shard 7 — launch 161459 (×1, last 2026-09-11 15:23 MSK)

TimeoutException — 1 occurrence(s) across 1 pipeline(s)

selenium.common.exceptions.TimeoutException: Message: Ожидаем элемент в DOM: "[class="header-addition-sticky-inner-container"]", параметры метода ожидания: ([
    "css selector",
    "None",
    "[class=\"header-addition-sticky-inner-container\"]",
    "<autotests.lib.apps.yclients.client.booking.web.pages.select_time.SelectTimePage object at 0x7f2fdc27c1d0>"
]), условия ожидания: ([
    "timeout: 25s"
])
Stacktrace:
#0 0x5635d70415e3 <unknown>
#1 0x5635d6d040b7 <unknown>
#2 0x5635d6d51f53 <unknown>
#3 0x5635d6d52051 <unknown>
#4 0x5635d6d979c4 <unknown>
#5 0x5635d6d78f1d <unknown>
#6 0x5635d6d94b3d <unknown>
#7 0x5635d6d78cc3 <unknown>
#8 0x5635d6d440e4 <unknown>
#9 0x5635d6d450ae <unknown>
#10 0x5635d7007ce1 <unknown>
#11 0x5635d700bb7e <unknown>
#12 0x5635d6ff54b5 <unknown>
#13 0x5635d700c7d6 <unknown>
#14 0x5635d6fd8dbf <unknown>
#15 0x5635d702f748 <unknown>
#16 0x5635d702f917 <unknown>
#17 0x5635d7040773 <unknown>
#18 0x7f6bf5125aa4 <unknown>
#19 0x7f6bf51b2a64 __clone

Stacktrace:

lib/common/ui/pages/web.py:61 in decorated
lib/apps/yclients/client/booking/web/pages/select_time.py:267 in get_days_list
lib/common/ui/pages/web.py:61 in decorated
lib/common/ui/pages/web.py:148 in wait_for_element
lib/ui/selenium/webdriver/support/wait.py:28 in until

Seen in: - altegio/biz.erp#223040 — shard 7 — launch 161600 (×1, last 2026-09-11 17:23 MSK)

TimeoutException — 1 occurrence(s) across 1 pipeline(s)

selenium.common.exceptions.TimeoutException: Message: Ожидаем элемент в DOM: "[class="header-addition-sticky-inner-container"]", параметры метода ожидания: ([
    "css selector",
    "None",
    "[class=\"header-addition-sticky-inner-container\"]",
    "<autotests.lib.apps.yclients.client.booking.web.pages.select_time.SelectTimePage object at 0x7fa7e42f78f0>"
]), условия ожидания: ([
    "timeout: 25s"
])
Stacktrace:
#0 0x55dcc355d5e3 <unknown>
#1 0x55dcc32200b7 <unknown>
#2 0x55dcc326df53 <unknown>
#3 0x55dcc326e051 <unknown>
#4 0x55dcc32b39c4 <unknown>
#5 0x55dcc3294f1d <unknown>
#6 0x55dcc32b0b3d <unknown>
#7 0x55dcc3294cc3 <unknown>
#8 0x55dcc32600e4 <unknown>
#9 0x55dcc32610ae <unknown>
#10 0x55dcc3523ce1 <unknown>
#11 0x55dcc3527b7e <unknown>
#12 0x55dcc35114b5 <unknown>
#13 0x55dcc35287d6 <unknown>
#14 0x55dcc34f4dbf <unknown>
#15 0x55dcc354b748 <unknown>
#16 0x55dcc354b917 <unknown>
#17 0x55dcc355c773 <unknown>
#18 0x7f68def48aa4 <unknown>
#19 0x7f68defd5a64 __clone

Stacktrace:

lib/common/ui/pages/web.py:61 in decorated
lib/apps/yclients/client/booking/web/pages/select_time.py:267 in get_days_list
lib/common/ui/pages/web.py:61 in decorated
lib/common/ui/pages/web.py:148 in wait_for_element
lib/ui/selenium/webdriver/support/wait.py:28 in until

Seen in: - altegio/biz.erp#223040 — shard 7 — launch 161600 (×1, last 2026-09-11 17:23 MSK)

TimeoutException — 1 occurrence(s) across 1 pipeline(s)

selenium.common.exceptions.TimeoutException: Message: Ожидаем элемент в DOM: "[class="header-addition-sticky-inner-container"]", параметры метода ожидания: ([
    "css selector",
    "None",
    "[class=\"header-addition-sticky-inner-container\"]",
    "<autotests.lib.apps.yclients.client.booking.web.pages.select_time.SelectTimePage object at 0x7f73ac6161e0>"
]), условия ожидания: ([
    "timeout: 25s"
])
Stacktrace:
#0 0x55ed291215e3 <unknown>
#1 0x55ed28de40b7 <unknown>
#2 0x55ed28e31f53 <unknown>
#3 0x55ed28e32051 <unknown>
#4 0x55ed28e779c4 <unknown>
#5 0x55ed28e58f1d <unknown>
#6 0x55ed28e74b3d <unknown>
#7 0x55ed28e58cc3 <unknown>
#8 0x55ed28e240e4 <unknown>
#9 0x55ed28e250ae <unknown>
#10 0x55ed290e7ce1 <unknown>
#11 0x55ed290ebb7e <unknown>
#12 0x55ed290d54b5 <unknown>
#13 0x55ed290ec7d6 <unknown>
#14 0x55ed290b8dbf <unknown>
#15 0x55ed2910f748 <unknown>
#16 0x55ed2910f917 <unknown>
#17 0x55ed29120773 <unknown>
#18 0x7f5302ae2aa4 <unknown>
#19 0x7f5302b6fa64 __clone

Stacktrace:

lib/common/ui/pages/web.py:61 in decorated
lib/apps/yclients/client/booking/web/pages/select_time.py:267 in get_days_list
lib/common/ui/pages/web.py:61 in decorated
lib/common/ui/pages/web.py:148 in wait_for_element
lib/ui/selenium/webdriver/support/wait.py:28 in until

Seen in: - altegio/biz.erp#223252 — shard 5 — launch 161983 (×1, last 2026-09-14 07:41 MSK)

TimeoutException — 1 occurrence(s) across 1 pipeline(s)

selenium.common.exceptions.TimeoutException: Message: Ожидаем элемент в DOM: "[class="header-addition-sticky-inner-container"]", параметры метода ожидания: ([
    "css selector",
    "None",
    "[class=\"header-addition-sticky-inner-container\"]",
    "<autotests.lib.apps.yclients.client.booking.web.pages.select_time.SelectTimePage object at 0x7f4ed4662240>"
]), условия ожидания: ([
    "timeout: 25s"
])
Stacktrace:
#0 0x55719b8935e3 <unknown>
#1 0x55719b5560b7 <unknown>
#2 0x55719b5a3f53 <unknown>
#3 0x55719b5a4051 <unknown>
#4 0x55719b5e99c4 <unknown>
#5 0x55719b5caf1d <unknown>
#6 0x55719b5e6b3d <unknown>
#7 0x55719b5cacc3 <unknown>
#8 0x55719b5960e4 <unknown>
#9 0x55719b5970ae <unknown>
#10 0x55719b859ce1 <unknown>
#11 0x55719b85db7e <unknown>
#12 0x55719b8474b5 <unknown>
#13 0x55719b85e7d6 <unknown>
#14 0x55719b82adbf <unknown>
#15 0x55719b881748 <unknown>
#16 0x55719b881917 <unknown>
#17 0x55719b892773 <unknown>
#18 0x7f7887b94aa4 <unknown>
#19 0x7f7887c21a64 __clone

Stacktrace:

lib/common/ui/pages/web.py:61 in decorated
lib/apps/yclients/client/booking/web/pages/select_time.py:267 in get_days_list
lib/common/ui/pages/web.py:61 in decorated
lib/common/ui/pages/web.py:148 in wait_for_element
lib/ui/selenium/webdriver/support/wait.py:28 in until

Seen in: - altegio/biz.erp#224050 — shard 7 — launch 163643 (×1, last 2026-09-17 07:40 MSK)

TimeoutException — 1 occurrence(s) across 1 pipeline(s)

selenium.common.exceptions.TimeoutException: Message: Ожидаем элемент в DOM: "[class="header-addition-sticky-inner-container"]", параметры метода ожидания: ([
    "css selector",
    "None",
    "[class=\"header-addition-sticky-inner-container\"]",
    "<autotests.lib.apps.yclients.client.booking.web.pages.select_time.SelectTimePage object at 0x7f2fcc7356a0>"
]), условия ожидания: ([
    "timeout: 25s"
])
Stacktrace:
#0 0x5652038a65e3 <unknown>
#1 0x5652035690b7 <unknown>
#2 0x5652035b6f53 <unknown>
#3 0x5652035b7051 <unknown>
#4 0x5652035fc9c4 <unknown>
#5 0x5652035ddf1d <unknown>
#6 0x5652035f9b3d <unknown>
#7 0x5652035ddcc3 <unknown>
#8 0x5652035a90e4 <unknown>
#9 0x5652035aa0ae <unknown>
#10 0x56520386cce1 <unknown>
#11 0x565203870b7e <unknown>
#12 0x56520385a4b5 <unknown>
#13 0x5652038717d6 <unknown>
#14 0x56520383ddbf <unknown>
#15 0x565203894748 <unknown>
#16 0x565203894917 <unknown>
#17 0x5652038a5773 <unknown>
#18 0x7f28214ceaa4 <unknown>
#19 0x7f282155ba64 __clone

Stacktrace:

lib/common/ui/pages/web.py:61 in decorated
lib/apps/yclients/client/booking/web/pages/select_time.py:267 in get_days_list
lib/common/ui/pages/web.py:61 in decorated
lib/common/ui/pages/web.py:148 in wait_for_element
lib/ui/selenium/webdriver/support/wait.py:28 in until

Seen in: - altegio/biz.erp#224310 — shard 4 — launch 164233 (×1, last 2026-09-18 07:41 MSK)

TimeoutException — 1 occurrence(s) across 1 pipeline(s)

selenium.common.exceptions.TimeoutException: Message: Ожидаем элемент в DOM: "[class="header-addition-sticky-inner-container"]", параметры метода ожидания: ([
    "css selector",
    "None",
    "[class=\"header-addition-sticky-inner-container\"]",
    "<autotests.lib.apps.yclients.client.booking.web.pages.select_time.SelectTimePage object at 0x7f3ce43310a0>"
]), условия ожидания: ([
    "timeout: 25s"
])
Stacktrace:
#0 0x5609023b15e3 <unknown>
#1 0x5609020740b7 <unknown>
#2 0x5609020c1f53 <unknown>
#3 0x5609020c2051 <unknown>
#4 0x5609021079c4 <unknown>
#5 0x5609020e8f1d <unknown>
#6 0x560902104b3d <unknown>
#7 0x5609020e8cc3 <unknown>
#8 0x5609020b40e4 <unknown>
#9 0x5609020b50ae <unknown>
#10 0x560902377ce1 <unknown>
#11 0x56090237bb7e <unknown>
#12 0x5609023654b5 <unknown>
#13 0x56090237c7d6 <unknown>
#14 0x560902348dbf <unknown>
#15 0x56090239f748 <unknown>
#16 0x56090239f917 <unknown>
#17 0x5609023b0773 <unknown>
#18 0x7f456cdd2aa4 <unknown>
#19 0x7f456ce5fa64 __clone

Stacktrace:

lib/common/ui/pages/web.py:61 in decorated
lib/apps/yclients/client/booking/web/pages/select_time.py:267 in get_days_list
lib/common/ui/pages/web.py:61 in decorated
lib/common/ui/pages/web.py:148 in wait_for_element
lib/ui/selenium/webdriver/support/wait.py:28 in until

Seen in: - altegio/biz.erp#224310 — shard 4 — launch 164233 (×1, last 2026-09-18 07:41 MSK)

TimeoutException — 1 occurrence(s) across 1 pipeline(s)

selenium.common.exceptions.TimeoutException: Message: Ожидаем элемент в DOM: "[class="header-addition-sticky-inner-container"]", параметры метода ожидания: ([
    "css selector",
    "None",
    "[class=\"header-addition-sticky-inner-container\"]",
    "<autotests.lib.apps.yclients.client.booking.web.pages.select_time.SelectTimePage object at 0x7fa22a4e8da0>"
]), условия ожидания: ([
    "timeout: 25s"
])
Stacktrace:
#0 0x555b67aff5e3 <unknown>
#1 0x555b677c20b7 <unknown>
#2 0x555b6780ff53 <unknown>
#3 0x555b67810051 <unknown>
#4 0x555b678559c4 <unknown>
#5 0x555b67836f1d <unknown>
#6 0x555b67852b3d <unknown>
#7 0x555b67836cc3 <unknown>
#8 0x555b678020e4 <unknown>
#9 0x555b678030ae <unknown>
#10 0x555b67ac5ce1 <unknown>
#11 0x555b67ac9b7e <unknown>
#12 0x555b67ab34b5 <unknown>
#13 0x555b67aca7d6 <unknown>
#14 0x555b67a96dbf <unknown>
#15 0x555b67aed748 <unknown>
#16 0x555b67aed917 <unknown>
#17 0x555b67afe773 <unknown>
#18 0x7f922153baa4 <unknown>
#19 0x7f92215c8a64 __clone

Stacktrace:

lib/common/ui/pages/web.py:61 in decorated
lib/apps/yclients/client/booking/web/pages/select_time.py:267 in get_days_list
lib/common/ui/pages/web.py:61 in decorated
lib/common/ui/pages/web.py:148 in wait_for_element
lib/ui/selenium/webdriver/support/wait.py:28 in until

Seen in: - altegio/biz.erp#224751 — shard 7 — launch 165522 (×1, last 2026-09-21 15:39 MSK)

TimeoutException — 1 occurrence(s) across 1 pipeline(s)

selenium.common.exceptions.TimeoutException: Message: Ожидаем элемент в DOM: "[class="header-addition-sticky-inner-container"]", параметры метода ожидания: ([
    "css selector",
    "None",
    "[class=\"header-addition-sticky-inner-container\"]",
    "<autotests.lib.apps.yclients.client.booking.web.pages.select_time.SelectTimePage object at 0x7f5a6860e930>"
]), условия ожидания: ([
    "timeout: 25s"
])
Stacktrace:
#0 0x560c0d9715e3 <unknown>
#1 0x560c0d6340b7 <unknown>
#2 0x560c0d681f53 <unknown>
#3 0x560c0d682051 <unknown>
#4 0x560c0d6c79c4 <unknown>
#5 0x560c0d6a8f1d <unknown>
#6 0x560c0d6c4b3d <unknown>
#7 0x560c0d6a8cc3 <unknown>
#8 0x560c0d6740e4 <unknown>
#9 0x560c0d6750ae <unknown>
#10 0x560c0d937ce1 <unknown>
#11 0x560c0d93bb7e <unknown>
#12 0x560c0d9254b5 <unknown>
#13 0x560c0d93c7d6 <unknown>
#14 0x560c0d908dbf <unknown>
#15 0x560c0d95f748 <unknown>
#16 0x560c0d95f917 <unknown>
#17 0x560c0d970773 <unknown>
#18 0x7ff0ec2deaa4 <unknown>
#19 0x7ff0ec36ba64 __clone

Stacktrace:

lib/common/ui/pages/web.py:61 in decorated
lib/apps/yclients/client/booking/web/pages/select_time.py:267 in get_days_list
lib/common/ui/pages/web.py:61 in decorated
lib/common/ui/pages/web.py:148 in wait_for_element
lib/ui/selenium/webdriver/support/wait.py:28 in until

Seen in: - testops/autotests#224905 — shard 1 — launch 165939 (×1, last 2026-09-22 08:29 MSK)

TimeoutException — 1 occurrence(s) across 1 pipeline(s)

selenium.common.exceptions.TimeoutException: Message: Ожидаем элемент в DOM: "[class="header-addition-sticky-inner-container"]", параметры метода ожидания: ([
    "css selector",
    "None",
    "[class=\"header-addition-sticky-inner-container\"]",
    "<autotests.lib.apps.yclients.client.booking.web.pages.select_time.SelectTimePage object at 0x7f9f193da390>"
]), условия ожидания: ([
    "timeout: 25s"
])
Stacktrace:
#0 0x5630447f65e3 <unknown>
#1 0x5630444b90b7 <unknown>
#2 0x563044506f53 <unknown>
#3 0x563044507051 <unknown>
#4 0x56304454c9c4 <unknown>
#5 0x56304452df1d <unknown>
#6 0x563044549b3d <unknown>
#7 0x56304452dcc3 <unknown>
#8 0x5630444f90e4 <unknown>
#9 0x5630444fa0ae <unknown>
#10 0x5630447bcce1 <unknown>
#11 0x5630447c0b7e <unknown>
#12 0x5630447aa4b5 <unknown>
#13 0x5630447c17d6 <unknown>
#14 0x56304478ddbf <unknown>
#15 0x5630447e4748 <unknown>
#16 0x5630447e4917 <unknown>
#17 0x5630447f5773 <unknown>
#18 0x7f6a12630aa4 <unknown>
#19 0x7f6a126bda64 __clone

Stacktrace:

lib/common/ui/pages/web.py:61 in decorated
lib/apps/yclients/client/booking/web/pages/select_time.py:267 in get_days_list
lib/common/ui/pages/web.py:61 in decorated
lib/common/ui/pages/web.py:148 in wait_for_element
lib/ui/selenium/webdriver/support/wait.py:28 in until

Seen in: - altegio/biz.erp#225032 — shard 8 — launch 166375 (×1, last 2026-09-22 17:22 MSK)

TimeoutException — 1 occurrence(s) across 1 pipeline(s)

selenium.common.exceptions.TimeoutException: Message: Ожидаем элемент в DOM: "[class="header-addition-sticky-inner-container"]", параметры метода ожидания: ([
    "css selector",
    "None",
    "[class=\"header-addition-sticky-inner-container\"]",
    "<autotests.lib.apps.yclients.client.booking.web.pages.select_time.SelectTimePage object at 0x7f9149956120>"
]), условия ожидания: ([
    "timeout: 25s"
])
Stacktrace:
#0 0x563f59d815e3 <unknown>
#1 0x563f59a440b7 <unknown>
#2 0x563f59a91f53 <unknown>
#3 0x563f59a92051 <unknown>
#4 0x563f59ad79c4 <unknown>
#5 0x563f59ab8f1d <unknown>
#6 0x563f59ad4b3d <unknown>
#7 0x563f59ab8cc3 <unknown>
#8 0x563f59a840e4 <unknown>
#9 0x563f59a850ae <unknown>
#10 0x563f59d47ce1 <unknown>
#11 0x563f59d4bb7e <unknown>
#12 0x563f59d354b5 <unknown>
#13 0x563f59d4c7d6 <unknown>
#14 0x563f59d18dbf <unknown>
#15 0x563f59d6f748 <unknown>
#16 0x563f59d6f917 <unknown>
#17 0x563f59d80773 <unknown>
#18 0x7f07de20caa4 <unknown>
#19 0x7f07de299a64 __clone

Stacktrace:

lib/common/ui/pages/web.py:61 in decorated
lib/apps/yclients/client/booking/web/pages/select_time.py:267 in get_days_list
lib/common/ui/pages/web.py:61 in decorated
lib/common/ui/pages/web.py:148 in wait_for_element
lib/ui/selenium/webdriver/support/wait.py:28 in until

Seen in: - altegio/biz.erp#226609 — shard 7 — launch 169235 (×1, last 2026-09-28 17:21 MSK)

TimeoutException — 1 occurrence(s) across 1 pipeline(s)

selenium.common.exceptions.TimeoutException: Message: Ожидаем элемент в DOM: "[class="header-addition-sticky-inner-container"]", параметры метода ожидания: ([
    "css selector",
    "None",
    "[class=\"header-addition-sticky-inner-container\"]",
    "<autotests.lib.apps.yclients.client.booking.web.pages.select_time.SelectTimePage object at 0x7f0a7d95ba40>"
]), условия ожидания: ([
    "timeout: 25s"
])
Stacktrace:
#0 0x5616487005e3 <unknown>
#1 0x5616483c30b7 <unknown>
#2 0x561648410f53 <unknown>
#3 0x561648411051 <unknown>
#4 0x5616484569c4 <unknown>
#5 0x561648437f1d <unknown>
#6 0x561648453b3d <unknown>
#7 0x561648437cc3 <unknown>
#8 0x5616484030e4 <unknown>
#9 0x5616484040ae <unknown>
#10 0x5616486c6ce1 <unknown>
#11 0x5616486cab7e <unknown>
#12 0x5616486b44b5 <unknown>
#13 0x5616486cb7d6 <unknown>
#14 0x561648697dbf <unknown>
#15 0x5616486ee748 <unknown>
#16 0x5616486ee917 <unknown>
#17 0x5616486ff773 <unknown>
#18 0x7fc543b3caa4 <unknown>
#19 0x7fc543bc9a64 __clone

Stacktrace:

lib/common/ui/pages/web.py:61 in decorated
lib/apps/yclients/client/booking/web/pages/select_time.py:267 in get_days_list
lib/common/ui/pages/web.py:61 in decorated
lib/common/ui/pages/web.py:148 in wait_for_element
lib/ui/selenium/webdriver/support/wait.py:28 in until

Seen in: - altegio/biz.erp#226762 — shard 8 — launch 169417 (×1, last 2026-09-29 07:36 MSK)

TimeoutException — 1 occurrence(s) across 1 pipeline(s)

selenium.common.exceptions.TimeoutException: Message: Ожидаем элемент в DOM: "[class="header-addition-sticky-inner-container"]", параметры метода ожидания: ([
    "css selector",
    "None",
    "[class=\"header-addition-sticky-inner-container\"]",
    "<autotests.lib.apps.yclients.client.booking.web.pages.select_time.SelectTimePage object at 0x7f45dc49c050>"
]), условия ожидания: ([
    "timeout: 25s"
])
Stacktrace:
#0 0x562f3fff85e3 <unknown>
#1 0x562f3fcbb0b7 <unknown>
#2 0x562f3fd08f53 <unknown>
#3 0x562f3fd09051 <unknown>
#4 0x562f3fd4e9c4 <unknown>
#5 0x562f3fd2ff1d <unknown>
#6 0x562f3fd4bb3d <unknown>
#7 0x562f3fd2fcc3 <unknown>
#8 0x562f3fcfb0e4 <unknown>
#9 0x562f3fcfc0ae <unknown>
#10 0x562f3ffbece1 <unknown>
#11 0x562f3ffc2b7e <unknown>
#12 0x562f3ffac4b5 <unknown>
#13 0x562f3ffc37d6 <unknown>
#14 0x562f3ff8fdbf <unknown>
#15 0x562f3ffe6748 <unknown>
#16 0x562f3ffe6917 <unknown>
#17 0x562f3fff7773 <unknown>
#18 0x7fa15b04baa4 <unknown>
#19 0x7fa15b0d8a64 __clone

Stacktrace:

lib/common/ui/pages/web.py:61 in decorated
lib/apps/yclients/client/booking/web/pages/select_time.py:267 in get_days_list
lib/common/ui/pages/web.py:61 in decorated
lib/common/ui/pages/web.py:148 in wait_for_element
lib/ui/selenium/webdriver/support/wait.py:28 in until

Seen in: - altegio/client.booking#227257 — shard 8 — launch 170682 (×1, last 2026-09-30 16:29 MSK)

TimeoutException — 1 occurrence(s) across 1 pipeline(s)

selenium.common.exceptions.TimeoutException: Message: Ожидаем элемент в DOM: "[data-locator="booking_date"]", параметры метода ожидания: ([
    "css selector",
    "None",
    "[data-locator=\"booking_date\"]",
    "<autotests.lib.apps.yclients.client.booking.web.pages.created_booking.CreatedBookingPage object at 0x7f7248b3c770>"
]), условия ожидания: ([
    "timeout: 25s"
])
Stacktrace:
#0 0x564581cc85e3 <unknown>
#1 0x56458198b0b7 <unknown>
#2 0x5645819d8f53 <unknown>
#3 0x5645819d9051 <unknown>
#4 0x564581a1e9c4 <unknown>
#5 0x5645819fff1d <unknown>
#6 0x564581a1bb3d <unknown>
#7 0x5645819ffcc3 <unknown>
#8 0x5645819cb0e4 <unknown>
#9 0x5645819cc0ae <unknown>
#10 0x564581c8ece1 <unknown>
#11 0x564581c92b7e <unknown>
#12 0x564581c7c4b5 <unknown>
#13 0x564581c937d6 <unknown>
#14 0x564581c5fdbf <unknown>
#15 0x564581cb6748 <unknown>
#16 0x564581cb6917 <unknown>
#17 0x564581cc7773 <unknown>
#18 0x7fb04af15aa4 <unknown>
#19 0x7fb04afa2a64 __clone

Stacktrace:

lib/common/ui/pages/web.py:61 in decorated
lib/apps/yclients/client/booking/web/pages/created_booking.py:81 in get_booking_time
lib/common/ui/pages/web.py:61 in decorated
lib/common/ui/pages/web.py:148 in wait_for_element
lib/ui/selenium/webdriver/support/wait.py:28 in until

Seen in: - altegio/biz.erp#227735 — shard 3 — launch 171549 (×1, last 2026-10-02 06:23 MSK)

TimeoutException — 1 occurrence(s) across 1 pipeline(s)

selenium.common.exceptions.TimeoutException: Message: Ожидаем элемент в DOM: "[data-locator="booking_date"]", параметры метода ожидания: ([
    "css selector",
    "None",
    "[data-locator=\"booking_date\"]",
    "<autotests.lib.apps.yclients.client.booking.web.pages.created_booking.CreatedBookingPage object at 0x7f70c15d4170>"
]), условия ожидания: ([
    "timeout: 25s"
])
Stacktrace:
#0 0x563fdf4825e3 <unknown>
#1 0x563fdf1450b7 <unknown>
#2 0x563fdf192f53 <unknown>
#3 0x563fdf193051 <unknown>
#4 0x563fdf1d89c4 <unknown>
#5 0x563fdf1b9f1d <unknown>
#6 0x563fdf1d5b3d <unknown>
#7 0x563fdf1b9cc3 <unknown>
#8 0x563fdf1850e4 <unknown>
#9 0x563fdf1860ae <unknown>
#10 0x563fdf448ce1 <unknown>
#11 0x563fdf44cb7e <unknown>
#12 0x563fdf4364b5 <unknown>
#13 0x563fdf44d7d6 <unknown>
#14 0x563fdf419dbf <unknown>
#15 0x563fdf470748 <unknown>
#16 0x563fdf470917 <unknown>
#17 0x563fdf481773 <unknown>
#18 0x7ff81469caa4 <unknown>
#19 0x7ff814729a64 __clone

Stacktrace:

lib/common/ui/pages/web.py:61 in decorated
lib/apps/yclients/client/booking/web/pages/created_booking.py:81 in get_booking_time
lib/common/ui/pages/web.py:61 in decorated
lib/common/ui/pages/web.py:148 in wait_for_element
lib/ui/selenium/webdriver/support/wait.py:28 in until

Seen in: - altegio/biz.erp#227735 — shard 3 — launch 171549 (×1, last 2026-10-02 06:23 MSK)

TimeoutException — 1 occurrence(s) across 1 pipeline(s)

selenium.common.exceptions.TimeoutException: Message: Ожидаем элемент в DOM: "[data-locator="booking_date"]", параметры метода ожидания: ([
    "css selector",
    "None",
    "[data-locator=\"booking_date\"]",
    "<autotests.lib.apps.yclients.client.booking.web.pages.created_booking.CreatedBookingPage object at 0x7fc2c41a65a0>"
]), условия ожидания: ([
    "timeout: 25s"
])
Stacktrace:
#0 0x555c3e9545e3 <unknown>
#1 0x555c3e6170b7 <unknown>
#2 0x555c3e664f53 <unknown>
#3 0x555c3e665051 <unknown>
#4 0x555c3e6aa9c4 <unknown>
#5 0x555c3e68bf1d <unknown>
#6 0x555c3e6a7b3d <unknown>
#7 0x555c3e68bcc3 <unknown>
#8 0x555c3e6570e4 <unknown>
#9 0x555c3e6580ae <unknown>
#10 0x555c3e91ace1 <unknown>
#11 0x555c3e91eb7e <unknown>
#12 0x555c3e9084b5 <unknown>
#13 0x555c3e91f7d6 <unknown>
#14 0x555c3e8ebdbf <unknown>
#15 0x555c3e942748 <unknown>
#16 0x555c3e942917 <unknown>
#17 0x555c3e953773 <unknown>
#18 0x7fca62b58aa4 <unknown>
#19 0x7fca62be5a64 __clone

Stacktrace:

lib/common/ui/pages/web.py:61 in decorated
lib/apps/yclients/client/booking/web/pages/created_booking.py:81 in get_booking_time
lib/common/ui/pages/web.py:61 in decorated
lib/common/ui/pages/web.py:148 in wait_for_element
lib/ui/selenium/webdriver/support/wait.py:28 in until

Seen in: - altegio/biz.erp#227735 — shard 3 — launch 171549 (×1, last 2026-10-02 06:23 MSK)

TimeoutException — 1 occurrence(s) across 1 pipeline(s)

selenium.common.exceptions.TimeoutException: Message: Ожидаем элемент в DOM: "[data-locator="booking_date"]", параметры метода ожидания: ([
    "css selector",
    "None",
    "[data-locator=\"booking_date\"]",
    "<autotests.lib.apps.yclients.client.booking.web.pages.created_booking.CreatedBookingPage object at 0x7ff7b41dcbc0>"
]), условия ожидания: ([
    "timeout: 25s"
])
Stacktrace:
#0 0x55c3e1f455e3 <unknown>
#1 0x55c3e1c080b7 <unknown>
#2 0x55c3e1c55f53 <unknown>
#3 0x55c3e1c56051 <unknown>
#4 0x55c3e1c9b9c4 <unknown>
#5 0x55c3e1c7cf1d <unknown>
#6 0x55c3e1c98b3d <unknown>
#7 0x55c3e1c7ccc3 <unknown>
#8 0x55c3e1c480e4 <unknown>
#9 0x55c3e1c490ae <unknown>
#10 0x55c3e1f0bce1 <unknown>
#11 0x55c3e1f0fb7e <unknown>
#12 0x55c3e1ef94b5 <unknown>
#13 0x55c3e1f107d6 <unknown>
#14 0x55c3e1edcdbf <unknown>
#15 0x55c3e1f33748 <unknown>
#16 0x55c3e1f33917 <unknown>
#17 0x55c3e1f44773 <unknown>
#18 0x7f22d4fbfaa4 <unknown>
#19 0x7f22d504ca64 __clone

Stacktrace:

lib/common/ui/pages/web.py:61 in decorated
lib/apps/yclients/client/booking/web/pages/created_booking.py:81 in get_booking_time
lib/common/ui/pages/web.py:61 in decorated
lib/common/ui/pages/web.py:148 in wait_for_element
lib/ui/selenium/webdriver/support/wait.py:28 in until

Seen in: - altegio/biz.erp#227749 — shard 8 — launch 171616 (×1, last 2026-10-02 08:20 MSK)

TimeoutException — 1 occurrence(s) across 1 pipeline(s)

selenium.common.exceptions.TimeoutException: Message: Ожидаем элемент в DOM: "[data-locator="booking_date"]", параметры метода ожидания: ([
    "css selector",
    "None",
    "[data-locator=\"booking_date\"]",
    "<autotests.lib.apps.yclients.client.booking.web.pages.created_booking.CreatedBookingPage object at 0x7f76c82c79b0>"
]), условия ожидания: ([
    "timeout: 25s"
])
Stacktrace:
#0 0x5627064b85e3 <unknown>
#1 0x56270617b0b7 <unknown>
#2 0x5627061c8f53 <unknown>
#3 0x5627061c9051 <unknown>
#4 0x56270620e9c4 <unknown>
#5 0x5627061eff1d <unknown>
#6 0x56270620bb3d <unknown>
#7 0x5627061efcc3 <unknown>
#8 0x5627061bb0e4 <unknown>
#9 0x5627061bc0ae <unknown>
#10 0x56270647ece1 <unknown>
#11 0x562706482b7e <unknown>
#12 0x56270646c4b5 <unknown>
#13 0x5627064837d6 <unknown>
#14 0x56270644fdbf <unknown>
#15 0x5627064a6748 <unknown>
#16 0x5627064a6917 <unknown>
#17 0x5627064b7773 <unknown>
#18 0x7f901026eaa4 <unknown>
#19 0x7f90102fba64 __clone

Stacktrace:

lib/common/ui/pages/web.py:61 in decorated
lib/apps/yclients/client/booking/web/pages/created_booking.py:81 in get_booking_time
lib/common/ui/pages/web.py:61 in decorated
lib/common/ui/pages/web.py:148 in wait_for_element
lib/ui/selenium/webdriver/support/wait.py:28 in until

Seen in: - altegio/biz.erp#227787 — shard 7 — launch 171752 (×1, last 2026-10-02 11:50 MSK)

TimeoutException — 1 occurrence(s) across 1 pipeline(s)

selenium.common.exceptions.TimeoutException: Message: Ожидаем элемент в DOM: "[data-locator="booking_date"]", параметры метода ожидания: ([
    "css selector",
    "None",
    "[data-locator=\"booking_date\"]",
    "<autotests.lib.apps.yclients.client.booking.web.pages.created_booking.CreatedBookingPage object at 0x7ff9a1659eb0>"
]), условия ожидания: ([
    "timeout: 25s"
])
Stacktrace:
#0 0x55e73e3995e3 <unknown>
#1 0x55e73e05c0b7 <unknown>
#2 0x55e73e0a9f53 <unknown>
#3 0x55e73e0aa051 <unknown>
#4 0x55e73e0ef9c4 <unknown>
#5 0x55e73e0d0f1d <unknown>
#6 0x55e73e0ecb3d <unknown>
#7 0x55e73e0d0cc3 <unknown>
#8 0x55e73e09c0e4 <unknown>
#9 0x55e73e09d0ae <unknown>
#10 0x55e73e35fce1 <unknown>
#11 0x55e73e363b7e <unknown>
#12 0x55e73e34d4b5 <unknown>
#13 0x55e73e3647d6 <unknown>
#14 0x55e73e330dbf <unknown>
#15 0x55e73e387748 <unknown>
#16 0x55e73e387917 <unknown>
#17 0x55e73e398773 <unknown>
#18 0x7f800d260aa4 <unknown>
#19 0x7f800d2eda64 __clone

Stacktrace:

lib/common/ui/pages/web.py:61 in decorated
lib/apps/yclients/client/booking/web/pages/created_booking.py:81 in get_booking_time
lib/common/ui/pages/web.py:61 in decorated
lib/common/ui/pages/web.py:148 in wait_for_element
lib/ui/selenium/webdriver/support/wait.py:28 in until

Seen in: - altegio/biz.erp#227787 — shard 7 — launch 171752 (×1, last 2026-10-02 11:50 MSK)

TimeoutException — 1 occurrence(s) across 1 pipeline(s)

selenium.common.exceptions.TimeoutException: Message: Ожидаем элемент в DOM: "[class="header-addition-sticky-inner-container"]", параметры метода ожидания: ([
    "css selector",
    "None",
    "[class=\"header-addition-sticky-inner-container\"]",
    "<autotests.lib.apps.yclients.client.booking.web.pages.select_time.SelectTimePage object at 0x7f0df2e58800>"
]), условия ожидания: ([
    "timeout: 25s"
])
Stacktrace:
#0 0x557d0b9da5e3 <unknown>
#1 0x557d0b69d0b7 <unknown>
#2 0x557d0b6eaf53 <unknown>
#3 0x557d0b6eb051 <unknown>
#4 0x557d0b7309c4 <unknown>
#5 0x557d0b711f1d <unknown>
#6 0x557d0b72db3d <unknown>
#7 0x557d0b711cc3 <unknown>
#8 0x557d0b6dd0e4 <unknown>
#9 0x557d0b6de0ae <unknown>
#10 0x557d0b9a0ce1 <unknown>
#11 0x557d0b9a4b7e <unknown>
#12 0x557d0b98e4b5 <unknown>
#13 0x557d0b9a57d6 <unknown>
#14 0x557d0b971dbf <unknown>
#15 0x557d0b9c8748 <unknown>
#16 0x557d0b9c8917 <unknown>
#17 0x557d0b9d9773 <unknown>
#18 0x7faa68cddaa4 <unknown>
#19 0x7faa68d6aa64 __clone

Stacktrace:

lib/common/ui/pages/web.py:61 in decorated
lib/apps/yclients/client/booking/web/pages/select_time.py:267 in get_days_list
lib/common/ui/pages/web.py:61 in decorated
lib/common/ui/pages/web.py:148 in wait_for_element
lib/ui/selenium/webdriver/support/wait.py:28 in until

Seen in: - altegio/biz.erp#228425 — shard 5 — launch 172882 (×1, last 2026-10-05 11:20 MSK)

TimeoutException — 1 occurrence(s) across 1 pipeline(s)

selenium.common.exceptions.TimeoutException: Message: Ожидаем элемент в DOM: "[class="header-addition-sticky-inner-container"]", параметры метода ожидания: ([
    "css selector",
    "None",
    "[class=\"header-addition-sticky-inner-container\"]",
    "<autotests.lib.apps.yclients.client.booking.web.pages.select_time.SelectTimePage object at 0x7fac1ee13e60>"
]), условия ожидания: ([
    "timeout: 25s"
])
Stacktrace:
#0 0x559e705155e3 <unknown>
#1 0x559e701d80b7 <unknown>
#2 0x559e70225f53 <unknown>
#3 0x559e70226051 <unknown>
#4 0x559e7026b9c4 <unknown>
#5 0x559e7024cf1d <unknown>
#6 0x559e70268b3d <unknown>
#7 0x559e7024ccc3 <unknown>
#8 0x559e702180e4 <unknown>
#9 0x559e702190ae <unknown>
#10 0x559e704dbce1 <unknown>
#11 0x559e704dfb7e <unknown>
#12 0x559e704c94b5 <unknown>
#13 0x559e704e07d6 <unknown>
#14 0x559e704acdbf <unknown>
#15 0x559e70503748 <unknown>
#16 0x559e70503917 <unknown>
#17 0x559e70514773 <unknown>
#18 0x7f89897f3aa4 <unknown>
#19 0x7f8989880a64 __clone

Stacktrace:

lib/common/ui/pages/web.py:61 in decorated
lib/apps/yclients/client/booking/web/pages/select_time.py:267 in get_days_list
lib/common/ui/pages/web.py:61 in decorated
lib/common/ui/pages/web.py:148 in wait_for_element
lib/ui/selenium/webdriver/support/wait.py:28 in until

Seen in: - altegio/biz.erp#228484 — shard 4 — launch 173127 (×1, last 2026-10-05 15:26 MSK)

WebDriverException — 1 occurrence(s) across 1 pipeline(s)

selenium.common.exceptions.WebDriverException: Message: <unknown>: Failed to read the 'localStorage' property from 'Window': Access is denied for this document.
  (Session info: headless chrome=119.0.6045.199)
Stacktrace:
#0 0x55659703e5e3 <unknown>
#1 0x556596d010b7 <unknown>
#2 0x556596d072b5 <unknown>
#3 0x556596d099b1 <unknown>
#4 0x556596d9271f <unknown>
#5 0x556596d75ef2 <unknown>
#6 0x556596d91b3d <unknown>
#7 0x556596d75cc3 <unknown>
#8 0x556596d410e4 <unknown>
#9 0x556596d420ae <unknown>
#10 0x556597004ce1 <unknown>
#11 0x556597008b7e <unknown>
#12 0x556596ff24b5 <unknown>
#13 0x5565970097d6 <unknown>
#14 0x556596fd5dbf <unknown>
#15 0x55659702c748 <unknown>
#16 0x55659702c917 <unknown>
#17 0x55659703d773 <unknown>
#18 0x7f6e631c9aa4 <unknown>
#19 0x7f6e63256a64 __clone

Stacktrace:

lib/common/ui/pages/web.py:61 in decorated
lib/apps/yclients/client/booking/web/pages/__init__.py:80 in open
lib/common/ui/pages/web.py:61 in decorated
lib/apps/yclients/client/booking/web/pages/__init__.py:41 in set_environment
lib/ui/selenium/webdriver/__init__.py:52 in execute_script

Seen in: - altegio/client.booking#224668 — shard 1 — launch 165208 (×1, last 2026-09-21 08:16 MSK)

WebDriverException — 1 occurrence(s) across 1 pipeline(s)

selenium.common.exceptions.WebDriverException: Message: <unknown>: Failed to read the 'localStorage' property from 'Window': Access is denied for this document.
  (Session info: headless chrome=119.0.6045.199)
Stacktrace:
#0 0x556ac58ed5e3 <unknown>
#1 0x556ac55b00b7 <unknown>
#2 0x556ac55b62b5 <unknown>
#3 0x556ac55b89b1 <unknown>
#4 0x556ac564171f <unknown>
#5 0x556ac5624ef2 <unknown>
#6 0x556ac5640b3d <unknown>
#7 0x556ac5624cc3 <unknown>
#8 0x556ac55f00e4 <unknown>
#9 0x556ac55f10ae <unknown>
#10 0x556ac58b3ce1 <unknown>
#11 0x556ac58b7b7e <unknown>
#12 0x556ac58a14b5 <unknown>
#13 0x556ac58b87d6 <unknown>
#14 0x556ac5884dbf <unknown>
#15 0x556ac58db748 <unknown>
#16 0x556ac58db917 <unknown>
#17 0x556ac58ec773 <unknown>
#18 0x7f626fc92aa4 <unknown>
#19 0x7f626fd1fa64 __clone

Stacktrace:

lib/common/ui/pages/web.py:61 in decorated
lib/apps/yclients/client/booking/web/pages/__init__.py:80 in open
lib/common/ui/pages/web.py:61 in decorated
lib/apps/yclients/client/booking/web/pages/__init__.py:41 in set_environment
lib/ui/selenium/webdriver/__init__.py:52 in execute_script

Seen in: - altegio/client.booking#224668 — shard 1 — launch 165208 (×1, last 2026-09-21 08:16 MSK)

WebDriverException — 1 occurrence(s) across 1 pipeline(s)

selenium.common.exceptions.WebDriverException: Message: <unknown>: Failed to read the 'localStorage' property from 'Window': Access is denied for this document.
  (Session info: headless chrome=119.0.6045.199)
Stacktrace:
#0 0x55c4b8a1c5e3 <unknown>
#1 0x55c4b86df0b7 <unknown>
#2 0x55c4b86e52b5 <unknown>
#3 0x55c4b86e79b1 <unknown>
#4 0x55c4b877071f <unknown>
#5 0x55c4b8753ef2 <unknown>
#6 0x55c4b876fb3d <unknown>
#7 0x55c4b8753cc3 <unknown>
#8 0x55c4b871f0e4 <unknown>
#9 0x55c4b87200ae <unknown>
#10 0x55c4b89e2ce1 <unknown>
#11 0x55c4b89e6b7e <unknown>
#12 0x55c4b89d04b5 <unknown>
#13 0x55c4b89e77d6 <unknown>
#14 0x55c4b89b3dbf <unknown>
#15 0x55c4b8a0a748 <unknown>
#16 0x55c4b8a0a917 <unknown>
#17 0x55c4b8a1b773 <unknown>
#18 0x7fa9eea64aa4 <unknown>
#19 0x7fa9eeaf1a64 __clone

Stacktrace:

lib/common/ui/pages/web.py:61 in decorated
lib/apps/yclients/client/booking/web/pages/__init__.py:80 in open
lib/common/ui/pages/web.py:61 in decorated
lib/apps/yclients/client/booking/web/pages/__init__.py:41 in set_environment
lib/ui/selenium/webdriver/__init__.py:52 in execute_script

Seen in: - altegio/client.booking#224668 — shard 1 — launch 165208 (×1, last 2026-09-21 08:16 MSK)