Создание онлайн-записи через виджет¶
- Добавление услуги через '+'
- Выбор сотрудника
- Выбор случайного времени на завтра
test_booking_book_record_via_plus_btn
Failures in last 30 days: 14
Generated at 2026-10-08 03:35 MSK
Last failure: 2026-10-02 11:50 MSK
Filter: pipelines with sandbox_biz_erp ∈ {master, testops-dev} AND autotests_branch ∈ {master, main} only (testops-dev — daytime ticks since 2026-08-05).
By exception class:
- TimeoutException — 8
- WebDriverException — 3
- Exception — 2
- ElementClickInterceptedException — 1
Failure signatures (grouped by exception + full message):
Exception — 2 occurrence(s) across 2 pipeline(s)¶
Exception: Нет заполненного расписания
Stacktrace:
suite/yclients/client/booking/web/test_records.py:120 in test_booking_book_record_via_plus_btn
lib/apps/yclients/client/booking/web/pages/select_time.py:152 in select_date_and_time
lib/apps/yclients/client/booking/web/pages/select_time.py:169 in select_date
Seen in: - altegio/biz.erp#227735 — shard 4 — launch 171549 (×1, last 2026-10-02 06:23 MSK) - altegio/biz.erp#227722 — shard 2 — launch 171516 (×1, last 2026-10-02 04:26 MSK)
ElementClickInterceptedException — 1 occurrence(s) across 1 pipeline(s)¶
selenium.common.exceptions.ElementClickInterceptedException: Message: element click intercepted: Element <a class="ui-state-default" href="#" webdriver_active_element="" style="box-shadow: rgba(197, 0, 123, 0.85) 2px 2px 15px 3px;">...</a> is not clickable at point (196, 136). Other element would receive the click: <a class="yc-link yc-link_light" target="_self" href="https://erp-testops-dev.infra.altegio.cloud/timetable/16360825/#mode=1">...</a>
(Session info: headless chrome=119.0.6045.199); For documentation on this error, please visit: https://www.selenium.dev/documentation/webdriver/troubleshooting/errors#elementclickinterceptedexception
Stacktrace:
#0 0x56230035c5e3 <unknown>
#1 0x56230001f0b7 <unknown>
#2 0x562300074cfc <unknown>
#3 0x56230007265f <unknown>
#4 0x56230006fbe4 <unknown>
#5 0x56230006e934 <unknown>
#6 0x5623000611a0 <unknown>
#7 0x562300093ef2 <unknown>
#8 0x562300060a02 <unknown>
#9 0x5623000940be <unknown>
#10 0x5623000afb3d <unknown>
#11 0x562300093cc3 <unknown>
#12 0x56230005f0e4 <unknown>
#13 0x5623000600ae <unknown>
#14 0x562300322ce1 <unknown>
#15 0x562300326b7e <unknown>
#16 0x5623003104b5 <unknown>
#17 0x5623003277d6 <unknown>
#18 0x5623002f3dbf <unknown>
#19 0x56230034a748 <unknown>
#20 0x56230034a917 <unknown>
#21 0x56230035b773 <unknown>
#22 0x7f250079baa4 <unknown>
#23 0x7f2500828a64 __clone
selenium.common.exceptions.ElementClickInterceptedException: Message: element click intercepted: Element <a class="ui-state-default" href="#" webdriver_active_element="" style="box-shadow: rgba(197, 0, 123, 0.85) 2px 2px 15px 3px;">...</a> is not clickable at point (196, 136). Other element would receive the click: <a class="yc-link yc-link_light" target="_self" href="https://erp-testops-dev.infra.altegio.cloud/timetable/16360825/#mode=1">...</a>
(Session info: headless chrome=119.0.6045.199); For documentation on this error, please visit: https://www.selenium.dev/documentation/webdriver/troubleshooting/errors#elementclickinterceptedexception
Stacktrace:
#0 0x56230035c5e3 <unknown>
#1 0x56230001f0b7 <unknown>
#2 0x562300074cfc <unknown>
#3 0x56230007265f <unknown>
#4 0x56230006fbe4 <unknown>
#5 0x56230006e934 <unknown>
#6 0x5623000611a0 <unknown>
#7 0x562300093ef2 <unknown>
#8 0x562300060a02 <unknown>
#9 0x5623000940be <unknown>
#10 0x5623000afb3d <unknown>
#11 0x562300093cc3 <unknown>
#12 0x56230005f0e4 <unknown>
#13 0x5623000600ae <unknown>
#14 0x562300322ce1 <unknown>
#15 0x562300326b7e <unknown>
#16 0x5623003104b5 <unknown>
#17 0x5623003277d6 <unknown>
#18 0x5623002f3dbf <unknown>
#19 0x56230034a748 <unknown>
#20 0x56230034a917 <unknown>
#21 0x56230035b773 <unknown>
#22 0x7f250079baa4 <unknown>
#23 0x7f2500828a64 __clone
selenium.common.exceptions.TimeoutException: Message: element click intercepted: Element <a class="ui-state-default" href="#" webdriver_active_element="" style="box-shadow: rgba(197, 0, 123, 0.85) 2px 2px 15px 3px;">...</a> is not clickable at point (196, 136). Other element would receive the click: <a class="yc-link yc-link_light" target="_self" href="https://erp-testops-dev.infra.altegio.cloud/timetable/16360825/#mode=1">...</a>
(Session info: headless chrome=119.0.6045.199); For documentation on this error, please visit: https://www.selenium.dev/documentation/webdriver/troubleshooting/errors#elementclickinterceptedexception
AssertionError: Не удалось заполнить поле UserPage.calendar <DATEPICKER>
Stacktrace:
lib/common/ui/pages/web.py:61 in decorated
lib/common/ui/pages/__init__.py:34 in wrapper
lib/apps/yclients/biz/erp/web/pages/__init__.py:214 in set_field
lib/common/ui/pages/web.py:61 in decorated
lib/common/ui/pages/web.py:306 in set_field
Seen in: - altegio/biz.erp#227722 — shard 2 — launch 171516 (×1, last 2026-10-02 04:26 MSK)
TimeoutException — 1 occurrence(s) across 1 pipeline(s)¶
selenium.common.exceptions.TimeoutException: Message: Ожидаем загрузку страницы: "BookingDetailsPage"
Stacktrace:
suite/yclients/client/booking/web/test_records.py:126 in test_booking_book_record_via_plus_btn
lib/common/ui/pages/web.py:61 in decorated
lib/apps/yclients/client/booking/web/pages/order.py:148 in click_all_right
lib/apps/yclients/client/booking/web/pages/__init__.py:311 in __exit__
lib/ui/selenium/webdriver/support/wait.py:28 in until
Seen in: - testops/autotests#227229 — shard 5 — launch 170669 (×1, last 2026-09-30 15:37 MSK)
TimeoutException — 1 occurrence(s) across 1 pipeline(s)¶
selenium.common.exceptions.TimeoutException: Message: Ожидаем элемент в DOM: "nav.navbar-default", параметры метода ожидания: ([
"css selector",
"<autotests.lib.ui.selenium.webdriver.Remote (session=\"2622f8cf51ff9d1da14d5ea9f16c3cd4\")>",
"nav.navbar-default",
"<autotests.lib.apps.yclients.biz.erp.web.pages.user.UserPage object at 0x7ff2618b90d0>"
]), условия ожидания: ([
"timeout: 25s"
])
Stacktrace:
#0 0x55fa860e95e3 <unknown>
#1 0x55fa85dac0b7 <unknown>
#2 0x55fa85df9f53 <unknown>
#3 0x55fa85dfa051 <unknown>
#4 0x55fa85e3f9c4 <unknown>
#5 0x55fa85e20f1d <unknown>
#6 0x55fa85e3cb3d <unknown>
#7 0x55fa85e20cc3 <unknown>
#8 0x55fa85dec0e4 <unknown>
#9 0x55fa85ded0ae <unknown>
#10 0x55fa860afce1 <unknown>
#11 0x55fa860b3b7e <unknown>
#12 0x55fa8609d4b5 <unknown>
#13 0x55fa860b47d6 <unknown>
#14 0x55fa86080dbf <unknown>
#15 0x55fa860d7748 <unknown>
#16 0x55fa860d7917 <unknown>
#17 0x55fa860e8773 <unknown>
#18 0x7fcb62360aa4 <unknown>
#19 0x7fcb623eda64 __clone
Stacktrace:
lib/common/ui/pages/web.py:61 in decorated
lib/apps/yclients/biz/erp/web/pages/user.py:33 in show_left_panel
lib/common/ui/pages/web.py:61 in decorated
lib/common/ui/pages/web.py:148 in wait_for_element
lib/ui/selenium/webdriver/support/wait.py:28 in until
Seen in: - altegio/biz.erp#227722 — shard 2 — launch 171516 (×1, last 2026-10-02 04:26 MSK)
TimeoutException — 1 occurrence(s) across 1 pipeline(s)¶
selenium.common.exceptions.TimeoutException: Message: Ожидаем элемент в DOM: "[data-locator="booking_date"]", параметры метода ожидания: ([
"css selector",
"None",
"[data-locator=\"booking_date\"]",
"<autotests.lib.apps.yclients.client.booking.web.pages.created_booking.CreatedBookingPage object at 0x7ff4e8e53020>"
]), условия ожидания: ([
"timeout: 25s"
])
Stacktrace:
#0 0x5581537765e3 <unknown>
#1 0x5581534390b7 <unknown>
#2 0x558153486f53 <unknown>
#3 0x558153487051 <unknown>
#4 0x5581534cc9c4 <unknown>
#5 0x5581534adf1d <unknown>
#6 0x5581534c9b3d <unknown>
#7 0x5581534adcc3 <unknown>
#8 0x5581534790e4 <unknown>
#9 0x55815347a0ae <unknown>
#10 0x55815373cce1 <unknown>
#11 0x558153740b7e <unknown>
#12 0x55815372a4b5 <unknown>
#13 0x5581537417d6 <unknown>
#14 0x55815370ddbf <unknown>
#15 0x558153764748 <unknown>
#16 0x558153764917 <unknown>
#17 0x558153775773 <unknown>
#18 0x7f92a3731aa4 <unknown>
#19 0x7f92a37bea64 __clone
Stacktrace:
lib/common/ui/pages/web.py:61 in decorated
lib/apps/yclients/client/booking/web/pages/created_booking.py:81 in get_booking_time
lib/common/ui/pages/web.py:61 in decorated
lib/common/ui/pages/web.py:148 in wait_for_element
lib/ui/selenium/webdriver/support/wait.py:28 in until
Seen in: - altegio/biz.erp#227735 — shard 4 — launch 171549 (×1, last 2026-10-02 06:23 MSK)
TimeoutException — 1 occurrence(s) across 1 pipeline(s)¶
selenium.common.exceptions.TimeoutException: Message: Ожидаем элемент в DOM: "[data-locator="booking_date"]", параметры метода ожидания: ([
"css selector",
"None",
"[data-locator=\"booking_date\"]",
"<autotests.lib.apps.yclients.client.booking.web.pages.created_booking.CreatedBookingPage object at 0x7f369e7ce5d0>"
]), условия ожидания: ([
"timeout: 25s"
])
Stacktrace:
#0 0x55b33bd4b5e3 <unknown>
#1 0x55b33ba0e0b7 <unknown>
#2 0x55b33ba5bf53 <unknown>
#3 0x55b33ba5c051 <unknown>
#4 0x55b33baa19c4 <unknown>
#5 0x55b33ba82f1d <unknown>
#6 0x55b33ba9eb3d <unknown>
#7 0x55b33ba82cc3 <unknown>
#8 0x55b33ba4e0e4 <unknown>
#9 0x55b33ba4f0ae <unknown>
#10 0x55b33bd11ce1 <unknown>
#11 0x55b33bd15b7e <unknown>
#12 0x55b33bcff4b5 <unknown>
#13 0x55b33bd167d6 <unknown>
#14 0x55b33bce2dbf <unknown>
#15 0x55b33bd39748 <unknown>
#16 0x55b33bd39917 <unknown>
#17 0x55b33bd4a773 <unknown>
#18 0x7f73b3170aa4 <unknown>
#19 0x7f73b31fda64 __clone
Stacktrace:
lib/common/ui/pages/web.py:61 in decorated
lib/apps/yclients/client/booking/web/pages/created_booking.py:81 in get_booking_time
lib/common/ui/pages/web.py:61 in decorated
lib/common/ui/pages/web.py:148 in wait_for_element
lib/ui/selenium/webdriver/support/wait.py:28 in until
Seen in: - altegio/biz.erp#227735 — shard 4 — launch 171549 (×1, last 2026-10-02 06:23 MSK)
TimeoutException — 1 occurrence(s) across 1 pipeline(s)¶
selenium.common.exceptions.TimeoutException: Message: Ожидаем элемент в DOM: "[data-locator="booking_date"]", параметры метода ожидания: ([
"css selector",
"None",
"[data-locator=\"booking_date\"]",
"<autotests.lib.apps.yclients.client.booking.web.pages.created_booking.CreatedBookingPage object at 0x7f394936bce0>"
]), условия ожидания: ([
"timeout: 25s"
])
Stacktrace:
#0 0x55bf31af85e3 <unknown>
#1 0x55bf317bb0b7 <unknown>
#2 0x55bf31808f53 <unknown>
#3 0x55bf31809051 <unknown>
#4 0x55bf3184e9c4 <unknown>
#5 0x55bf3182ff1d <unknown>
#6 0x55bf3184bb3d <unknown>
#7 0x55bf3182fcc3 <unknown>
#8 0x55bf317fb0e4 <unknown>
#9 0x55bf317fc0ae <unknown>
#10 0x55bf31abece1 <unknown>
#11 0x55bf31ac2b7e <unknown>
#12 0x55bf31aac4b5 <unknown>
#13 0x55bf31ac37d6 <unknown>
#14 0x55bf31a8fdbf <unknown>
#15 0x55bf31ae6748 <unknown>
#16 0x55bf31ae6917 <unknown>
#17 0x55bf31af7773 <unknown>
#18 0x7fe3a44cfaa4 <unknown>
#19 0x7fe3a455ca64 __clone
Stacktrace:
lib/common/ui/pages/web.py:61 in decorated
lib/apps/yclients/client/booking/web/pages/created_booking.py:81 in get_booking_time
lib/common/ui/pages/web.py:61 in decorated
lib/common/ui/pages/web.py:148 in wait_for_element
lib/ui/selenium/webdriver/support/wait.py:28 in until
Seen in: - altegio/biz.erp#227749 — shard 5 — launch 171616 (×1, last 2026-10-02 08:20 MSK)
TimeoutException — 1 occurrence(s) across 1 pipeline(s)¶
selenium.common.exceptions.TimeoutException: Message: Ожидаем элемент в DOM: "[data-locator="booking_date"]", параметры метода ожидания: ([
"css selector",
"None",
"[data-locator=\"booking_date\"]",
"<autotests.lib.apps.yclients.client.booking.web.pages.created_booking.CreatedBookingPage object at 0x7fc73c7ce360>"
]), условия ожидания: ([
"timeout: 25s"
])
Stacktrace:
#0 0x564f490835e3 <unknown>
#1 0x564f48d460b7 <unknown>
#2 0x564f48d93f53 <unknown>
#3 0x564f48d94051 <unknown>
#4 0x564f48dd99c4 <unknown>
#5 0x564f48dbaf1d <unknown>
#6 0x564f48dd6b3d <unknown>
#7 0x564f48dbacc3 <unknown>
#8 0x564f48d860e4 <unknown>
#9 0x564f48d870ae <unknown>
#10 0x564f49049ce1 <unknown>
#11 0x564f4904db7e <unknown>
#12 0x564f490374b5 <unknown>
#13 0x564f4904e7d6 <unknown>
#14 0x564f4901adbf <unknown>
#15 0x564f49071748 <unknown>
#16 0x564f49071917 <unknown>
#17 0x564f49082773 <unknown>
#18 0x7f9f2f3e6aa4 <unknown>
#19 0x7f9f2f473a64 __clone
Stacktrace:
lib/common/ui/pages/web.py:61 in decorated
lib/apps/yclients/client/booking/web/pages/created_booking.py:81 in get_booking_time
lib/common/ui/pages/web.py:61 in decorated
lib/common/ui/pages/web.py:148 in wait_for_element
lib/ui/selenium/webdriver/support/wait.py:28 in until
Seen in: - altegio/biz.erp#227749 — shard 5 — launch 171616 (×1, last 2026-10-02 08:20 MSK)
TimeoutException — 1 occurrence(s) across 1 pipeline(s)¶
selenium.common.exceptions.TimeoutException: Message: Ожидаем элемент в DOM: "[data-locator="booking_date"]", параметры метода ожидания: ([
"css selector",
"None",
"[data-locator=\"booking_date\"]",
"<autotests.lib.apps.yclients.client.booking.web.pages.created_booking.CreatedBookingPage object at 0x7efbb036ba10>"
]), условия ожидания: ([
"timeout: 25s"
])
Stacktrace:
#0 0x55d152e305e3 <unknown>
#1 0x55d152af30b7 <unknown>
#2 0x55d152b40f53 <unknown>
#3 0x55d152b41051 <unknown>
#4 0x55d152b869c4 <unknown>
#5 0x55d152b67f1d <unknown>
#6 0x55d152b83b3d <unknown>
#7 0x55d152b67cc3 <unknown>
#8 0x55d152b330e4 <unknown>
#9 0x55d152b340ae <unknown>
#10 0x55d152df6ce1 <unknown>
#11 0x55d152dfab7e <unknown>
#12 0x55d152de44b5 <unknown>
#13 0x55d152dfb7d6 <unknown>
#14 0x55d152dc7dbf <unknown>
#15 0x55d152e1e748 <unknown>
#16 0x55d152e1e917 <unknown>
#17 0x55d152e2f773 <unknown>
#18 0x7f441bdd1aa4 <unknown>
#19 0x7f441be5ea64 __clone
Stacktrace:
lib/common/ui/pages/web.py:61 in decorated
lib/apps/yclients/client/booking/web/pages/created_booking.py:81 in get_booking_time
lib/common/ui/pages/web.py:61 in decorated
lib/common/ui/pages/web.py:148 in wait_for_element
lib/ui/selenium/webdriver/support/wait.py:28 in until
Seen in: - altegio/biz.erp#227749 — shard 5 — launch 171616 (×1, last 2026-10-02 08:20 MSK)
TimeoutException — 1 occurrence(s) across 1 pipeline(s)¶
selenium.common.exceptions.TimeoutException: Message: Ожидаем элемент в DOM: "[data-locator="booking_date"]", параметры метода ожидания: ([
"css selector",
"None",
"[data-locator=\"booking_date\"]",
"<autotests.lib.apps.yclients.client.booking.web.pages.created_booking.CreatedBookingPage object at 0x7fc9d6c27800>"
]), условия ожидания: ([
"timeout: 25s"
])
Stacktrace:
#0 0x55bcf894a5e3 <unknown>
#1 0x55bcf860d0b7 <unknown>
#2 0x55bcf865af53 <unknown>
#3 0x55bcf865b051 <unknown>
#4 0x55bcf86a09c4 <unknown>
#5 0x55bcf8681f1d <unknown>
#6 0x55bcf869db3d <unknown>
#7 0x55bcf8681cc3 <unknown>
#8 0x55bcf864d0e4 <unknown>
#9 0x55bcf864e0ae <unknown>
#10 0x55bcf8910ce1 <unknown>
#11 0x55bcf8914b7e <unknown>
#12 0x55bcf88fe4b5 <unknown>
#13 0x55bcf89157d6 <unknown>
#14 0x55bcf88e1dbf <unknown>
#15 0x55bcf8938748 <unknown>
#16 0x55bcf8938917 <unknown>
#17 0x55bcf8949773 <unknown>
#18 0x7fa12eceeaa4 <unknown>
#19 0x7fa12ed7ba64 __clone
Stacktrace:
lib/common/ui/pages/web.py:61 in decorated
lib/apps/yclients/client/booking/web/pages/created_booking.py:81 in get_booking_time
lib/common/ui/pages/web.py:61 in decorated
lib/common/ui/pages/web.py:148 in wait_for_element
lib/ui/selenium/webdriver/support/wait.py:28 in until
Seen in: - altegio/biz.erp#227787 — shard 4 — launch 171752 (×1, last 2026-10-02 11:50 MSK)
WebDriverException — 1 occurrence(s) across 1 pipeline(s)¶
selenium.common.exceptions.WebDriverException: Message: <unknown>: Failed to read the 'localStorage' property from 'Window': Access is denied for this document.
(Session info: headless chrome=119.0.6045.199)
Stacktrace:
#0 0x5631ed5185e3 <unknown>
#1 0x5631ed1db0b7 <unknown>
#2 0x5631ed1e12b5 <unknown>
#3 0x5631ed1e39b1 <unknown>
#4 0x5631ed26c71f <unknown>
#5 0x5631ed24fef2 <unknown>
#6 0x5631ed26bb3d <unknown>
#7 0x5631ed24fcc3 <unknown>
#8 0x5631ed21b0e4 <unknown>
#9 0x5631ed21c0ae <unknown>
#10 0x5631ed4dece1 <unknown>
#11 0x5631ed4e2b7e <unknown>
#12 0x5631ed4cc4b5 <unknown>
#13 0x5631ed4e37d6 <unknown>
#14 0x5631ed4afdbf <unknown>
#15 0x5631ed506748 <unknown>
#16 0x5631ed506917 <unknown>
#17 0x5631ed517773 <unknown>
#18 0x7f8651c09aa4 <unknown>
#19 0x7f8651c96a64 __clone
Stacktrace:
lib/common/ui/pages/web.py:61 in decorated
lib/apps/yclients/client/booking/web/pages/__init__.py:80 in open
lib/common/ui/pages/web.py:61 in decorated
lib/apps/yclients/client/booking/web/pages/__init__.py:41 in set_environment
lib/ui/selenium/webdriver/__init__.py:52 in execute_script
Seen in: - altegio/client.booking#224668 — shard 3 — launch 165208 (×1, last 2026-09-21 08:16 MSK)
WebDriverException — 1 occurrence(s) across 1 pipeline(s)¶
selenium.common.exceptions.WebDriverException: Message: <unknown>: Failed to read the 'localStorage' property from 'Window': Access is denied for this document.
(Session info: headless chrome=119.0.6045.199)
Stacktrace:
#0 0x5615300035e3 <unknown>
#1 0x56152fcc60b7 <unknown>
#2 0x56152fccc2b5 <unknown>
#3 0x56152fcce9b1 <unknown>
#4 0x56152fd5771f <unknown>
#5 0x56152fd3aef2 <unknown>
#6 0x56152fd56b3d <unknown>
#7 0x56152fd3acc3 <unknown>
#8 0x56152fd060e4 <unknown>
#9 0x56152fd070ae <unknown>
#10 0x56152ffc9ce1 <unknown>
#11 0x56152ffcdb7e <unknown>
#12 0x56152ffb74b5 <unknown>
#13 0x56152ffce7d6 <unknown>
#14 0x56152ff9adbf <unknown>
#15 0x56152fff1748 <unknown>
#16 0x56152fff1917 <unknown>
#17 0x561530002773 <unknown>
#18 0x7ff370ab5aa4 <unknown>
#19 0x7ff370b42a64 __clone
Stacktrace:
lib/common/ui/pages/web.py:61 in decorated
lib/apps/yclients/client/booking/web/pages/__init__.py:80 in open
lib/common/ui/pages/web.py:61 in decorated
lib/apps/yclients/client/booking/web/pages/__init__.py:41 in set_environment
lib/ui/selenium/webdriver/__init__.py:52 in execute_script
Seen in: - altegio/client.booking#224668 — shard 3 — launch 165208 (×1, last 2026-09-21 08:16 MSK)
WebDriverException — 1 occurrence(s) across 1 pipeline(s)¶
selenium.common.exceptions.WebDriverException: Message: <unknown>: Failed to read the 'localStorage' property from 'Window': Access is denied for this document.
(Session info: headless chrome=119.0.6045.199)
Stacktrace:
#0 0x557e58cf75e3 <unknown>
#1 0x557e589ba0b7 <unknown>
#2 0x557e589c02b5 <unknown>
#3 0x557e589c29b1 <unknown>
#4 0x557e58a4b71f <unknown>
#5 0x557e58a2eef2 <unknown>
#6 0x557e58a4ab3d <unknown>
#7 0x557e58a2ecc3 <unknown>
#8 0x557e589fa0e4 <unknown>
#9 0x557e589fb0ae <unknown>
#10 0x557e58cbdce1 <unknown>
#11 0x557e58cc1b7e <unknown>
#12 0x557e58cab4b5 <unknown>
#13 0x557e58cc27d6 <unknown>
#14 0x557e58c8edbf <unknown>
#15 0x557e58ce5748 <unknown>
#16 0x557e58ce5917 <unknown>
#17 0x557e58cf6773 <unknown>
#18 0x7f98dc710aa4 <unknown>
#19 0x7f98dc79da64 __clone
Stacktrace:
lib/common/ui/pages/web.py:61 in decorated
lib/apps/yclients/client/booking/web/pages/__init__.py:80 in open
lib/common/ui/pages/web.py:61 in decorated
lib/apps/yclients/client/booking/web/pages/__init__.py:41 in set_environment
lib/ui/selenium/webdriver/__init__.py:52 in execute_script
Seen in: - altegio/client.booking#224668 — shard 3 — launch 165208 (×1, last 2026-09-21 08:16 MSK)