Skip to content

23563 Редактирование услуги.

Создание нового сотрудника недоступно без права на создание сотрудников

test_can_not_create_new_master_in_service_interface_without_rights

Failures in last 30 days: 13

Generated at 2026-10-08 03:48 MSK

Last failure: 2026-10-02 11:50 MSK

Filter: pipelines with sandbox_biz_erp ∈ {master, testops-dev} AND autotests_branch ∈ {master, main} only (testops-dev — daytime ticks since 2026-08-05).

By exception class: - SigninRedirectMissingError — 9 - TimeoutError — 2 - AssertionError — 1 - KeyError — 1

Failure signatures (grouped by exception + full message):

AssertionError — 1 occurrence(s) across 1 pipeline(s)

AssertionError: Locator expected to be visible
Actual value: hidden
Call log:
  - Expect "to_be_visible" with timeout 30000ms
  - waiting for locator("[data-locator=\"basic_tab_content\"]").first
    31 × locator resolved to <div data-locator="basic_tab_content" class="services-settings-basic-tab">…</div>
       - unexpected value "hidden"

Stacktrace:

suite/yclients/biz/erp/web/test_link_entities_pw.py:202 in test_can_not_create_new_master_in_service_interface_without_rights
lib/apps_pw/yclients/biz/erp/web/pages/__init__.py:77 in decorated
lib/apps_pw/yclients/biz/erp/web/pages/service/filial/__init__.py:605 in click_edit_service

Seen in: - altegio/biz.erp#227596 — shard 7 — launch 171280 (×1, last 2026-10-01 17:40 MSK)

KeyError — 1 occurrence(s) across 1 pipeline(s)

KeyError: 'salon_with_entities'

Seen in: - altegio/biz.erp#227735 — shard 8 — launch 171549 (×1, last 2026-10-02 06:23 MSK)

SigninRedirectMissingError — 1 occurrence(s) across 1 pipeline(s)

autotests.lib.exception.SigninRedirectMissingError: login-XHR завершился со статусом 200, но редиректа со /signin/ не случилось за 30 с — подозрение на фронт biz.erp
--- причина (playwright) ---
Timeout 30000ms exceeded.
=========================== logs ===========================
waiting for navigation to "<function ImplToApiMapping.wrap_handler.<locals>.wrapper_func at 0x7f7f9906e0c0>" until 'commit'
  navigated to "https://erp-testops-dev.infra.altegio.cloud/signin/"
  navigated to "https://erp-testops-dev.infra.altegio.cloud/signin/"
  navigated to "https://erp-testops-dev.infra.altegio.cloud/signin/JTJGdGltZXRhYmxlJTJGMTYzNTg4MDclMkY="
  navigated to "https://erp-testops-dev.infra.altegio.cloud/signin/JTJGdGltZXRhYmxlJTJGMTYzNTg4MDclMkY="
  navigated to "https://erp-testops-dev.infra.altegio.cloud/signin/JTJGdGltZXRhYmxlJTJGMTYzNTg4MDclMkY="
============================================================

Stacktrace:

suite/yclients/biz/erp/web/test_link_entities_pw.py:191 in test_can_not_create_new_master_in_service_interface_without_rights
lib/apps_pw/yclients/biz/erp/web/pages/guest/signin.py:115 in sign_in

Seen in: - altegio/biz.erp#227722 — shard 1 — launch 171516 (×1, last 2026-10-02 04:26 MSK)

SigninRedirectMissingError — 1 occurrence(s) across 1 pipeline(s)

autotests.lib.exception.SigninRedirectMissingError: login-XHR завершился со статусом 200, но редиректа со /signin/ не случилось за 30 с — подозрение на фронт biz.erp
--- причина (playwright) ---
Timeout 30000ms exceeded.
=========================== logs ===========================
waiting for navigation to "<function ImplToApiMapping.wrap_handler.<locals>.wrapper_func at 0x7f16743d1d00>" until 'commit'
  navigated to "https://erp-testops-dev.infra.altegio.cloud/signin/"
  navigated to "https://erp-testops-dev.infra.altegio.cloud/signin/"
  navigated to "https://erp-testops-dev.infra.altegio.cloud/signin/JTJGdGltZXRhYmxlJTJGMTYzNTk4NDklMkY="
  navigated to "https://erp-testops-dev.infra.altegio.cloud/signin/JTJGdGltZXRhYmxlJTJGMTYzNTk4NDklMkY="
  navigated to "https://erp-testops-dev.infra.altegio.cloud/signin/JTJGdGltZXRhYmxlJTJGMTYzNTk4NDklMkY="
============================================================

Stacktrace:

suite/yclients/biz/erp/web/test_link_entities_pw.py:191 in test_can_not_create_new_master_in_service_interface_without_rights
lib/apps_pw/yclients/biz/erp/web/pages/guest/signin.py:115 in sign_in

Seen in: - altegio/biz.erp#227722 — shard 1 — launch 171516 (×1, last 2026-10-02 04:26 MSK)

SigninRedirectMissingError — 1 occurrence(s) across 1 pipeline(s)

autotests.lib.exception.SigninRedirectMissingError: login-XHR завершился со статусом 200, но редиректа со /signin/ не случилось за 30 с — подозрение на фронт biz.erp
--- причина (playwright) ---
Timeout 30000ms exceeded.
=========================== logs ===========================
waiting for navigation to "<function ImplToApiMapping.wrap_handler.<locals>.wrapper_func at 0x7ff769d93920>" until 'commit'
  navigated to "https://erp-testops-dev.infra.altegio.cloud/signin/"
  navigated to "https://erp-testops-dev.infra.altegio.cloud/signin/"
  navigated to "https://erp-testops-dev.infra.altegio.cloud/signin/JTJGdGltZXRhYmxlJTJGMTYzNjM2MzYlMkY="
  navigated to "https://erp-testops-dev.infra.altegio.cloud/signin/JTJGdGltZXRhYmxlJTJGMTYzNjM2MzYlMkY="
  navigated to "https://erp-testops-dev.infra.altegio.cloud/signin/JTJGdGltZXRhYmxlJTJGMTYzNjM2MzYlMkY="
============================================================

Stacktrace:

suite/yclients/biz/erp/web/test_link_entities_pw.py:191 in test_can_not_create_new_master_in_service_interface_without_rights
lib/apps_pw/yclients/biz/erp/web/pages/guest/signin.py:115 in sign_in

Seen in: - altegio/biz.erp#227735 — shard 8 — launch 171549 (×1, last 2026-10-02 06:23 MSK)

SigninRedirectMissingError — 1 occurrence(s) across 1 pipeline(s)

autotests.lib.exception.SigninRedirectMissingError: login-XHR завершился со статусом 200, но редиректа со /signin/ не случилось за 30 с — подозрение на фронт biz.erp
--- причина (playwright) ---
Timeout 30000ms exceeded.
=========================== logs ===========================
waiting for navigation to "<function ImplToApiMapping.wrap_handler.<locals>.wrapper_func at 0x7f1c17ef7f60>" until 'commit'
  navigated to "https://erp-testops-dev.infra.altegio.cloud/signin/"
  navigated to "https://erp-testops-dev.infra.altegio.cloud/signin/"
  navigated to "https://erp-testops-dev.infra.altegio.cloud/signin/JTJGdGltZXRhYmxlJTJGMTYzNjQ4NTMlMkY="
  navigated to "https://erp-testops-dev.infra.altegio.cloud/signin/JTJGdGltZXRhYmxlJTJGMTYzNjQ4NTMlMkY="
  navigated to "https://erp-testops-dev.infra.altegio.cloud/signin/JTJGdGltZXRhYmxlJTJGMTYzNjQ4NTMlMkY="
============================================================

Stacktrace:

suite/yclients/biz/erp/web/test_link_entities_pw.py:191 in test_can_not_create_new_master_in_service_interface_without_rights
lib/apps_pw/yclients/biz/erp/web/pages/guest/signin.py:115 in sign_in

Seen in: - altegio/biz.erp#227735 — shard 8 — launch 171549 (×1, last 2026-10-02 06:23 MSK)

SigninRedirectMissingError — 1 occurrence(s) across 1 pipeline(s)

autotests.lib.exception.SigninRedirectMissingError: login-XHR завершился со статусом 200, но редиректа со /signin/ не случилось за 30 с — подозрение на фронт biz.erp
--- причина (playwright) ---
Timeout 30000ms exceeded.
=========================== logs ===========================
waiting for navigation to "<function ImplToApiMapping.wrap_handler.<locals>.wrapper_func at 0x7fe5919e3740>" until 'commit'
  navigated to "https://erp-testops-dev.infra.altegio.cloud/signin/"
  navigated to "https://erp-testops-dev.infra.altegio.cloud/signin/"
  navigated to "https://erp-testops-dev.infra.altegio.cloud/signin/JTJGdGltZXRhYmxlJTJGMTYzNjY4NDElMkY="
  navigated to "https://erp-testops-dev.infra.altegio.cloud/signin/JTJGdGltZXRhYmxlJTJGMTYzNjY4NDElMkY="
  navigated to "https://erp-testops-dev.infra.altegio.cloud/signin/JTJGdGltZXRhYmxlJTJGMTYzNjY4NDElMkY="
============================================================

Stacktrace:

suite/yclients/biz/erp/web/test_link_entities_pw.py:191 in test_can_not_create_new_master_in_service_interface_without_rights
lib/apps_pw/yclients/biz/erp/web/pages/guest/signin.py:115 in sign_in

Seen in: - altegio/biz.erp#227749 — shard 5 — launch 171616 (×1, last 2026-10-02 08:20 MSK)

SigninRedirectMissingError — 1 occurrence(s) across 1 pipeline(s)

autotests.lib.exception.SigninRedirectMissingError: login-XHR завершился со статусом 200, но редиректа со /signin/ не случилось за 30 с — подозрение на фронт biz.erp
--- причина (playwright) ---
Timeout 30000ms exceeded.
=========================== logs ===========================
waiting for navigation to "<function ImplToApiMapping.wrap_handler.<locals>.wrapper_func at 0x7feeb1da3600>" until 'commit'
  navigated to "https://erp-testops-dev.infra.altegio.cloud/signin/"
  navigated to "https://erp-testops-dev.infra.altegio.cloud/signin/"
  navigated to "https://erp-testops-dev.infra.altegio.cloud/signin/JTJGdGltZXRhYmxlJTJGMTYzNjc4NjMlMkY="
  navigated to "https://erp-testops-dev.infra.altegio.cloud/signin/JTJGdGltZXRhYmxlJTJGMTYzNjc4NjMlMkY="
  navigated to "https://erp-testops-dev.infra.altegio.cloud/signin/JTJGdGltZXRhYmxlJTJGMTYzNjc4NjMlMkY="
============================================================

Stacktrace:

suite/yclients/biz/erp/web/test_link_entities_pw.py:191 in test_can_not_create_new_master_in_service_interface_without_rights
lib/apps_pw/yclients/biz/erp/web/pages/guest/signin.py:115 in sign_in

Seen in: - altegio/biz.erp#227749 — shard 5 — launch 171616 (×1, last 2026-10-02 08:20 MSK)

SigninRedirectMissingError — 1 occurrence(s) across 1 pipeline(s)

autotests.lib.exception.SigninRedirectMissingError: login-XHR завершился со статусом 200, но редиректа со /signin/ не случилось за 30 с — подозрение на фронт biz.erp
--- причина (playwright) ---
Timeout 30000ms exceeded.
=========================== logs ===========================
waiting for navigation to "<function ImplToApiMapping.wrap_handler.<locals>.wrapper_func at 0x7f53fde7e160>" until 'commit'
  navigated to "https://erp-testops-dev.infra.altegio.cloud/signin/"
  navigated to "https://erp-testops-dev.infra.altegio.cloud/signin/"
  navigated to "https://erp-testops-dev.infra.altegio.cloud/signin/JTJGdGltZXRhYmxlJTJGMTYzNjg4MzIlMkY="
  navigated to "https://erp-testops-dev.infra.altegio.cloud/signin/JTJGdGltZXRhYmxlJTJGMTYzNjg4MzIlMkY="
  navigated to "https://erp-testops-dev.infra.altegio.cloud/signin/JTJGdGltZXRhYmxlJTJGMTYzNjg4MzIlMkY="
============================================================

Stacktrace:

suite/yclients/biz/erp/web/test_link_entities_pw.py:191 in test_can_not_create_new_master_in_service_interface_without_rights
lib/apps_pw/yclients/biz/erp/web/pages/guest/signin.py:115 in sign_in

Seen in: - altegio/biz.erp#227749 — shard 5 — launch 171616 (×1, last 2026-10-02 08:20 MSK)

SigninRedirectMissingError — 1 occurrence(s) across 1 pipeline(s)

autotests.lib.exception.SigninRedirectMissingError: login-XHR завершился со статусом 200, но редиректа со /signin/ не случилось за 30 с — подозрение на фронт biz.erp
--- причина (playwright) ---
Timeout 30000ms exceeded.
=========================== logs ===========================
waiting for navigation to "<function ImplToApiMapping.wrap_handler.<locals>.wrapper_func at 0x7f97e4c76e80>" until 'commit'
  navigated to "https://erp-testops-dev.infra.altegio.cloud/signin/"
  navigated to "https://erp-testops-dev.infra.altegio.cloud/signin/"
  navigated to "https://erp-testops-dev.infra.altegio.cloud/signin/JTJGdGltZXRhYmxlJTJGMTYzNjk1ODYlMkY="
  navigated to "https://erp-testops-dev.infra.altegio.cloud/signin/JTJGdGltZXRhYmxlJTJGMTYzNjk1ODYlMkY="
  navigated to "https://erp-testops-dev.infra.altegio.cloud/signin/JTJGdGltZXRhYmxlJTJGMTYzNjk1ODYlMkY="
============================================================

Stacktrace:

suite/yclients/biz/erp/web/test_link_entities_pw.py:191 in test_can_not_create_new_master_in_service_interface_without_rights
lib/apps_pw/yclients/biz/erp/web/pages/guest/signin.py:115 in sign_in

Seen in: - altegio/biz.erp#227787 — shard 5 — launch 171752 (×1, last 2026-10-02 11:50 MSK)

SigninRedirectMissingError — 1 occurrence(s) across 1 pipeline(s)

autotests.lib.exception.SigninRedirectMissingError: login-XHR завершился со статусом 200, но редиректа со /signin/ не случилось за 30 с — подозрение на фронт biz.erp
--- причина (playwright) ---
Timeout 30000ms exceeded.
=========================== logs ===========================
waiting for navigation to "<function ImplToApiMapping.wrap_handler.<locals>.wrapper_func at 0x7f8c189efba0>" until 'commit'
  navigated to "https://erp-testops-dev.infra.altegio.cloud/signin/"
  navigated to "https://erp-testops-dev.infra.altegio.cloud/signin/"
  navigated to "https://erp-testops-dev.infra.altegio.cloud/signin/JTJGdGltZXRhYmxlJTJGMTYzNzExOTUlMkY="
  navigated to "https://erp-testops-dev.infra.altegio.cloud/signin/JTJGdGltZXRhYmxlJTJGMTYzNzExOTUlMkY="
  navigated to "https://erp-testops-dev.infra.altegio.cloud/signin/JTJGdGltZXRhYmxlJTJGMTYzNzExOTUlMkY="
============================================================

Stacktrace:

suite/yclients/biz/erp/web/test_link_entities_pw.py:191 in test_can_not_create_new_master_in_service_interface_without_rights
lib/apps_pw/yclients/biz/erp/web/pages/guest/signin.py:115 in sign_in

Seen in: - altegio/biz.erp#227787 — shard 5 — launch 171752 (×1, last 2026-10-02 11:50 MSK)

TimeoutError — 1 occurrence(s) across 1 pipeline(s)

playwright._impl._errors.TimeoutError: Locator.click: Timeout 30000ms exceeded.
Call log:
  - waiting for locator("[class*=\"erp-nav-menu-mode-switch-footer-button\"]:visible, [class*=\"erp-nav-menu-mode-switch-mini__button\"]:visible").first
    - locator resolved to <div data-locator="nav_menu_mode_switch_btn" class="erp-nav-menu-mode-switch-footer-button">…</div>
  - attempting click action
    2 × waiting for element to be visible, enabled and stable
      - element is visible, enabled and stable
      - scrolling into view if needed
      - done scrolling
      - <div class="v-error-modal v-error-modal--unauthorized v-error-modal__fade-enter-active v-error-modal__fade-enter-to">…</div> intercepts pointer events
    - retrying click action
    - waiting 20ms
    - waiting for element to be visible, enabled and stable
    - element is visible, enabled and stable
    - scrolling into view if needed
    - done scrolling
    - <div class="v-error-modal v-error-modal--unauthorized v-error-modal__fade-enter-active v-error-modal__fade-enter-to">…</div> intercepts pointer events
  2 × retrying click action
      - waiting 100ms
      - waiting for element to be visible, enabled and stable
      - element is visible, enabled and stable
      - scrolling into view if needed
      - done scrolling
      - <div class="v-error-modal v-error-modal--unauthorized">…</div> intercepts pointer events
  55 × retrying click action
       - waiting 500ms
       - waiting for element to be visible, enabled and stable
       - element is visible, enabled and stable
       - scrolling into view if needed
       - done scrolling
       - <div class="v-error-modal v-error-modal--unauthorized">…</div> intercepts pointer events
  - retrying click action
    - waiting 500ms
AssertionError: Failed to navigate through menu item MENU_ITEM_SETTINGS. Browser diagnostics:
{
  "url": "https://erp-testops-dev.infra.altegio.cloud/timetable/16356730/#mode=1",
  "observer": {
    "installed": true,
    "first_js_error": null,
    "js_errors": [],
    "js_errors_by_location": {},
    "xhr_queue": []
  },
  "page_errors": [],
  "console": [
    {
      "type": "warning",
      "text": "Web Vitals polyfill required",
      "location": {
        "url": "https://erp-testops-dev.infra.altegio.cloud/js/vue-vite-app/chunk-a6Oo9G3y2.js",
        "lineNumber": 0,
        "columnNumber": 11968
      }
    },
    {
      "type": "error",
      "text": "Failed to load resource: the server responded with a status of 401 ()",
      "location": {
        "url": "https://erp-testops-dev.infra.altegio.cloud/api/v1/company/16356730/timetable/schedule?dates%5B%5D=2026-10-01&include%5B%5D=tt_day_schedule_resource_instances.resource_instance.resource&include%5B%5D=tt_day_schedule_resource_instances.resource_instance&include%5B%5D=tt_day_schedule_resource_instances&include%5B%5D=tt_day_schedule_masters.master&include%5B%5D=tt_day_schedule_masters&include%5B%5D=tt_day_schedule_masters.tt_day_master_grid_status&new_timetable_schedule_from_legacy=1&_=1790865082846",
        "lineNumber": 0,
        "columnNumber": 0
      }
    },
    {
      "type": "error",
      "text": "Failed to load resource: the server responded with a status of 401 ()",
      "location": {
        "url": "https://erp-testops-dev.infra.altegio.cloud/api/v1/company/16356730/timetable/attendance_day?dates%5B%5D=2026-10-01&include%5B%5D=records&include%5B%5D=records.services&include%5B%5D=records.labels&include%5B%5D=records.master&include%5B%5D=records.client&include%5B%5D=records.client.first_successful_visit&include%5B%5D=records.comer&include%5B%5D=records.comer.vehicle&include%5B%5D=records.resource_instances.resource&include%5B%5D=records.resource_instances&include%5B%5D=records.acceptance_free&include%5B%5D=records.attendance_service_items.attendance_service_composite.composite_service&include%5B%5D=records.duration_details&include%5B%5D=activities&include%5B%5D=activities.service&include%5B%5D=activities.label... [truncated]

Stacktrace:

lib/apps_pw/yclients/biz/erp/web/components/menu.py:214 in click_menu
lib/apps_pw/yclients/biz/erp/web/components/menu.py:228 in _click_menu
lib/apps_pw/yclients/biz/erp/web/pages/user.py:464 in _ensure_administration_mode_for_legacy_menu
suite/yclients/biz/erp/web/test_link_entities_pw.py:198 in test_can_not_create_new_master_in_service_interface_without_rights
lib/apps_pw/yclients/biz/erp/web/components/menu.py:216 in click_menu

Seen in: - altegio/biz.erp#227596 — shard 7 — launch 171280 (×1, last 2026-10-01 17:40 MSK)

TimeoutError — 1 occurrence(s) across 1 pipeline(s)

playwright._impl._errors.TimeoutError: Locator.click: Timeout 30000ms exceeded.
Call log:
  - waiting for locator("[class*=\"erp-nav-menu-mode-switch-footer-button\"]:visible, [class*=\"erp-nav-menu-mode-switch-mini__button\"]:visible").first
    - locator resolved to <div data-locator="nav_menu_mode_switch_btn" class="erp-nav-menu-mode-switch-footer-button">…</div>
  - attempting click action
    2 × waiting for element to be visible, enabled and stable
      - element is visible, enabled and stable
      - scrolling into view if needed
      - done scrolling
      - <div class="v-error-modal v-error-modal--unauthorized v-error-modal__fade-enter-active v-error-modal__fade-enter-to">…</div> intercepts pointer events
    - retrying click action
    - waiting 20ms
    2 × waiting for element to be visible, enabled and stable
      - element is visible, enabled and stable
      - scrolling into view if needed
      - done scrolling
      - <div class="v-error-modal v-error-modal--unauthorized v-error-modal__fade-enter-active v-error-modal__fade-enter-to">…</div> intercepts pointer events
    - retrying click action
      - waiting 100ms
    58 × waiting for element to be visible, enabled and stable
       - element is visible, enabled and stable
       - scrolling into view if needed
       - done scrolling
       - <div class="v-error-modal v-error-modal--unauthorized">…</div> intercepts pointer events
     - retrying click action
       - waiting 500ms
AssertionError: Failed to navigate through menu item MENU_ITEM_SETTINGS. Browser diagnostics:
{
  "url": "https://erp-testops-dev.infra.altegio.cloud/timetable/16357335/#mode=1&main_date=2026-10-02",
  "observer": {
    "installed": true,
    "first_js_error": null,
    "js_errors": [],
    "js_errors_by_location": {},
    "xhr_queue": []
  },
  "page_errors": [],
  "console": [
    {
      "type": "warning",
      "text": "Web Vitals polyfill required",
      "location": {
        "url": "https://erp-testops-dev.infra.altegio.cloud/js/vue-vite-app/chunk-a6Oo9G3y2.js",
        "lineNumber": 0,
        "columnNumber": 11968
      }
    },
    {
      "type": "error",
      "text": "Failed to load resource: the server responded with a status of 401 ()",
      "location": {
        "url": "https://erp-testops-dev.infra.altegio.cloud/api/v1/company/16357335/timetable/schedule?dates%5B%5D=2026-09-01&dates%5B%5D=2026-09-02&dates%5B%5D=2026-09-03&dates%5B%5D=2026-09-04&dates%5B%5D=2026-09-05&dates%5B%5D=2026-09-06&dates%5B%5D=2026-09-07&dates%5B%5D=2026-09-08&dates%5B%5D=2026-09-09&dates%5B%5D=2026-09-10&dates%5B%5D=2026-09-11&dates%5B%5D=2026-09-12&dates%5B%5D=2026-09-13&dates%5B%5D=2026-09-14&dates%5B%5D=2026-09-15&dates%5B%5D=2026-09-16&dates%5B%5D=2026-09-17&dates%5B%5D=2026-09-18&dates%5B%5D=2026-09-19&dates%5B%5D=2026-09-20&dates%5B%5D=2026-09-21&dates%5B%5D=2026-09-22&dates%5B%5D=2026-09-23&dates%5B%5D=2026-09-24&dates%5B%5D=2026-09-25&dates%5B%5D=2026-09-26&dates%5B%5D=2026-09-27&dates%5B%5D=2026-09-28&dates%5B%5D=2026-09-29&dates%5B%5D=2026-09-30&dates%5B%5D=2026-10-01&dates%5B%5D=2026-10-02&dates%5B%5D=2026-10-03&dates%5B%5D=2026-10-04&dates%5B%5D=2026-10-05&dates%5B%5D=2026-10-06&dates%5B%5D=2026-10-07&dates%5B%5D=2026-10-08&dates%5B%5D=2026-10-09&dates%5B%5D=2026-10-10&dates%5B%5D=2026-10-11&dates%5B%5D=2026-10-12&dates%5B%5D=2026-10-13&dates%5B%5D=2026-10-14&dates%5B%5D=2026-10-15&dates%5B%5D=2026-10-16&dates%5B%5D=2026-10-17&dates%5B%5D=2026-10-18&dates%5B%5D=2026-10-19&dates%5B%5D=2026-10-20&dates%5B%5D=2026-10-21&dates%5B%5D=2026-10-22&dates%5B%5D=2026-10-23&dates%5B%5D=2026-10-24&dates%5B%5D=2026-10-25&dates%5B%5D=2026-10-26&dates%5B%5D=2026-10-27&dates%5B%5D=2026-10-28&dates%5B%5D=2026-10-29&dates%5B%5D=2026-10-30&dates%5B%5D=2026-10-31&dates%5B%5D=2026-11-01&dates%5B%5D=2026-11-02&dates%5B%5D=2026-11-03&dates%5B%5D=2026-11-04&dates%5B%5D=2026-11-05&dates%5B%5D=2026-11-06&dates%5B%5D=2026-11-07&dates%5B%5D=2026-11-08&dates%5B%5D=2026-11-09&dates%5B%5D=2026-11-10&dates%... [truncated]

Stacktrace:

lib/apps_pw/yclients/biz/erp/web/components/menu.py:214 in click_menu
lib/apps_pw/yclients/biz/erp/web/components/menu.py:228 in _click_menu
lib/apps_pw/yclients/biz/erp/web/pages/user.py:464 in _ensure_administration_mode_for_legacy_menu
suite/yclients/biz/erp/web/test_link_entities_pw.py:198 in test_can_not_create_new_master_in_service_interface_without_rights
lib/apps_pw/yclients/biz/erp/web/components/menu.py:216 in click_menu

Seen in: - altegio/biz.erp#227722 — shard 1 — launch 171516 (×1, last 2026-10-02 04:26 MSK)