Переход по прямой ссылке. Нет слотов у единственного сотрудника.¶
Редирект на выбор филиалов. Сетевой виджет.
test_chain_the_only_master_has_no_slots_go_by_straight_link
Failures in last 30 days: 3
Generated at 2026-10-08 03:53 MSK
Last failure: 2026-09-21 08:16 MSK
Filter: pipelines with sandbox_biz_erp ∈ {master, testops-dev} AND autotests_branch ∈ {master, main} only (testops-dev — daytime ticks since 2026-08-05).
By exception class:
- WebDriverException — 3
Failure signatures (grouped by exception + full message):
WebDriverException — 1 occurrence(s) across 1 pipeline(s)¶
selenium.common.exceptions.WebDriverException: Message: <unknown>: Failed to read the 'localStorage' property from 'Window': Access is denied for this document.
(Session info: headless chrome=119.0.6045.199)
Stacktrace:
#0 0x55b7ffa1c5e3 <unknown>
#1 0x55b7ff6df0b7 <unknown>
#2 0x55b7ff6e52b5 <unknown>
#3 0x55b7ff6e79b1 <unknown>
#4 0x55b7ff77071f <unknown>
#5 0x55b7ff753ef2 <unknown>
#6 0x55b7ff76fb3d <unknown>
#7 0x55b7ff753cc3 <unknown>
#8 0x55b7ff71f0e4 <unknown>
#9 0x55b7ff7200ae <unknown>
#10 0x55b7ff9e2ce1 <unknown>
#11 0x55b7ff9e6b7e <unknown>
#12 0x55b7ff9d04b5 <unknown>
#13 0x55b7ff9e77d6 <unknown>
#14 0x55b7ff9b3dbf <unknown>
#15 0x55b7ffa0a748 <unknown>
#16 0x55b7ffa0a917 <unknown>
#17 0x55b7ffa1b773 <unknown>
#18 0x7f8e25ba2aa4 <unknown>
#19 0x7f8e25c2fa64 __clone
Stacktrace:
lib/common/ui/pages/web.py:61 in decorated
lib/apps/yclients/client/booking/web/pages/__init__.py:80 in open
lib/common/ui/pages/web.py:61 in decorated
lib/apps/yclients/client/booking/web/pages/__init__.py:41 in set_environment
lib/ui/selenium/webdriver/__init__.py:52 in execute_script
Seen in: - altegio/client.booking#224668 — shard 8 — launch 165208 (×1, last 2026-09-21 08:16 MSK)
WebDriverException — 1 occurrence(s) across 1 pipeline(s)¶
selenium.common.exceptions.WebDriverException: Message: <unknown>: Failed to read the 'localStorage' property from 'Window': Access is denied for this document.
(Session info: headless chrome=119.0.6045.199)
Stacktrace:
#0 0x55833813b5e3 <unknown>
#1 0x558337dfe0b7 <unknown>
#2 0x558337e042b5 <unknown>
#3 0x558337e069b1 <unknown>
#4 0x558337e8f71f <unknown>
#5 0x558337e72ef2 <unknown>
#6 0x558337e8eb3d <unknown>
#7 0x558337e72cc3 <unknown>
#8 0x558337e3e0e4 <unknown>
#9 0x558337e3f0ae <unknown>
#10 0x558338101ce1 <unknown>
#11 0x558338105b7e <unknown>
#12 0x5583380ef4b5 <unknown>
#13 0x5583381067d6 <unknown>
#14 0x5583380d2dbf <unknown>
#15 0x558338129748 <unknown>
#16 0x558338129917 <unknown>
#17 0x55833813a773 <unknown>
#18 0x7f50a5e89aa4 <unknown>
#19 0x7f50a5f16a64 __clone
Stacktrace:
lib/common/ui/pages/web.py:61 in decorated
lib/apps/yclients/client/booking/web/pages/__init__.py:80 in open
lib/common/ui/pages/web.py:61 in decorated
lib/apps/yclients/client/booking/web/pages/__init__.py:41 in set_environment
lib/ui/selenium/webdriver/__init__.py:52 in execute_script
Seen in: - altegio/client.booking#224668 — shard 8 — launch 165208 (×1, last 2026-09-21 08:16 MSK)
WebDriverException — 1 occurrence(s) across 1 pipeline(s)¶
selenium.common.exceptions.WebDriverException: Message: <unknown>: Failed to read the 'localStorage' property from 'Window': Access is denied for this document.
(Session info: headless chrome=119.0.6045.199)
Stacktrace:
#0 0x5608db43f5e3 <unknown>
#1 0x5608db1020b7 <unknown>
#2 0x5608db1082b5 <unknown>
#3 0x5608db10a9b1 <unknown>
#4 0x5608db19371f <unknown>
#5 0x5608db176ef2 <unknown>
#6 0x5608db192b3d <unknown>
#7 0x5608db176cc3 <unknown>
#8 0x5608db1420e4 <unknown>
#9 0x5608db1430ae <unknown>
#10 0x5608db405ce1 <unknown>
#11 0x5608db409b7e <unknown>
#12 0x5608db3f34b5 <unknown>
#13 0x5608db40a7d6 <unknown>
#14 0x5608db3d6dbf <unknown>
#15 0x5608db42d748 <unknown>
#16 0x5608db42d917 <unknown>
#17 0x5608db43e773 <unknown>
#18 0x7f3c8ed0caa4 <unknown>
#19 0x7f3c8ed99a64 __clone
Stacktrace:
lib/common/ui/pages/web.py:61 in decorated
lib/apps/yclients/client/booking/web/pages/__init__.py:80 in open
lib/common/ui/pages/web.py:61 in decorated
lib/apps/yclients/client/booking/web/pages/__init__.py:41 in set_environment
lib/ui/selenium/webdriver/__init__.py:52 in execute_script
Seen in: - altegio/client.booking#224668 — shard 8 — launch 165208 (×1, last 2026-09-21 08:16 MSK)