Страница Меню. Переходы назад со страниц выбора: услуг, сотрудника, даты¶
test_client_booking_menu_go_back_from_select_master_service_and_date
Failures in last 30 days: 7
Generated at 2026-10-08 03:48 MSK
Last failure: 2026-10-01 00:53 MSK
Filter: pipelines with sandbox_biz_erp ∈ {master, testops-dev} AND autotests_branch ∈ {master, main} only (testops-dev — daytime ticks since 2026-08-05).
By exception class:
- AssertionError — 4
- WebDriverException — 3
Failure signatures (grouped by exception + full message):
AssertionError — 3 occurrence(s) across 1 pipeline(s)¶
AssertionError: Неверный текущий месяц
Expected: 'october'
but: was 'september'
Stacktrace:
suite/yclients/client/booking/web/navigation/test_back_btn.py:1578 in test_client_booking_menu_go_back_from_select_master_service_and_date
lib/utils/hamcrest/__init__.py:20 in assert_that
lib/utils/hamcrest/__init__.py:35 in _assert_match
Seen in: - altegio/client.booking#227407 — shard 4 — launch 170831 (×3, last 2026-10-01 00:53 MSK)
AssertionError — 1 occurrence(s) across 1 pipeline(s)¶
AssertionError: На страницах во время теста обнаружены javascript-ошибки:
------------------------------------------------------------
Исходная страница: https://n11088628--client-booking--master.teststation.altegio.dev/company/16454337/personal/select-master?o=
------------------------------------------------------------
Источник: https://n11088628--client-booking--master.teststation.altegio.dev/polyfills.js, строка: 135, столбец: 13
------------------------------------------------------------
Детали: Uncaught TypeError: Failed to fetch dynamically imported module: https://n11088628--client-booking--master.teststation.altegio.dev/master-info-Q4FFSORK.js
------------------------------------------------------------
Трейс: TypeError: Failed to fetch dynamically imported module: https://n11088628--client-booking--master.teststation.altegio.dev/master-info-Q4FFSORK.js
Stacktrace:
plugins/allure/selenium/plugin.py:117 in pytest_runtest_teardown
Seen in: - testops/autotests#227229 — shard 2 — launch 170669 (×1, last 2026-09-30 15:37 MSK)
WebDriverException — 1 occurrence(s) across 1 pipeline(s)¶
selenium.common.exceptions.WebDriverException: Message: <unknown>: Failed to read the 'localStorage' property from 'Window': Access is denied for this document.
(Session info: headless chrome=119.0.6045.199)
Stacktrace:
#0 0x55d9b8bf65e3 <unknown>
#1 0x55d9b88b90b7 <unknown>
#2 0x55d9b88bf2b5 <unknown>
#3 0x55d9b88c19b1 <unknown>
#4 0x55d9b894a71f <unknown>
#5 0x55d9b892def2 <unknown>
#6 0x55d9b8949b3d <unknown>
#7 0x55d9b892dcc3 <unknown>
#8 0x55d9b88f90e4 <unknown>
#9 0x55d9b88fa0ae <unknown>
#10 0x55d9b8bbcce1 <unknown>
#11 0x55d9b8bc0b7e <unknown>
#12 0x55d9b8baa4b5 <unknown>
#13 0x55d9b8bc17d6 <unknown>
#14 0x55d9b8b8ddbf <unknown>
#15 0x55d9b8be4748 <unknown>
#16 0x55d9b8be4917 <unknown>
#17 0x55d9b8bf5773 <unknown>
#18 0x7f259d71faa4 <unknown>
#19 0x7f259d7aca64 __clone
Stacktrace:
lib/common/ui/pages/web.py:61 in decorated
lib/apps/yclients/client/booking/web/pages/__init__.py:80 in open
lib/common/ui/pages/web.py:61 in decorated
lib/apps/yclients/client/booking/web/pages/__init__.py:41 in set_environment
lib/ui/selenium/webdriver/__init__.py:52 in execute_script
Seen in: - altegio/client.booking#224668 — shard 8 — launch 165208 (×1, last 2026-09-21 08:16 MSK)
WebDriverException — 1 occurrence(s) across 1 pipeline(s)¶
selenium.common.exceptions.WebDriverException: Message: <unknown>: Failed to read the 'localStorage' property from 'Window': Access is denied for this document.
(Session info: headless chrome=119.0.6045.199)
Stacktrace:
#0 0x56477d8045e3 <unknown>
#1 0x56477d4c70b7 <unknown>
#2 0x56477d4cd2b5 <unknown>
#3 0x56477d4cf9b1 <unknown>
#4 0x56477d55871f <unknown>
#5 0x56477d53bef2 <unknown>
#6 0x56477d557b3d <unknown>
#7 0x56477d53bcc3 <unknown>
#8 0x56477d5070e4 <unknown>
#9 0x56477d5080ae <unknown>
#10 0x56477d7cace1 <unknown>
#11 0x56477d7ceb7e <unknown>
#12 0x56477d7b84b5 <unknown>
#13 0x56477d7cf7d6 <unknown>
#14 0x56477d79bdbf <unknown>
#15 0x56477d7f2748 <unknown>
#16 0x56477d7f2917 <unknown>
#17 0x56477d803773 <unknown>
#18 0x7f4c00047aa4 <unknown>
#19 0x7f4c000d4a64 __clone
Stacktrace:
lib/common/ui/pages/web.py:61 in decorated
lib/apps/yclients/client/booking/web/pages/__init__.py:80 in open
lib/common/ui/pages/web.py:61 in decorated
lib/apps/yclients/client/booking/web/pages/__init__.py:41 in set_environment
lib/ui/selenium/webdriver/__init__.py:52 in execute_script
Seen in: - altegio/client.booking#224668 — shard 8 — launch 165208 (×1, last 2026-09-21 08:16 MSK)
WebDriverException — 1 occurrence(s) across 1 pipeline(s)¶
selenium.common.exceptions.WebDriverException: Message: <unknown>: Failed to read the 'localStorage' property from 'Window': Access is denied for this document.
(Session info: headless chrome=119.0.6045.199)
Stacktrace:
#0 0x555692ad35e3 <unknown>
#1 0x5556927960b7 <unknown>
#2 0x55569279c2b5 <unknown>
#3 0x55569279e9b1 <unknown>
#4 0x55569282771f <unknown>
#5 0x55569280aef2 <unknown>
#6 0x555692826b3d <unknown>
#7 0x55569280acc3 <unknown>
#8 0x5556927d60e4 <unknown>
#9 0x5556927d70ae <unknown>
#10 0x555692a99ce1 <unknown>
#11 0x555692a9db7e <unknown>
#12 0x555692a874b5 <unknown>
#13 0x555692a9e7d6 <unknown>
#14 0x555692a6adbf <unknown>
#15 0x555692ac1748 <unknown>
#16 0x555692ac1917 <unknown>
#17 0x555692ad2773 <unknown>
#18 0x7f0adecbeaa4 <unknown>
#19 0x7f0aded4ba64 __clone
Stacktrace:
lib/common/ui/pages/web.py:61 in decorated
lib/apps/yclients/client/booking/web/pages/__init__.py:80 in open
lib/common/ui/pages/web.py:61 in decorated
lib/apps/yclients/client/booking/web/pages/__init__.py:41 in set_environment
lib/ui/selenium/webdriver/__init__.py:52 in execute_script
Seen in: - altegio/client.booking#224668 — shard 8 — launch 165208 (×1, last 2026-09-21 08:16 MSK)