Skip to content

#23547 Карусель 3 абонемента с разными сроками действия. Баланс общий/раздельный.

Действуют в одном филиале из двух. После записи с применением абонемента

test_client_booking_personal_account_loyalty_abonements_carousel_after_record

Failures in last 30 days: 3

Generated at 2026-10-08 03:53 MSK

Last failure: 2026-09-21 08:16 MSK

Filter: pipelines with sandbox_biz_erp ∈ {master, testops-dev} AND autotests_branch ∈ {master, main} only (testops-dev — daytime ticks since 2026-08-05).

By exception class: - WebDriverException — 3

Failure signatures (grouped by exception + full message):

WebDriverException — 1 occurrence(s) across 1 pipeline(s)

selenium.common.exceptions.WebDriverException: Message: <unknown>: Failed to read the 'localStorage' property from 'Window': Access is denied for this document.
  (Session info: headless chrome=119.0.6045.199)
Stacktrace:
#0 0x5593c0b6c5e3 <unknown>
#1 0x5593c082f0b7 <unknown>
#2 0x5593c08352b5 <unknown>
#3 0x5593c08379b1 <unknown>
#4 0x5593c08c071f <unknown>
#5 0x5593c08a3ef2 <unknown>
#6 0x5593c08bfb3d <unknown>
#7 0x5593c08a3cc3 <unknown>
#8 0x5593c086f0e4 <unknown>
#9 0x5593c08700ae <unknown>
#10 0x5593c0b32ce1 <unknown>
#11 0x5593c0b36b7e <unknown>
#12 0x5593c0b204b5 <unknown>
#13 0x5593c0b377d6 <unknown>
#14 0x5593c0b03dbf <unknown>
#15 0x5593c0b5a748 <unknown>
#16 0x5593c0b5a917 <unknown>
#17 0x5593c0b6b773 <unknown>
#18 0x7f8215291aa4 <unknown>
#19 0x7f821531ea64 __clone

Stacktrace:

lib/common/ui/pages/web.py:61 in decorated
lib/apps/yclients/client/booking/web/pages/__init__.py:80 in open
lib/common/ui/pages/web.py:61 in decorated
lib/apps/yclients/client/booking/web/pages/__init__.py:41 in set_environment
lib/ui/selenium/webdriver/__init__.py:52 in execute_script

Seen in: - altegio/client.booking#224668 — shard 7 — launch 165208 (×1, last 2026-09-21 08:16 MSK)

WebDriverException — 1 occurrence(s) across 1 pipeline(s)

selenium.common.exceptions.WebDriverException: Message: <unknown>: Failed to read the 'localStorage' property from 'Window': Access is denied for this document.
  (Session info: headless chrome=119.0.6045.199)
Stacktrace:
#0 0x55b4e02e65e3 <unknown>
#1 0x55b4dffa90b7 <unknown>
#2 0x55b4dffaf2b5 <unknown>
#3 0x55b4dffb19b1 <unknown>
#4 0x55b4e003a71f <unknown>
#5 0x55b4e001def2 <unknown>
#6 0x55b4e0039b3d <unknown>
#7 0x55b4e001dcc3 <unknown>
#8 0x55b4dffe90e4 <unknown>
#9 0x55b4dffea0ae <unknown>
#10 0x55b4e02acce1 <unknown>
#11 0x55b4e02b0b7e <unknown>
#12 0x55b4e029a4b5 <unknown>
#13 0x55b4e02b17d6 <unknown>
#14 0x55b4e027ddbf <unknown>
#15 0x55b4e02d4748 <unknown>
#16 0x55b4e02d4917 <unknown>
#17 0x55b4e02e5773 <unknown>
#18 0x7fa650003aa4 <unknown>
#19 0x7fa650090a64 __clone

Stacktrace:

lib/common/ui/pages/web.py:61 in decorated
lib/apps/yclients/client/booking/web/pages/__init__.py:80 in open
lib/common/ui/pages/web.py:61 in decorated
lib/apps/yclients/client/booking/web/pages/__init__.py:41 in set_environment
lib/ui/selenium/webdriver/__init__.py:52 in execute_script

Seen in: - altegio/client.booking#224668 — shard 7 — launch 165208 (×1, last 2026-09-21 08:16 MSK)

WebDriverException — 1 occurrence(s) across 1 pipeline(s)

selenium.common.exceptions.WebDriverException: Message: <unknown>: Failed to read the 'localStorage' property from 'Window': Access is denied for this document.
  (Session info: headless chrome=119.0.6045.199)
Stacktrace:
#0 0x55e0c5bcb5e3 <unknown>
#1 0x55e0c588e0b7 <unknown>
#2 0x55e0c58942b5 <unknown>
#3 0x55e0c58969b1 <unknown>
#4 0x55e0c591f71f <unknown>
#5 0x55e0c5902ef2 <unknown>
#6 0x55e0c591eb3d <unknown>
#7 0x55e0c5902cc3 <unknown>
#8 0x55e0c58ce0e4 <unknown>
#9 0x55e0c58cf0ae <unknown>
#10 0x55e0c5b91ce1 <unknown>
#11 0x55e0c5b95b7e <unknown>
#12 0x55e0c5b7f4b5 <unknown>
#13 0x55e0c5b967d6 <unknown>
#14 0x55e0c5b62dbf <unknown>
#15 0x55e0c5bb9748 <unknown>
#16 0x55e0c5bb9917 <unknown>
#17 0x55e0c5bca773 <unknown>
#18 0x7f0735606aa4 <unknown>
#19 0x7f0735693a64 __clone

Stacktrace:

lib/common/ui/pages/web.py:61 in decorated
lib/apps/yclients/client/booking/web/pages/__init__.py:80 in open
lib/common/ui/pages/web.py:61 in decorated
lib/apps/yclients/client/booking/web/pages/__init__.py:41 in set_environment
lib/ui/selenium/webdriver/__init__.py:52 in execute_script

Seen in: - altegio/client.booking#224668 — shard 7 — launch 165208 (×1, last 2026-09-21 08:16 MSK)