Skip to content

Страница успешной записи. Кнопка копирования адреса.

test_copy_address_button

Failures in last 30 days: 14

Generated at 2026-10-08 03:35 MSK

Last failure: 2026-10-02 11:50 MSK

Filter: pipelines with sandbox_biz_erp ∈ {master, testops-dev} AND autotests_branch ∈ {master, main} only (testops-dev — daytime ticks since 2026-08-05).

By exception class: - AssertionError — 11 - WebDriverException — 3

Failure signatures (grouped by exception + full message):

AssertionError — 11 occurrence(s) across 4 pipeline(s)

AssertionError: В блоке контактов, возле адреса отсутствует кнопка "Скопировать адрес"
Expected: <True>
     but: was <False>

Stacktrace:

suite/yclients/client/booking/web/online_booking/test_created_booking_page.py:264 in test_copy_address_button

Seen in: - altegio/biz.erp#227787 — shard 8 — launch 171752 (×2, last 2026-10-02 11:50 MSK) - altegio/biz.erp#227749 — shard 3 — launch 171616 (×3, last 2026-10-02 08:20 MSK) - altegio/biz.erp#227735 — shard 6 — launch 171549 (×3, last 2026-10-02 06:23 MSK) - altegio/biz.erp#227722 — shard 4 — launch 171516 (×3, last 2026-10-02 04:26 MSK)

WebDriverException — 1 occurrence(s) across 1 pipeline(s)

selenium.common.exceptions.WebDriverException: Message: <unknown>: Failed to read the 'localStorage' property from 'Window': Access is denied for this document.
  (Session info: headless chrome=119.0.6045.199)
Stacktrace:
#0 0x559fde0135e3 <unknown>
#1 0x559fddcd60b7 <unknown>
#2 0x559fddcdc2b5 <unknown>
#3 0x559fddcde9b1 <unknown>
#4 0x559fddd6771f <unknown>
#5 0x559fddd4aef2 <unknown>
#6 0x559fddd66b3d <unknown>
#7 0x559fddd4acc3 <unknown>
#8 0x559fddd160e4 <unknown>
#9 0x559fddd170ae <unknown>
#10 0x559fddfd9ce1 <unknown>
#11 0x559fddfddb7e <unknown>
#12 0x559fddfc74b5 <unknown>
#13 0x559fddfde7d6 <unknown>
#14 0x559fddfaadbf <unknown>
#15 0x559fde001748 <unknown>
#16 0x559fde001917 <unknown>
#17 0x559fde012773 <unknown>
#18 0x7f32413acaa4 <unknown>
#19 0x7f3241439a64 __clone

Stacktrace:

lib/common/ui/pages/web.py:61 in decorated
lib/apps/yclients/client/booking/web/pages/__init__.py:80 in open
lib/common/ui/pages/web.py:61 in decorated
lib/apps/yclients/client/booking/web/pages/__init__.py:41 in set_environment
lib/ui/selenium/webdriver/__init__.py:52 in execute_script

Seen in: - altegio/client.booking#224668 — shard 7 — launch 165208 (×1, last 2026-09-21 08:16 MSK)

WebDriverException — 1 occurrence(s) across 1 pipeline(s)

selenium.common.exceptions.WebDriverException: Message: <unknown>: Failed to read the 'localStorage' property from 'Window': Access is denied for this document.
  (Session info: headless chrome=119.0.6045.199)
Stacktrace:
#0 0x5589615c65e3 <unknown>
#1 0x5589612890b7 <unknown>
#2 0x55896128f2b5 <unknown>
#3 0x5589612919b1 <unknown>
#4 0x55896131a71f <unknown>
#5 0x5589612fdef2 <unknown>
#6 0x558961319b3d <unknown>
#7 0x5589612fdcc3 <unknown>
#8 0x5589612c90e4 <unknown>
#9 0x5589612ca0ae <unknown>
#10 0x55896158cce1 <unknown>
#11 0x558961590b7e <unknown>
#12 0x55896157a4b5 <unknown>
#13 0x5589615917d6 <unknown>
#14 0x55896155ddbf <unknown>
#15 0x5589615b4748 <unknown>
#16 0x5589615b4917 <unknown>
#17 0x5589615c5773 <unknown>
#18 0x7f26e2895aa4 <unknown>
#19 0x7f26e2922a64 __clone

Stacktrace:

lib/common/ui/pages/web.py:61 in decorated
lib/apps/yclients/client/booking/web/pages/__init__.py:80 in open
lib/common/ui/pages/web.py:61 in decorated
lib/apps/yclients/client/booking/web/pages/__init__.py:41 in set_environment
lib/ui/selenium/webdriver/__init__.py:52 in execute_script

Seen in: - altegio/client.booking#224668 — shard 7 — launch 165208 (×1, last 2026-09-21 08:16 MSK)

WebDriverException — 1 occurrence(s) across 1 pipeline(s)

selenium.common.exceptions.WebDriverException: Message: <unknown>: Failed to read the 'localStorage' property from 'Window': Access is denied for this document.
  (Session info: headless chrome=119.0.6045.199)
Stacktrace:
#0 0x56335ecc45e3 <unknown>
#1 0x56335e9870b7 <unknown>
#2 0x56335e98d2b5 <unknown>
#3 0x56335e98f9b1 <unknown>
#4 0x56335ea1871f <unknown>
#5 0x56335e9fbef2 <unknown>
#6 0x56335ea17b3d <unknown>
#7 0x56335e9fbcc3 <unknown>
#8 0x56335e9c70e4 <unknown>
#9 0x56335e9c80ae <unknown>
#10 0x56335ec8ace1 <unknown>
#11 0x56335ec8eb7e <unknown>
#12 0x56335ec784b5 <unknown>
#13 0x56335ec8f7d6 <unknown>
#14 0x56335ec5bdbf <unknown>
#15 0x56335ecb2748 <unknown>
#16 0x56335ecb2917 <unknown>
#17 0x56335ecc3773 <unknown>
#18 0x7f97b3440aa4 <unknown>
#19 0x7f97b34cda64 __clone

Stacktrace:

lib/common/ui/pages/web.py:61 in decorated
lib/apps/yclients/client/booking/web/pages/__init__.py:80 in open
lib/common/ui/pages/web.py:61 in decorated
lib/apps/yclients/client/booking/web/pages/__init__.py:41 in set_environment
lib/ui/selenium/webdriver/__init__.py:52 in execute_script

Seen in: - altegio/client.booking#224668 — shard 7 — launch 165208 (×1, last 2026-09-21 08:16 MSK)