Skip to content

23566 Редактирование услуги. Создание нового сотрудника.

Не привязывается уже привязанный пользователь

test_create_new_master_in_service_interface_already_linked_user_not_link

Failures in last 30 days: 10

Generated at 2026-10-08 03:48 MSK

Last failure: 2026-10-02 11:50 MSK

Filter: pipelines with sandbox_biz_erp ∈ {master, testops-dev} AND autotests_branch ∈ {master, main} only (testops-dev — daytime ticks since 2026-08-05).

By exception class: - SigninRedirectMissingError — 6 - TimeoutError — 3 - KeyError — 1

Failure signatures (grouped by exception + full message):

KeyError — 1 occurrence(s) across 1 pipeline(s)

KeyError: 'salon_with_entities'

Seen in: - altegio/biz.erp#227735 — shard 2 — launch 171549 (×1, last 2026-10-02 06:23 MSK)

SigninRedirectMissingError — 1 occurrence(s) across 1 pipeline(s)

autotests.lib.exception.SigninRedirectMissingError: login-XHR завершился со статусом 200, но редиректа со /signin/ не случилось за 30 с — подозрение на фронт biz.erp
--- причина (playwright) ---
Timeout 30000ms exceeded.
=========================== logs ===========================
waiting for navigation to "<function ImplToApiMapping.wrap_handler.<locals>.wrapper_func at 0x7f3772e609a0>" until 'commit'
  navigated to "https://erp-testops-dev.infra.altegio.cloud/signin/"
  navigated to "https://erp-testops-dev.infra.altegio.cloud/signin/"
  navigated to "https://erp-testops-dev.infra.altegio.cloud/signin/JTJGdGltZXRhYmxlJTJGMTYzNTgyMjAlMkY="
  navigated to "https://erp-testops-dev.infra.altegio.cloud/signin/JTJGdGltZXRhYmxlJTJGMTYzNTgyMjAlMkY="
  navigated to "https://erp-testops-dev.infra.altegio.cloud/signin/JTJGdGltZXRhYmxlJTJGMTYzNTgyMjAlMkY="
============================================================

Stacktrace:

suite/yclients/biz/erp/web/test_link_master_in_service_interface_pw.py:658 in test_create_new_master_in_service_interface_already_linked_user_not_link
lib/apps_pw/yclients/biz/erp/web/pages/guest/signin.py:115 in sign_in

Seen in: - altegio/biz.erp#227722 — shard 4 — launch 171516 (×1, last 2026-10-02 04:26 MSK)

SigninRedirectMissingError — 1 occurrence(s) across 1 pipeline(s)

autotests.lib.exception.SigninRedirectMissingError: login-XHR завершился со статусом 200, но редиректа со /signin/ не случилось за 30 с — подозрение на фронт biz.erp
--- причина (playwright) ---
Timeout 30000ms exceeded.
=========================== logs ===========================
waiting for navigation to "<function ImplToApiMapping.wrap_handler.<locals>.wrapper_func at 0x7efe7037cd60>" until 'commit'
  navigated to "https://erp-testops-dev.infra.altegio.cloud/signin/"
  navigated to "https://erp-testops-dev.infra.altegio.cloud/signin/"
  navigated to "https://erp-testops-dev.infra.altegio.cloud/signin/JTJGdGltZXRhYmxlJTJGMTYzNTk0ODklMkY="
  navigated to "https://erp-testops-dev.infra.altegio.cloud/signin/JTJGdGltZXRhYmxlJTJGMTYzNTk0ODklMkY="
  navigated to "https://erp-testops-dev.infra.altegio.cloud/signin/JTJGdGltZXRhYmxlJTJGMTYzNTk0ODklMkY="
============================================================

Stacktrace:

suite/yclients/biz/erp/web/test_link_master_in_service_interface_pw.py:658 in test_create_new_master_in_service_interface_already_linked_user_not_link
lib/apps_pw/yclients/biz/erp/web/pages/guest/signin.py:115 in sign_in

Seen in: - altegio/biz.erp#227722 — shard 4 — launch 171516 (×1, last 2026-10-02 04:26 MSK)

SigninRedirectMissingError — 1 occurrence(s) across 1 pipeline(s)

autotests.lib.exception.SigninRedirectMissingError: login-XHR завершился со статусом 200, но редиректа со /signin/ не случилось за 30 с — подозрение на фронт biz.erp
--- причина (playwright) ---
Timeout 30000ms exceeded.
=========================== logs ===========================
waiting for navigation to "<function ImplToApiMapping.wrap_handler.<locals>.wrapper_func at 0x7fb060c40b80>" until 'commit'
  navigated to "https://erp-testops-dev.infra.altegio.cloud/signin/"
  navigated to "https://erp-testops-dev.infra.altegio.cloud/signin/"
  navigated to "https://erp-testops-dev.infra.altegio.cloud/signin/JTJGdGltZXRhYmxlJTJGMTYzNjY0NzMlMkY="
  navigated to "https://erp-testops-dev.infra.altegio.cloud/signin/JTJGdGltZXRhYmxlJTJGMTYzNjY0NzMlMkY="
  navigated to "https://erp-testops-dev.infra.altegio.cloud/signin/JTJGdGltZXRhYmxlJTJGMTYzNjY0NzMlMkY="
============================================================

Stacktrace:

suite/yclients/biz/erp/web/test_link_master_in_service_interface_pw.py:658 in test_create_new_master_in_service_interface_already_linked_user_not_link
lib/apps_pw/yclients/biz/erp/web/pages/guest/signin.py:115 in sign_in

Seen in: - altegio/biz.erp#227749 — shard 1 — launch 171616 (×1, last 2026-10-02 08:20 MSK)

SigninRedirectMissingError — 1 occurrence(s) across 1 pipeline(s)

autotests.lib.exception.SigninRedirectMissingError: login-XHR завершился со статусом 200, но редиректа со /signin/ не случилось за 30 с — подозрение на фронт biz.erp
--- причина (playwright) ---
Timeout 30000ms exceeded.
=========================== logs ===========================
waiting for navigation to "<function ImplToApiMapping.wrap_handler.<locals>.wrapper_func at 0x7f419831bf60>" until 'commit'
  navigated to "https://erp-testops-dev.infra.altegio.cloud/signin/"
  navigated to "https://erp-testops-dev.infra.altegio.cloud/signin/"
  navigated to "https://erp-testops-dev.infra.altegio.cloud/signin/JTJGdGltZXRhYmxlJTJGMTYzNjc3NjAlMkY="
  navigated to "https://erp-testops-dev.infra.altegio.cloud/signin/JTJGdGltZXRhYmxlJTJGMTYzNjc3NjAlMkY="
  navigated to "https://erp-testops-dev.infra.altegio.cloud/signin/JTJGdGltZXRhYmxlJTJGMTYzNjc3NjAlMkY="
============================================================

Stacktrace:

suite/yclients/biz/erp/web/test_link_master_in_service_interface_pw.py:658 in test_create_new_master_in_service_interface_already_linked_user_not_link
lib/apps_pw/yclients/biz/erp/web/pages/guest/signin.py:115 in sign_in

Seen in: - altegio/biz.erp#227749 — shard 1 — launch 171616 (×1, last 2026-10-02 08:20 MSK)

SigninRedirectMissingError — 1 occurrence(s) across 1 pipeline(s)

autotests.lib.exception.SigninRedirectMissingError: login-XHR завершился со статусом 200, но редиректа со /signin/ не случилось за 30 с — подозрение на фронт biz.erp
--- причина (playwright) ---
Timeout 30000ms exceeded.
=========================== logs ===========================
waiting for navigation to "<function ImplToApiMapping.wrap_handler.<locals>.wrapper_func at 0x7f92ac592520>" until 'commit'
  navigated to "https://erp-testops-dev.infra.altegio.cloud/signin/"
  navigated to "https://erp-testops-dev.infra.altegio.cloud/signin/"
  navigated to "https://erp-testops-dev.infra.altegio.cloud/signin/JTJGdGltZXRhYmxlJTJGMTYzNjg5MjMlMkY="
  navigated to "https://erp-testops-dev.infra.altegio.cloud/signin/JTJGdGltZXRhYmxlJTJGMTYzNjg5MjMlMkY="
  navigated to "https://erp-testops-dev.infra.altegio.cloud/signin/JTJGdGltZXRhYmxlJTJGMTYzNjg5MjMlMkY="
============================================================

Stacktrace:

suite/yclients/biz/erp/web/test_link_master_in_service_interface_pw.py:658 in test_create_new_master_in_service_interface_already_linked_user_not_link
lib/apps_pw/yclients/biz/erp/web/pages/guest/signin.py:115 in sign_in

Seen in: - altegio/biz.erp#227749 — shard 1 — launch 171616 (×1, last 2026-10-02 08:20 MSK)

SigninRedirectMissingError — 1 occurrence(s) across 1 pipeline(s)

autotests.lib.exception.SigninRedirectMissingError: login-XHR завершился со статусом 200, но редиректа со /signin/ не случилось за 30 с — подозрение на фронт biz.erp
--- причина (playwright) ---
Timeout 30000ms exceeded.
=========================== logs ===========================
waiting for navigation to "<function ImplToApiMapping.wrap_handler.<locals>.wrapper_func at 0x7fbae0f70180>" until 'commit'
  navigated to "https://erp-testops-dev.infra.altegio.cloud/signin/"
  navigated to "https://erp-testops-dev.infra.altegio.cloud/signin/"
  navigated to "https://erp-testops-dev.infra.altegio.cloud/signin/JTJGdGltZXRhYmxlJTJGMTYzNzAzNDMlMkY="
  navigated to "https://erp-testops-dev.infra.altegio.cloud/signin/JTJGdGltZXRhYmxlJTJGMTYzNzAzNDMlMkY="
  navigated to "https://erp-testops-dev.infra.altegio.cloud/signin/JTJGdGltZXRhYmxlJTJGMTYzNzAzNDMlMkY="
============================================================

Stacktrace:

suite/yclients/biz/erp/web/test_link_master_in_service_interface_pw.py:658 in test_create_new_master_in_service_interface_already_linked_user_not_link
lib/apps_pw/yclients/biz/erp/web/pages/guest/signin.py:115 in sign_in

Seen in: - altegio/biz.erp#227787 — shard 5 — launch 171752 (×1, last 2026-10-02 11:50 MSK)

TimeoutError — 1 occurrence(s) across 1 pipeline(s)

playwright._impl._errors.TimeoutError: Locator.click: Timeout 30000ms exceeded.
Call log:
  - waiting for locator("[class*=\"erp-nav-menu-mode-switch-footer-button\"]:visible, [class*=\"erp-nav-menu-mode-switch-mini__button\"]:visible").first
    - locator resolved to <div data-locator="nav_menu_mode_switch_btn" class="erp-nav-menu-mode-switch-footer-button">…</div>
  - attempting click action
    2 × waiting for element to be visible, enabled and stable
      - element is visible, enabled and stable
      - scrolling into view if needed
      - done scrolling
      - <div class="v-error-modal v-error-modal--unauthorized">…</div> intercepts pointer events
    - retrying click action
    - waiting 20ms
    2 × waiting for element to be visible, enabled and stable
      - element is visible, enabled and stable
      - scrolling into view if needed
      - done scrolling
      - <div class="v-error-modal v-error-modal--unauthorized">…</div> intercepts pointer events
    - retrying click action
      - waiting 100ms
    56 × waiting for element to be visible, enabled and stable
       - element is visible, enabled and stable
       - scrolling into view if needed
       - done scrolling
       - <div class="v-error-modal v-error-modal--unauthorized">…</div> intercepts pointer events
     - retrying click action
       - waiting 500ms
AssertionError: Failed to navigate through menu item MENU_ITEM_SETTINGS. Browser diagnostics:
{
  "url": "https://erp-testops-dev.infra.altegio.cloud/timetable/16360525/#mode=1",
  "observer": {
    "installed": true,
    "first_js_error": null,
    "js_errors": [],
    "js_errors_by_location": {},
    "xhr_queue": []
  },
  "page_errors": [],
  "console": [
    {
      "type": "warning",
      "text": "Web Vitals polyfill required",
      "location": {
        "url": "https://erp-testops-dev.infra.altegio.cloud/js/vue-vite-app/chunk-a6Oo9G3y2.js",
        "lineNumber": 0,
        "columnNumber": 11968
      }
    },
    {
      "type": "error",
      "text": "Failed to load resource: the server responded with a status of 401 ()",
      "location": {
        "url": "https://erp-testops-dev.infra.altegio.cloud/api/v1/company/16360525/timetable/schedule?dates%5B%5D=2026-10-02&include%5B%5D=tt_day_schedule_resource_instances.resource_instance.resource&include%5B%5D=tt_day_schedule_resource_instances.resource_instance&include%5B%5D=tt_day_schedule_resource_instances&include%5B%5D=tt_day_schedule_masters.master&include%5B%5D=tt_day_schedule_masters&include%5B%5D=tt_day_schedule_masters.tt_day_master_grid_status&new_timetable_schedule_from_legacy=1&_=1790903485062",
        "lineNumber": 0,
        "columnNumber": 0
      }
    },
    {
      "type": "error",
      "text": "Failed to load resource: the server responded with a status of 401 ()",
      "location": {
        "url": "https://erp-testops-dev.infra.altegio.cloud/api/v1/company/16360525/timetable/attendance_day?dates%5B%5D=2026-10-02&include%5B%5D=records&include%5B%5D=records.services&include%5B%5D=records.labels&include%5B%5D=records.master&include%5B%5D=records.client&include%5B%5D=records.client.first_successful_visit&include%5B%5D=records.comer&include%5B%5D=records.comer.vehicle&include%5B%5D=records.resource_instances.resource&include%5B%5D=records.resource_instances&include%5B%5D=records.acceptance_free&include%5B%5D=records.attendance_service_items.attendance_service_composite.composite_service&include%5B%5D=records.duration_details&include%5B%5D=activities&include%5B%5D=activities.service&include%5B%5D=activities.labels&include%5B%5D=activities.master&include%5B%5D=activities.resource_instances.resource&include%5B%5D=activities.resource_instances&include%5B%5D=activities.duration_details&new_timetable_attendance_from_legacy=1&_=1790903485061",
        "lineNumber": 0,
        "columnNumber": 0
      }
    },
    {
      "type": "error",
      "text": "Failed to load resource: the server responded with a status of 401 ()",
      "location... [truncated]

Stacktrace:

lib/apps_pw/yclients/biz/erp/web/components/menu.py:214 in click_menu
lib/apps_pw/yclients/biz/erp/web/components/menu.py:228 in _click_menu
lib/apps_pw/yclients/biz/erp/web/pages/user.py:464 in _ensure_administration_mode_for_legacy_menu
suite/yclients/biz/erp/web/test_link_master_in_service_interface_pw.py:665 in test_create_new_master_in_service_interface_already_linked_user_not_link
lib/apps_pw/yclients/biz/erp/web/components/menu.py:216 in click_menu

Seen in: - altegio/biz.erp#227722 — shard 4 — launch 171516 (×1, last 2026-10-02 04:26 MSK)

TimeoutError — 1 occurrence(s) across 1 pipeline(s)

playwright._impl._errors.TimeoutError: Locator.click: Timeout 30000ms exceeded.
Call log:
  - waiting for locator("[class*=\"erp-nav-menu-mode-switch-footer-button\"]:visible, [class*=\"erp-nav-menu-mode-switch-mini__button\"]:visible").first
    - locator resolved to <div data-locator="nav_menu_mode_switch_btn" class="erp-nav-menu-mode-switch-footer-button">…</div>
  - attempting click action
    2 × waiting for element to be visible, enabled and stable
      - element is visible, enabled and stable
      - scrolling into view if needed
      - done scrolling
      - <div class="v-error-modal v-error-modal--unauthorized v-error-modal__fade-enter-active v-error-modal__fade-enter-to">…</div> intercepts pointer events
    - retrying click action
    - waiting 20ms
    - waiting for element to be visible, enabled and stable
    - element is visible, enabled and stable
    - scrolling into view if needed
    - done scrolling
    - <div class="v-error-modal v-error-modal--unauthorized v-error-modal__fade-enter-active v-error-modal__fade-enter-to">…</div> intercepts pointer events
  2 × retrying click action
      - waiting 100ms
      - waiting for element to be visible, enabled and stable
      - element is visible, enabled and stable
      - scrolling into view if needed
      - done scrolling
      - <div class="v-error-modal v-error-modal--unauthorized">…</div> intercepts pointer events
  55 × retrying click action
       - waiting 500ms
       - waiting for element to be visible, enabled and stable
       - element is visible, enabled and stable
       - scrolling into view if needed
       - done scrolling
       - <div class="v-error-modal v-error-modal--unauthorized">…</div> intercepts pointer events
  - retrying click action
    - waiting 500ms
AssertionError: Failed to navigate through menu item MENU_ITEM_SETTINGS. Browser diagnostics:
{
  "url": "https://erp-testops-dev.infra.altegio.cloud/timetable/16363874/#mode=1",
  "observer": {
    "installed": true,
    "first_js_error": null,
    "js_errors": [],
    "js_errors_by_location": {},
    "xhr_queue": []
  },
  "page_errors": [],
  "console": [
    {
      "type": "warning",
      "text": "Web Vitals polyfill required",
      "location": {
        "url": "https://erp-testops-dev.infra.altegio.cloud/js/vue-vite-app/chunk-a6Oo9G3y2.js",
        "lineNumber": 0,
        "columnNumber": 11968
      }
    },
    {
      "type": "error",
      "text": "Failed to load resource: the server responded with a status of 401 ()",
      "location": {
        "url": "https://erp-testops-dev.infra.altegio.cloud/api/v1/company/16363874/timetable/schedule?dates%5B%5D=2026-10-02&include%5B%5D=tt_day_schedule_resource_instances.resource_instance.resource&include%5B%5D=tt_day_schedule_resource_instances.resource_instance&include%5B%5D=tt_day_schedule_resource_instances&include%5B%5D=tt_day_schedule_masters.master&include%5B%5D=tt_day_schedule_masters&include%5B%5D=tt_day_schedule_masters.tt_day_master_grid_status&new_timetable_schedule_from_legacy=1&_=1790909933765",
        "lineNumber": 0,
        "columnNumber": 0
      }
    },
    {
      "type": "error",
      "text": "Failed to load resource: the server responded with a status of 401 ()",
      "location": {
        "url": "https://erp-testops-dev.infra.altegio.cloud/api/v1/company/16363874/staff/workload?start_date=2026-10-01&end_date=2026-10-31&_=1790909933763",
        "lineNumber": 0,
        "columnNumber": 0
      }
    },
    {
      "type": "error",
      "text": "Failed to load resource: the server responded with a status of 401 ()",
      "location": {
        "url": "https://erp-testops-dev.infra.altegio.cloud/api/v1/company/16363874/timetable/attendance_day?dates%5B%5D=2026-10-02&include%5B%5D=records&include%5B%5D=records.services&include%5B%5D=records.labels&include%5B%5D=records.master&include%5B%5D=records.client&include%5B%5D=records.client.first_successful_visit&include%5B%5D=records.comer&include%5B%5D=records.com... [truncated]

Stacktrace:

lib/apps_pw/yclients/biz/erp/web/components/menu.py:214 in click_menu
lib/apps_pw/yclients/biz/erp/web/components/menu.py:228 in _click_menu
lib/apps_pw/yclients/biz/erp/web/pages/user.py:464 in _ensure_administration_mode_for_legacy_menu
suite/yclients/biz/erp/web/test_link_master_in_service_interface_pw.py:665 in test_create_new_master_in_service_interface_already_linked_user_not_link
lib/apps_pw/yclients/biz/erp/web/components/menu.py:216 in click_menu

Seen in: - altegio/biz.erp#227735 — shard 2 — launch 171549 (×1, last 2026-10-02 06:23 MSK)

TimeoutError — 1 occurrence(s) across 1 pipeline(s)

playwright._impl._errors.TimeoutError: Locator.click: Timeout 30000ms exceeded.
Call log:
  - waiting for locator("[class*=\"erp-nav-menu-mode-switch-footer-button\"]:visible, [class*=\"erp-nav-menu-mode-switch-mini__button\"]:visible").first
    - locator resolved to <div data-locator="nav_menu_mode_switch_btn" class="erp-nav-menu-mode-switch-footer-button">…</div>
  - attempting click action
    2 × waiting for element to be visible, enabled and stable
      - element is visible, enabled and stable
      - scrolling into view if needed
      - done scrolling
      - <div class="v-error-modal v-error-modal--unauthorized">…</div> intercepts pointer events
    - retrying click action
    - waiting 20ms
    2 × waiting for element to be visible, enabled and stable
      - element is visible, enabled and stable
      - scrolling into view if needed
      - done scrolling
      - <div class="v-error-modal v-error-modal--unauthorized">…</div> intercepts pointer events
    - retrying click action
      - waiting 100ms
    56 × waiting for element to be visible, enabled and stable
       - element is visible, enabled and stable
       - scrolling into view if needed
       - done scrolling
       - <div class="v-error-modal v-error-modal--unauthorized">…</div> intercepts pointer events
     - retrying click action
       - waiting 500ms
AssertionError: Failed to navigate through menu item MENU_ITEM_SETTINGS. Browser diagnostics:
{
  "url": "https://erp-testops-dev.infra.altegio.cloud/timetable/16365080/#mode=1",
  "observer": {
    "installed": true,
    "first_js_error": null,
    "js_errors": [],
    "js_errors_by_location": {},
    "xhr_queue": []
  },
  "page_errors": [],
  "console": [
    {
      "type": "warning",
      "text": "Web Vitals polyfill required",
      "location": {
        "url": "https://erp-testops-dev.infra.altegio.cloud/js/vue-vite-app/chunk-a6Oo9G3y2.js",
        "lineNumber": 0,
        "columnNumber": 11968
      }
    },
    {
      "type": "error",
      "text": "Failed to load resource: the server responded with a status of 401 ()",
      "location": {
        "url": "https://erp-testops-dev.infra.altegio.cloud/api/v1/company/16365080/staff/workload?start_date=2026-10-01&end_date=2026-10-31&_=1790910981405",
        "lineNumber": 0,
        "columnNumber": 0
      }
    },
    {
      "type": "error",
      "text": "Failed to load resource: the server responded with a status of 401 ()",
      "location": {
        "url": "https://erp-testops-dev.infra.altegio.cloud/api/v1/company/16365080/timetable/schedule?dates%5B%5D=2026-10-02&include%5B%5D=tt_day_schedule_resource_instances.resource_instance.resource&include%5B%5D=tt_day_schedule_resource_instances.resource_instance&include%5B%5D=tt_day_schedule_resource_instances&include%5B%5D=tt_day_schedule_masters.master&include%5B%5D=tt_day_schedule_masters&include%5B%5D=tt_day_schedule_masters.tt_day_master_grid_status&new_timetable_schedule_from_legacy=1&_=1790910981407",
        "lineNumber": 0,
        "columnNumber": 0
      }
    },
    {
      "type": "error",
      "text": "Failed to load resource: the server responded with a status of 401 ()",
      "location": {
        "url": "https://erp-testops-dev.infra.altegio.cloud/api/v1/company/16365080/timetable/attendance_day?dates%5B%5D=2026-10-02&include%5B%5D=records&include%5B%5D=records.services&include%5B%5D=records.labels&include%5B%5D=records.master&include%5B%5D=records.client&include%5B%5D=records.client.first_successful_visit&include%5B%5D=records.comer&include%5B%5D=records.comer.vehicle&include%5B%5D=records.resource_instances.resource&include%5B%5D=records.resource_instances&include%5B%5D=records.acceptance_free&include%5B%5D=records.attendance_service_items.attendance_service_composite.composite_service&include%5B%5D=records.duration_details&include%5B%5D=activities&include%5B%5D=activities.service&include%5B%5D=activities.labels&include%5B%5D=activities.master&include%5B%5D=activities.resourc... [truncated]

Stacktrace:

lib/apps_pw/yclients/biz/erp/web/components/menu.py:214 in click_menu
lib/apps_pw/yclients/biz/erp/web/components/menu.py:228 in _click_menu
lib/apps_pw/yclients/biz/erp/web/pages/user.py:464 in _ensure_administration_mode_for_legacy_menu
suite/yclients/biz/erp/web/test_link_master_in_service_interface_pw.py:665 in test_create_new_master_in_service_interface_already_linked_user_not_link
lib/apps_pw/yclients/biz/erp/web/components/menu.py:216 in click_menu

Seen in: - altegio/biz.erp#227735 — shard 2 — launch 171549 (×1, last 2026-10-02 06:23 MSK)