Skip to content

#23984 Редактирование услуги. Нельзя создать должность в модалке создания сотрудника без права

test_create_new_master_in_service_interface_cant_create_position_without_rights

Failures in last 30 days: 14

Generated at 2026-10-08 03:48 MSK

Last failure: 2026-10-02 11:50 MSK

Filter: pipelines with sandbox_biz_erp ∈ {master, testops-dev} AND autotests_branch ∈ {master, main} only (testops-dev — daytime ticks since 2026-08-05).

By exception class: - SigninRedirectMissingError — 8 - TimeoutError — 3 - KeyError — 2 - AssertionError — 1

Failure signatures (grouped by exception + full message):

KeyError — 2 occurrence(s) across 2 pipeline(s)

KeyError: 'salon_with_entities'

Seen in: - altegio/biz.erp#227787 — shard 1 — launch 171752 (×1, last 2026-10-02 11:50 MSK) - altegio/biz.erp#226698 — shard 4 — launch 169315 (×1, last 2026-09-28 22:50 MSK)

AssertionError — 1 occurrence(s) across 1 pipeline(s)

AssertionError: Locator expected to be visible
Actual value: None
Error: element(s) not found
Call log:
  - Expect "to_be_visible" with timeout 30000ms
  - waiting for locator("[data-locator='y-core-collapse-item'][value='29035730']").first

Stacktrace:

suite/yclients/biz/erp/web/test_link_master_in_service_interface_pw.py:767 in test_create_new_master_in_service_interface_cant_create_position_without_rights
lib/apps_pw/yclients/biz/erp/web/pages/__init__.py:77 in decorated
lib/apps_pw/yclients/biz/erp/web/pages/service/filial/__init__.py:594 in click_edit_service
lib/apps_pw/yclients/biz/erp/web/pages/__init__.py:77 in decorated
lib/apps_pw/yclients/biz/erp/web/pages/service/filial/__init__.py:40 in expand_service_category

Seen in: - altegio/biz.erp#227596 — shard 5 — launch 171280 (×1, last 2026-10-01 17:40 MSK)

SigninRedirectMissingError — 1 occurrence(s) across 1 pipeline(s)

autotests.lib.exception.SigninRedirectMissingError: login-XHR завершился со статусом 200, но редиректа со /signin/ не случилось за 30 с — подозрение на фронт biz.erp
--- причина (playwright) ---
Timeout 30000ms exceeded.
=========================== logs ===========================
waiting for navigation to "<function ImplToApiMapping.wrap_handler.<locals>.wrapper_func at 0x7f73a911bd80>" until 'commit'
  navigated to "https://erp-testops-dev.infra.altegio.cloud/signin/"
  navigated to "https://erp-testops-dev.infra.altegio.cloud/signin/"
  navigated to "https://erp-testops-dev.infra.altegio.cloud/signin/JTJGdGltZXRhYmxlJTJGMTYzNTg2ODklMkY="
  navigated to "https://erp-testops-dev.infra.altegio.cloud/signin/JTJGdGltZXRhYmxlJTJGMTYzNTg2ODklMkY="
  navigated to "https://erp-testops-dev.infra.altegio.cloud/signin/JTJGdGltZXRhYmxlJTJGMTYzNTg2ODklMkY="
============================================================

Stacktrace:

suite/yclients/biz/erp/web/test_link_master_in_service_interface_pw.py:756 in test_create_new_master_in_service_interface_cant_create_position_without_rights
lib/apps_pw/yclients/biz/erp/web/pages/guest/signin.py:115 in sign_in

Seen in: - altegio/biz.erp#227722 — shard 8 — launch 171516 (×1, last 2026-10-02 04:26 MSK)

SigninRedirectMissingError — 1 occurrence(s) across 1 pipeline(s)

autotests.lib.exception.SigninRedirectMissingError: login-XHR завершился со статусом 200, но редиректа со /signin/ не случилось за 30 с — подозрение на фронт biz.erp
--- причина (playwright) ---
Timeout 30000ms exceeded.
=========================== logs ===========================
waiting for navigation to "<function ImplToApiMapping.wrap_handler.<locals>.wrapper_func at 0x7f6246bdefc0>" until 'commit'
  navigated to "https://erp-testops-dev.infra.altegio.cloud/signin/"
  navigated to "https://erp-testops-dev.infra.altegio.cloud/signin/"
  navigated to "https://erp-testops-dev.infra.altegio.cloud/signin/JTJGdGltZXRhYmxlJTJGMTYzNTk4NjElMkY="
  navigated to "https://erp-testops-dev.infra.altegio.cloud/signin/JTJGdGltZXRhYmxlJTJGMTYzNTk4NjElMkY="
  navigated to "https://erp-testops-dev.infra.altegio.cloud/signin/JTJGdGltZXRhYmxlJTJGMTYzNTk4NjElMkY="
============================================================

Stacktrace:

suite/yclients/biz/erp/web/test_link_master_in_service_interface_pw.py:756 in test_create_new_master_in_service_interface_cant_create_position_without_rights
lib/apps_pw/yclients/biz/erp/web/pages/guest/signin.py:115 in sign_in

Seen in: - altegio/biz.erp#227722 — shard 8 — launch 171516 (×1, last 2026-10-02 04:26 MSK)

SigninRedirectMissingError — 1 occurrence(s) across 1 pipeline(s)

autotests.lib.exception.SigninRedirectMissingError: login-XHR завершился со статусом 200, но редиректа со /signin/ не случилось за 30 с — подозрение на фронт biz.erp
--- причина (playwright) ---
Timeout 30000ms exceeded.
=========================== logs ===========================
waiting for navigation to "<function ImplToApiMapping.wrap_handler.<locals>.wrapper_func at 0x7fe47942f2e0>" until 'commit'
  navigated to "https://erp-testops-dev.infra.altegio.cloud/signin/"
  navigated to "https://erp-testops-dev.infra.altegio.cloud/signin/"
  navigated to "https://erp-testops-dev.infra.altegio.cloud/signin/JTJGdGltZXRhYmxlJTJGMTYzNjA4NjMlMkY="
  navigated to "https://erp-testops-dev.infra.altegio.cloud/signin/JTJGdGltZXRhYmxlJTJGMTYzNjA4NjMlMkY="
  navigated to "https://erp-testops-dev.infra.altegio.cloud/signin/JTJGdGltZXRhYmxlJTJGMTYzNjA4NjMlMkY="
============================================================

Stacktrace:

suite/yclients/biz/erp/web/test_link_master_in_service_interface_pw.py:756 in test_create_new_master_in_service_interface_cant_create_position_without_rights
lib/apps_pw/yclients/biz/erp/web/pages/guest/signin.py:115 in sign_in

Seen in: - altegio/biz.erp#227722 — shard 8 — launch 171516 (×1, last 2026-10-02 04:26 MSK)

SigninRedirectMissingError — 1 occurrence(s) across 1 pipeline(s)

autotests.lib.exception.SigninRedirectMissingError: login-XHR завершился со статусом 200, но редиректа со /signin/ не случилось за 30 с — подозрение на фронт biz.erp
--- причина (playwright) ---
Timeout 30000ms exceeded.
=========================== logs ===========================
waiting for navigation to "<function ImplToApiMapping.wrap_handler.<locals>.wrapper_func at 0x7f1cbce40f40>" until 'commit'
  navigated to "https://erp-testops-dev.infra.altegio.cloud/signin/"
  navigated to "https://erp-testops-dev.infra.altegio.cloud/signin/"
  navigated to "https://erp-testops-dev.infra.altegio.cloud/signin/JTJGdGltZXRhYmxlJTJGMTYzNjI0MzQlMkY="
  navigated to "https://erp-testops-dev.infra.altegio.cloud/signin/JTJGdGltZXRhYmxlJTJGMTYzNjI0MzQlMkY="
  navigated to "https://erp-testops-dev.infra.altegio.cloud/signin/JTJGdGltZXRhYmxlJTJGMTYzNjI0MzQlMkY="
============================================================

Stacktrace:

suite/yclients/biz/erp/web/test_link_master_in_service_interface_pw.py:756 in test_create_new_master_in_service_interface_cant_create_position_without_rights
lib/apps_pw/yclients/biz/erp/web/pages/guest/signin.py:115 in sign_in

Seen in: - altegio/biz.erp#227735 — shard 4 — launch 171549 (×1, last 2026-10-02 06:23 MSK)

SigninRedirectMissingError — 1 occurrence(s) across 1 pipeline(s)

autotests.lib.exception.SigninRedirectMissingError: login-XHR завершился со статусом 200, но редиректа со /signin/ не случилось за 30 с — подозрение на фронт biz.erp
--- причина (playwright) ---
Timeout 30000ms exceeded.
=========================== logs ===========================
waiting for navigation to "<function ImplToApiMapping.wrap_handler.<locals>.wrapper_func at 0x7fd3f730ef20>" until 'commit'
  navigated to "https://erp-testops-dev.infra.altegio.cloud/signin/"
  navigated to "https://erp-testops-dev.infra.altegio.cloud/signin/"
  navigated to "https://erp-testops-dev.infra.altegio.cloud/signin/JTJGdGltZXRhYmxlJTJGMTYzNjQ4MzIlMkY="
  navigated to "https://erp-testops-dev.infra.altegio.cloud/signin/JTJGdGltZXRhYmxlJTJGMTYzNjQ4MzIlMkY="
  navigated to "https://erp-testops-dev.infra.altegio.cloud/signin/JTJGdGltZXRhYmxlJTJGMTYzNjQ4MzIlMkY="
============================================================

Stacktrace:

suite/yclients/biz/erp/web/test_link_master_in_service_interface_pw.py:756 in test_create_new_master_in_service_interface_cant_create_position_without_rights
lib/apps_pw/yclients/biz/erp/web/pages/guest/signin.py:115 in sign_in

Seen in: - altegio/biz.erp#227735 — shard 4 — launch 171549 (×1, last 2026-10-02 06:23 MSK)

SigninRedirectMissingError — 1 occurrence(s) across 1 pipeline(s)

autotests.lib.exception.SigninRedirectMissingError: login-XHR завершился со статусом 200, но редиректа со /signin/ не случилось за 30 с — подозрение на фронт biz.erp
--- причина (playwright) ---
Timeout 30000ms exceeded.
=========================== logs ===========================
waiting for navigation to "<function ImplToApiMapping.wrap_handler.<locals>.wrapper_func at 0x7f91938b0860>" until 'commit'
  navigated to "https://erp-testops-dev.infra.altegio.cloud/signin/"
  navigated to "https://erp-testops-dev.infra.altegio.cloud/signin/"
  navigated to "https://erp-testops-dev.infra.altegio.cloud/signin/JTJGdGltZXRhYmxlJTJGMTYzNjY3MDIlMkY="
  navigated to "https://erp-testops-dev.infra.altegio.cloud/signin/JTJGdGltZXRhYmxlJTJGMTYzNjY3MDIlMkY="
  navigated to "https://erp-testops-dev.infra.altegio.cloud/signin/JTJGdGltZXRhYmxlJTJGMTYzNjY3MDIlMkY="
============================================================

Stacktrace:

suite/yclients/biz/erp/web/test_link_master_in_service_interface_pw.py:756 in test_create_new_master_in_service_interface_cant_create_position_without_rights
lib/apps_pw/yclients/biz/erp/web/pages/guest/signin.py:115 in sign_in

Seen in: - altegio/biz.erp#227749 — shard 2 — launch 171616 (×1, last 2026-10-02 08:20 MSK)

SigninRedirectMissingError — 1 occurrence(s) across 1 pipeline(s)

autotests.lib.exception.SigninRedirectMissingError: login-XHR завершился со статусом 200, но редиректа со /signin/ не случилось за 30 с — подозрение на фронт biz.erp
--- причина (playwright) ---
Timeout 30000ms exceeded.
=========================== logs ===========================
waiting for navigation to "<function ImplToApiMapping.wrap_handler.<locals>.wrapper_func at 0x7fa40e189bc0>" until 'commit'
  navigated to "https://erp-testops-dev.infra.altegio.cloud/signin/"
  navigated to "https://erp-testops-dev.infra.altegio.cloud/signin/"
  navigated to "https://erp-testops-dev.infra.altegio.cloud/signin/JTJGdGltZXRhYmxlJTJGMTYzNjgwMjglMkY="
  navigated to "https://erp-testops-dev.infra.altegio.cloud/signin/JTJGdGltZXRhYmxlJTJGMTYzNjgwMjglMkY="
  navigated to "https://erp-testops-dev.infra.altegio.cloud/signin/JTJGdGltZXRhYmxlJTJGMTYzNjgwMjglMkY="
============================================================

Stacktrace:

suite/yclients/biz/erp/web/test_link_master_in_service_interface_pw.py:756 in test_create_new_master_in_service_interface_cant_create_position_without_rights
lib/apps_pw/yclients/biz/erp/web/pages/guest/signin.py:115 in sign_in

Seen in: - altegio/biz.erp#227749 — shard 2 — launch 171616 (×1, last 2026-10-02 08:20 MSK)

SigninRedirectMissingError — 1 occurrence(s) across 1 pipeline(s)

autotests.lib.exception.SigninRedirectMissingError: login-XHR завершился со статусом 200, но редиректа со /signin/ не случилось за 30 с — подозрение на фронт biz.erp
--- причина (playwright) ---
Timeout 30000ms exceeded.
=========================== logs ===========================
waiting for navigation to "<function ImplToApiMapping.wrap_handler.<locals>.wrapper_func at 0x7fd15e9e2e80>" until 'commit'
  navigated to "https://erp-testops-dev.infra.altegio.cloud/signin/"
  navigated to "https://erp-testops-dev.infra.altegio.cloud/signin/"
  navigated to "https://erp-testops-dev.infra.altegio.cloud/signin/JTJGdGltZXRhYmxlJTJGMTYzNjkxMzIlMkY="
  navigated to "https://erp-testops-dev.infra.altegio.cloud/signin/JTJGdGltZXRhYmxlJTJGMTYzNjkxMzIlMkY="
  navigated to "https://erp-testops-dev.infra.altegio.cloud/signin/JTJGdGltZXRhYmxlJTJGMTYzNjkxMzIlMkY="
============================================================

Stacktrace:

suite/yclients/biz/erp/web/test_link_master_in_service_interface_pw.py:756 in test_create_new_master_in_service_interface_cant_create_position_without_rights
lib/apps_pw/yclients/biz/erp/web/pages/guest/signin.py:115 in sign_in

Seen in: - altegio/biz.erp#227749 — shard 2 — launch 171616 (×1, last 2026-10-02 08:20 MSK)

TimeoutError — 1 occurrence(s) across 1 pipeline(s)

playwright._impl._errors.TimeoutError: Locator.click: Timeout 30000ms exceeded.
Call log:
  - waiting for locator("[class*=\"erp-nav-menu-mode-switch-footer-button\"]:visible, [class*=\"erp-nav-menu-mode-switch-mini__button\"]:visible").first
    - locator resolved to <div data-locator="nav_menu_mode_switch_btn" class="erp-nav-menu-mode-switch-footer-button">…</div>
  - attempting click action
    2 × waiting for element to be visible, enabled and stable
      - element is visible, enabled and stable
      - scrolling into view if needed
      - done scrolling
      - <div class="v-error-modal v-error-modal--unauthorized">…</div> intercepts pointer events
    - retrying click action
    - waiting 20ms
    2 × waiting for element to be visible, enabled and stable
      - element is visible, enabled and stable
      - scrolling into view if needed
      - done scrolling
      - <div class="v-error-modal v-error-modal--unauthorized">…</div> intercepts pointer events
    - retrying click action
      - waiting 100ms
    56 × waiting for element to be visible, enabled and stable
       - element is visible, enabled and stable
       - scrolling into view if needed
       - done scrolling
       - <div class="v-error-modal v-error-modal--unauthorized">…</div> intercepts pointer events
     - retrying click action
       - waiting 500ms
AssertionError: Failed to navigate through menu item MENU_ITEM_SETTINGS. Browser diagnostics:
{
  "url": "https://erp-testops-dev.infra.altegio.cloud/timetable/16356650/#mode=1",
  "observer": {
    "installed": true,
    "first_js_error": null,
    "js_errors": [],
    "js_errors_by_location": {},
    "xhr_queue": []
  },
  "page_errors": [],
  "console": [
    {
      "type": "warning",
      "text": "Web Vitals polyfill required",
      "location": {
        "url": "https://erp-testops-dev.infra.altegio.cloud/js/vue-vite-app/chunk-a6Oo9G3y2.js",
        "lineNumber": 0,
        "columnNumber": 11968
      }
    },
    {
      "type": "error",
      "text": "Failed to load resource: the server responded with a status of 401 ()",
      "location": {
        "url": "https://erp-testops-dev.infra.altegio.cloud/api/v1/company/16356650/staff/workload?start_date=2026-10-01&end_date=2026-10-31&_=1790864938681",
        "lineNumber": 0,
        "columnNumber": 0
      }
    },
    {
      "type": "error",
      "text": "Failed to load resource: the server responded with a status of 401 ()",
      "location": {
        "url": "https://erp-testops-dev.infra.altegio.cloud/api/v1/company/16356650/timetable/attendance_day?dates%5B%5D=2026-10-01&include%5B%5D=records&include%5B%5D=records.services&include%5B%5D=records.labels&include%5B%5D=records.master&include%5B%5D=records.client&include%5B%5D=records.client.first_successful_visit&include%5B%5D=records.comer&include%5B%5D=records.comer.vehicle&include%5B%5D=records.resource_instances.resource&include%5B%5D=records.resource_instances&include%5B%5D=records.acceptance_free&include%5B%5D=records.attendance_service_items.attendance_service_composite.composite_service&include%5B%5D=records.duration_details&include%5B%5D=activities&include%5B%5D=activities.service&include%5B%5D=activities.labels&include%5B%5D=activities.master&include%5B%5D=activities.resource_instances.resource&include%5B%5D=activities.resource_instances&include%5B%5D=activities.duration_details&new_timetable_attendance_from_legacy=1&_=1790864938682",
        "lineNumber": 0,
        "columnNumber": 0
      }
    },
    {
      "type": "error",
      "text": "Failed to load resource: the server responded with a status of 401 ()",
      "location": {
        "url": "https://erp-testops-dev.infra.altegio.cloud/api/v1/company/16356650/timetable/schedule?dates%5B%5D=2026-10-01&include%5B%5D=tt_day_schedule_resource_instances.resource_instance.resource&include%5B%5D=tt_day_schedule_resource_instances.resource_instance&include%5B%5D=tt_day_schedule_resource_instances&include%5B%5D=tt_day_schedule_masters.... [truncated]

Stacktrace:

lib/apps_pw/yclients/biz/erp/web/components/menu.py:214 in click_menu
lib/apps_pw/yclients/biz/erp/web/components/menu.py:228 in _click_menu
lib/apps_pw/yclients/biz/erp/web/pages/user.py:464 in _ensure_administration_mode_for_legacy_menu
suite/yclients/biz/erp/web/test_link_master_in_service_interface_pw.py:763 in test_create_new_master_in_service_interface_cant_create_position_without_rights
lib/apps_pw/yclients/biz/erp/web/components/menu.py:216 in click_menu

Seen in: - altegio/biz.erp#227596 — shard 5 — launch 171280 (×1, last 2026-10-01 17:40 MSK)

TimeoutError — 1 occurrence(s) across 1 pipeline(s)

playwright._impl._errors.TimeoutError: Locator.click: Timeout 30000ms exceeded.
Call log:
  - waiting for locator("[data-locator=\"link_menu_item_settings\"]").first
    - locator resolved to <a href="/settings/menu/16356835/" data-locator="link_menu_item_settings">…</a>
  - attempting click action
    - waiting for element to be visible, enabled and stable
    - element is visible, enabled and stable
    - scrolling into view if needed
    - done scrolling
    - <div class="v-error-modal v-error-modal--unauthorized v-error-modal__fade-enter-from v-error-modal__fade-enter-active">…</div> intercepts pointer events
  - retrying click action
    - waiting for element to be visible, enabled and stable
    - element is visible, enabled and stable
    - scrolling into view if needed
    - done scrolling
    - <div class="v-error-modal v-error-modal--unauthorized v-error-modal__fade-enter-active v-error-modal__fade-enter-to">…</div> intercepts pointer events
  - retrying click action
    - waiting 20ms
    2 × waiting for element to be visible, enabled and stable
      - element is visible, enabled and stable
      - scrolling into view if needed
      - done scrolling
      - <div class="v-error-modal v-error-modal--unauthorized v-error-modal__fade-enter-active v-error-modal__fade-enter-to">…</div> intercepts pointer events
    - retrying click action
      - waiting 100ms
    2 × waiting for element to be visible, enabled and stable
      - element is visible, enabled and stable
      - scrolling into view if needed
      - done scrolling
      - <div class="v-error-modal v-error-modal--unauthorized v-error-modal__fade-enter-active v-error-modal__fade-enter-to">…</div> intercepts pointer events
    - retrying click action
      - waiting 500ms
      - waiting for element to be visible, enabled and stable
      - element is visible, enabled and stable
      - scrolling into view if needed
      - done scrolling
      - <div class="v-error-modal v-error-modal--unauthorized">…</div> intercepts pointer events
    - retrying click action
      - waiting 500ms
    13 × waiting for element to be visible, enabled and stable
       - element is visible, enabled and stable
       - scrolling into view if needed
       - done scrolling
       - <div class="v-error-modal v-error-modal--unauthorized">…</div> intercepts pointer events
     - retrying click action
       - waiting 500ms
       - waiting for element to be visible, enabled and stable
       - element is visible, enabled and stable
       - scrolling into view if needed
       - done scrolling
       - <div class="v-error-modal v-error-modal--unauthorized">…</div> intercepts pointer events
     - retrying click action
       - waiting 500ms
       - waiting for element to be visible, enabled and stable
       - element is visible, enabled and stable
       - scrolling into view if needed
       - done scrolling
       - <div class="v-error-modal v-error-modal--unauthorized v-error-modal__fade-enter-active v-error-modal__fade-enter-to">…</div> intercepts pointer events
     - retrying click action
       - waiting 500ms
       - waiting for element to be visible, enabled and stable
       - element is visible, enabled and stable
       - scrolling into view if needed
       - done scrolling
       - <div class="v-error-modal v-error-modal--unauthorized">…</div> intercepts pointer events
     - retrying click action
       - waiting 500ms
    - waiting for element to be visible, enabled and stable
    - element is visible, enabled and stable
    - scrolling into view if needed
    - done scrolling
    - <div class="v-error-modal v-error-modal--unauthorized">…</div> intercepts pointer events
  - retrying click action
    - waiting 500ms
AssertionError: Failed to navigate through menu item MENU_ITEM_SETTINGS. Browser diagnostics:
{
  "url": "https://erp-testops-dev.infra.altegio.cloud/analytics/16356835/?start_date=02.09.2026&end_date=01.10.2026&user_id=0&position_id=0&master_id=0",
  "... [truncated]

Stacktrace:

lib/apps_pw/yclients/biz/erp/web/components/menu.py:214 in click_menu
lib/apps_pw/yclients/biz/erp/web/components/menu.py:268 in _click_menu
suite/yclients/biz/erp/web/test_link_master_in_service_interface_pw.py:763 in test_create_new_master_in_service_interface_cant_create_position_without_rights
lib/apps_pw/yclients/biz/erp/web/components/menu.py:216 in click_menu

Seen in: - altegio/biz.erp#227596 — shard 5 — launch 171280 (×1, last 2026-10-01 17:40 MSK)

TimeoutError — 1 occurrence(s) across 1 pipeline(s)

playwright._impl._errors.TimeoutError: Locator.click: Timeout 30000ms exceeded.
Call log:
  - waiting for locator("[class*=\"erp-nav-menu-mode-switch-footer-button\"]:visible, [class*=\"erp-nav-menu-mode-switch-mini__button\"]:visible").first
    - locator resolved to <div data-locator="nav_menu_mode_switch_btn" class="erp-nav-menu-mode-switch-footer-button">…</div>
  - attempting click action
    2 × waiting for element to be visible, enabled and stable
      - element is visible, enabled and stable
      - scrolling into view if needed
      - done scrolling
      - <div class="v-error-modal v-error-modal--unauthorized v-error-modal__fade-enter-active v-error-modal__fade-enter-to">…</div> intercepts pointer events
    - retrying click action
    - waiting 20ms
    - waiting for element to be visible, enabled and stable
    - element is visible, enabled and stable
    - scrolling into view if needed
    - done scrolling
    - <div class="v-error-modal v-error-modal--unauthorized v-error-modal__fade-enter-active v-error-modal__fade-enter-to">…</div> intercepts pointer events
  2 × retrying click action
      - waiting 100ms
      - waiting for element to be visible, enabled and stable
      - element is visible, enabled and stable
      - scrolling into view if needed
      - done scrolling
      - <div class="v-error-modal v-error-modal--unauthorized">…</div> intercepts pointer events
  55 × retrying click action
       - waiting 500ms
       - waiting for element to be visible, enabled and stable
       - element is visible, enabled and stable
       - scrolling into view if needed
       - done scrolling
       - <div class="v-error-modal v-error-modal--unauthorized">…</div> intercepts pointer events
  - retrying click action
    - waiting 500ms
AssertionError: Failed to navigate through menu item MENU_ITEM_SETTINGS. Browser diagnostics:
{
  "url": "https://erp-testops-dev.infra.altegio.cloud/timetable/16363682/#mode=1",
  "observer": {
    "installed": true,
    "first_js_error": null,
    "js_errors": [],
    "js_errors_by_location": {},
    "xhr_queue": []
  },
  "page_errors": [],
  "console": [
    {
      "type": "warning",
      "text": "Web Vitals polyfill required",
      "location": {
        "url": "https://erp-testops-dev.infra.altegio.cloud/js/vue-vite-app/chunk-a6Oo9G3y2.js",
        "lineNumber": 0,
        "columnNumber": 11968
      }
    },
    {
      "type": "error",
      "text": "Failed to load resource: the server responded with a status of 401 ()",
      "location": {
        "url": "https://erp-testops-dev.infra.altegio.cloud/api/v1/company/16363682/staff/workload?start_date=2026-10-01&end_date=2026-10-31&_=1790909760178",
        "lineNumber": 0,
        "columnNumber": 0
      }
    },
    {
      "type": "error",
      "text": "Failed to load resource: the server responded with a status of 401 ()",
      "location": {
        "url": "https://erp-testops-dev.infra.altegio.cloud/api/v1/company/16363682/timetable/attendance_day?dates%5B%5D=2026-10-02&include%5B%5D=records&include%5B%5D=records.services&include%5B%5D=records.labels&include%5B%5D=records.master&include%5B%5D=records.client&include%5B%5D=records.client.first_successful_visit&include%5B%5D=records.comer&include%5B%5D=records.comer.vehicle&include%5B%5D=records.resource_instances.resource&include%5B%5D=records.resource_instances&include%5B%5D=records.acceptance_free&include%5B%5D=records.attendance_service_items.attendance_service_composite.composite_service&include%5B%5D=records.duration_details&include%5B%5D=activities&include%5B%5D=activities.service&include%5B%5D=activities.labels&include%5B%5D=activities.master&include%5B%5D=activities.resource_instances.resource&include%5B%5D=activities.resource_instances&include%5B%5D=activities.duration_details&new_timetable_attendance_from_legacy=1&_=1790909760179",
        "lineNumber": 0,
        "columnNumber": 0
      }
    },
    {
      "type": "error",
      "text": "Failed to load resour... [truncated]

Stacktrace:

lib/apps_pw/yclients/biz/erp/web/components/menu.py:214 in click_menu
lib/apps_pw/yclients/biz/erp/web/components/menu.py:228 in _click_menu
lib/apps_pw/yclients/biz/erp/web/pages/user.py:464 in _ensure_administration_mode_for_legacy_menu
suite/yclients/biz/erp/web/test_link_master_in_service_interface_pw.py:763 in test_create_new_master_in_service_interface_cant_create_position_without_rights
lib/apps_pw/yclients/biz/erp/web/components/menu.py:216 in click_menu

Seen in: - altegio/biz.erp#227735 — shard 4 — launch 171549 (×1, last 2026-10-02 06:23 MSK)