Есть дефолтный сотрудник. Повтор записи с другим сотрудником.¶
test_default_master_repeat_booking_with_another_master
Failures in last 30 days: 13
Generated at 2026-10-08 03:35 MSK
Last failure: 2026-10-02 11:50 MSK
Filter: pipelines with sandbox_biz_erp ∈ {master, testops-dev} AND autotests_branch ∈ {master, main} only (testops-dev — daytime ticks since 2026-08-05).
By exception class:
- TimeoutException — 10
- WebDriverException — 3
Failure signatures (grouped by exception + full message):
TimeoutException — 1 occurrence(s) across 1 pipeline(s)¶
selenium.common.exceptions.TimeoutException: Message: Ожидаем элемент в DOM: "[data-locator="header_small_button_close"]", параметры метода ожидания: ([
"css selector",
"None",
"[data-locator=\"header_small_button_close\"]",
"<autotests.lib.apps.yclients.client.booking.web.pages.created_booking.CreatedBookingPage object at 0x7fd730a672f0>"
]), условия ожидания: ([
"timeout: 25s"
])
Stacktrace:
#0 0x55f3971595e3 <unknown>
#1 0x55f396e1c0b7 <unknown>
#2 0x55f396e69f53 <unknown>
#3 0x55f396e6a051 <unknown>
#4 0x55f396eaf9c4 <unknown>
#5 0x55f396e90f1d <unknown>
#6 0x55f396eacb3d <unknown>
#7 0x55f396e90cc3 <unknown>
#8 0x55f396e5c0e4 <unknown>
#9 0x55f396e5d0ae <unknown>
#10 0x55f39711fce1 <unknown>
#11 0x55f397123b7e <unknown>
#12 0x55f39710d4b5 <unknown>
#13 0x55f3971247d6 <unknown>
#14 0x55f3970f0dbf <unknown>
#15 0x55f397147748 <unknown>
#16 0x55f397147917 <unknown>
#17 0x55f397158773 <unknown>
#18 0x7f254bb5daa4 <unknown>
#19 0x7f254bbeaa64 __clone
Stacktrace:
lib/common/ui/pages/web.py:61 in decorated
lib/apps/yclients/client/booking/web/pages/created_booking.py:396 in click_back_btn
lib/common/ui/pages/web.py:61 in decorated
lib/common/ui/pages/web.py:148 in wait_for_element
lib/ui/selenium/webdriver/support/wait.py:28 in until
Seen in: - altegio/biz.erp#227722 — shard 2 — launch 171516 (×1, last 2026-10-02 04:26 MSK)
TimeoutException — 1 occurrence(s) across 1 pipeline(s)¶
selenium.common.exceptions.TimeoutException: Message: Ожидаем элемент в DOM: "[data-locator="header_small_button_close"]", параметры метода ожидания: ([
"css selector",
"None",
"[data-locator=\"header_small_button_close\"]",
"<autotests.lib.apps.yclients.client.booking.web.pages.created_booking.CreatedBookingPage object at 0x7f3aec56f800>"
]), условия ожидания: ([
"timeout: 25s"
])
Stacktrace:
#0 0x55a8ae4d35e3 <unknown>
#1 0x55a8ae1960b7 <unknown>
#2 0x55a8ae1e3f53 <unknown>
#3 0x55a8ae1e4051 <unknown>
#4 0x55a8ae2299c4 <unknown>
#5 0x55a8ae20af1d <unknown>
#6 0x55a8ae226b3d <unknown>
#7 0x55a8ae20acc3 <unknown>
#8 0x55a8ae1d60e4 <unknown>
#9 0x55a8ae1d70ae <unknown>
#10 0x55a8ae499ce1 <unknown>
#11 0x55a8ae49db7e <unknown>
#12 0x55a8ae4874b5 <unknown>
#13 0x55a8ae49e7d6 <unknown>
#14 0x55a8ae46adbf <unknown>
#15 0x55a8ae4c1748 <unknown>
#16 0x55a8ae4c1917 <unknown>
#17 0x55a8ae4d2773 <unknown>
#18 0x7f494916baa4 <unknown>
#19 0x7f49491f8a64 __clone
Stacktrace:
lib/common/ui/pages/web.py:61 in decorated
lib/apps/yclients/client/booking/web/pages/created_booking.py:396 in click_back_btn
lib/common/ui/pages/web.py:61 in decorated
lib/common/ui/pages/web.py:148 in wait_for_element
lib/ui/selenium/webdriver/support/wait.py:28 in until
Seen in: - altegio/biz.erp#227722 — shard 2 — launch 171516 (×1, last 2026-10-02 04:26 MSK)
TimeoutException — 1 occurrence(s) across 1 pipeline(s)¶
selenium.common.exceptions.TimeoutException: Message: Ожидаем элемент в DOM: "[data-locator="timeslot"]", параметры метода ожидания: ([
"css selector",
"None",
"[data-locator=\"timeslot\"]",
"<autotests.lib.apps.yclients.client.booking.web.pages.select_time.SelectTimePage object at 0x7f3c7c6ab740>"
]), условия ожидания: ([
"timeout: 25s"
])
Stacktrace:
#0 0x55b3b592b5e3 <unknown>
#1 0x55b3b55ee0b7 <unknown>
#2 0x55b3b563bf53 <unknown>
#3 0x55b3b563c051 <unknown>
#4 0x55b3b56819c4 <unknown>
#5 0x55b3b5662f1d <unknown>
#6 0x55b3b567eb3d <unknown>
#7 0x55b3b5662cc3 <unknown>
#8 0x55b3b562e0e4 <unknown>
#9 0x55b3b562f0ae <unknown>
#10 0x55b3b58f1ce1 <unknown>
#11 0x55b3b58f5b7e <unknown>
#12 0x55b3b58df4b5 <unknown>
#13 0x55b3b58f67d6 <unknown>
#14 0x55b3b58c2dbf <unknown>
#15 0x55b3b5919748 <unknown>
#16 0x55b3b5919917 <unknown>
#17 0x55b3b592a773 <unknown>
#18 0x7fd016f32aa4 <unknown>
#19 0x7fd016fbfa64 __clone
Exception: There are no available spots for this day
Stacktrace:
suite/yclients/client/booking/web/online_booking/test_master_default.py:248 in test_default_master_repeat_booking_with_another_master
lib/common/ui/pages/web.py:61 in decorated
lib/apps/yclients/client/booking/web/pages/select_time.py:302 in select_date_and_time
lib/common/ui/pages/web.py:61 in decorated
lib/apps/yclients/client/booking/web/pages/select_time.py:351 in select_time
Seen in: - altegio/biz.erp#227722 — shard 2 — launch 171516 (×1, last 2026-10-02 04:26 MSK)
TimeoutException — 1 occurrence(s) across 1 pipeline(s)¶
selenium.common.exceptions.TimeoutException: Message: Ожидаем элемент в DOM: "[data-locator="timeslot"]", параметры метода ожидания: ([
"css selector",
"None",
"[data-locator=\"timeslot\"]",
"<autotests.lib.apps.yclients.client.booking.web.pages.select_time.SelectTimePage object at 0x7f22a03677d0>"
]), условия ожидания: ([
"timeout: 25s"
])
Stacktrace:
#0 0x5654515dc5e3 <unknown>
#1 0x56545129f0b7 <unknown>
#2 0x5654512ecf53 <unknown>
#3 0x5654512ed051 <unknown>
#4 0x5654513329c4 <unknown>
#5 0x565451313f1d <unknown>
#6 0x56545132fb3d <unknown>
#7 0x565451313cc3 <unknown>
#8 0x5654512df0e4 <unknown>
#9 0x5654512e00ae <unknown>
#10 0x5654515a2ce1 <unknown>
#11 0x5654515a6b7e <unknown>
#12 0x5654515904b5 <unknown>
#13 0x5654515a77d6 <unknown>
#14 0x565451573dbf <unknown>
#15 0x5654515ca748 <unknown>
#16 0x5654515ca917 <unknown>
#17 0x5654515db773 <unknown>
#18 0x7f91b0124aa4 <unknown>
#19 0x7f91b01b1a64 __clone
Exception: There are no available spots for this day
Stacktrace:
suite/yclients/client/booking/web/online_booking/test_master_default.py:248 in test_default_master_repeat_booking_with_another_master
lib/common/ui/pages/web.py:61 in decorated
lib/apps/yclients/client/booking/web/pages/select_time.py:302 in select_date_and_time
lib/common/ui/pages/web.py:61 in decorated
lib/apps/yclients/client/booking/web/pages/select_time.py:351 in select_time
Seen in: - altegio/biz.erp#227735 — shard 4 — launch 171549 (×1, last 2026-10-02 06:23 MSK)
TimeoutException — 1 occurrence(s) across 1 pipeline(s)¶
selenium.common.exceptions.TimeoutException: Message: Ожидаем элемент в DOM: "[data-locator="timeslot"]", параметры метода ожидания: ([
"css selector",
"None",
"[data-locator=\"timeslot\"]",
"<autotests.lib.apps.yclients.client.booking.web.pages.select_time.SelectTimePage object at 0x7f188b6404a0>"
]), условия ожидания: ([
"timeout: 25s"
])
Stacktrace:
#0 0x55b1947745e3 <unknown>
#1 0x55b1944370b7 <unknown>
#2 0x55b194484f53 <unknown>
#3 0x55b194485051 <unknown>
#4 0x55b1944ca9c4 <unknown>
#5 0x55b1944abf1d <unknown>
#6 0x55b1944c7b3d <unknown>
#7 0x55b1944abcc3 <unknown>
#8 0x55b1944770e4 <unknown>
#9 0x55b1944780ae <unknown>
#10 0x55b19473ace1 <unknown>
#11 0x55b19473eb7e <unknown>
#12 0x55b1947284b5 <unknown>
#13 0x55b19473f7d6 <unknown>
#14 0x55b19470bdbf <unknown>
#15 0x55b194762748 <unknown>
#16 0x55b194762917 <unknown>
#17 0x55b194773773 <unknown>
#18 0x7f6b28b2faa4 <unknown>
#19 0x7f6b28bbca64 __clone
Exception: There are no available spots for this day
Stacktrace:
suite/yclients/client/booking/web/online_booking/test_master_default.py:248 in test_default_master_repeat_booking_with_another_master
lib/common/ui/pages/web.py:61 in decorated
lib/apps/yclients/client/booking/web/pages/select_time.py:302 in select_date_and_time
lib/common/ui/pages/web.py:61 in decorated
lib/apps/yclients/client/booking/web/pages/select_time.py:351 in select_time
Seen in: - altegio/biz.erp#227735 — shard 4 — launch 171549 (×1, last 2026-10-02 06:23 MSK)
TimeoutException — 1 occurrence(s) across 1 pipeline(s)¶
selenium.common.exceptions.TimeoutException: Message: Ожидаем элемент в DOM: "[data-locator="header_small_button_close"]", параметры метода ожидания: ([
"css selector",
"None",
"[data-locator=\"header_small_button_close\"]",
"<autotests.lib.apps.yclients.client.booking.web.pages.created_booking.CreatedBookingPage object at 0x7f5599db37a0>"
]), условия ожидания: ([
"timeout: 25s"
])
Stacktrace:
#0 0x55953cb7e5e3 <unknown>
#1 0x55953c8410b7 <unknown>
#2 0x55953c88ef53 <unknown>
#3 0x55953c88f051 <unknown>
#4 0x55953c8d49c4 <unknown>
#5 0x55953c8b5f1d <unknown>
#6 0x55953c8d1b3d <unknown>
#7 0x55953c8b5cc3 <unknown>
#8 0x55953c8810e4 <unknown>
#9 0x55953c8820ae <unknown>
#10 0x55953cb44ce1 <unknown>
#11 0x55953cb48b7e <unknown>
#12 0x55953cb324b5 <unknown>
#13 0x55953cb497d6 <unknown>
#14 0x55953cb15dbf <unknown>
#15 0x55953cb6c748 <unknown>
#16 0x55953cb6c917 <unknown>
#17 0x55953cb7d773 <unknown>
#18 0x7fc4090a2aa4 <unknown>
#19 0x7fc40912fa64 __clone
Stacktrace:
lib/common/ui/pages/web.py:61 in decorated
lib/apps/yclients/client/booking/web/pages/created_booking.py:396 in click_back_btn
lib/common/ui/pages/web.py:61 in decorated
lib/common/ui/pages/web.py:148 in wait_for_element
lib/ui/selenium/webdriver/support/wait.py:28 in until
Seen in: - altegio/biz.erp#227735 — shard 4 — launch 171549 (×1, last 2026-10-02 06:23 MSK)
TimeoutException — 1 occurrence(s) across 1 pipeline(s)¶
selenium.common.exceptions.TimeoutException: Message: Ожидаем элемент в DOM: "[data-locator="header_small_button_close"]", параметры метода ожидания: ([
"css selector",
"None",
"[data-locator=\"header_small_button_close\"]",
"<autotests.lib.apps.yclients.client.booking.web.pages.created_booking.CreatedBookingPage object at 0x7f7798e27770>"
]), условия ожидания: ([
"timeout: 25s"
])
Stacktrace:
#0 0x559c3d55f5e3 <unknown>
#1 0x559c3d2220b7 <unknown>
#2 0x559c3d26ff53 <unknown>
#3 0x559c3d270051 <unknown>
#4 0x559c3d2b59c4 <unknown>
#5 0x559c3d296f1d <unknown>
#6 0x559c3d2b2b3d <unknown>
#7 0x559c3d296cc3 <unknown>
#8 0x559c3d2620e4 <unknown>
#9 0x559c3d2630ae <unknown>
#10 0x559c3d525ce1 <unknown>
#11 0x559c3d529b7e <unknown>
#12 0x559c3d5134b5 <unknown>
#13 0x559c3d52a7d6 <unknown>
#14 0x559c3d4f6dbf <unknown>
#15 0x559c3d54d748 <unknown>
#16 0x559c3d54d917 <unknown>
#17 0x559c3d55e773 <unknown>
#18 0x7f1a4169baa4 <unknown>
#19 0x7f1a41728a64 __clone
Stacktrace:
lib/common/ui/pages/web.py:61 in decorated
lib/apps/yclients/client/booking/web/pages/created_booking.py:396 in click_back_btn
lib/common/ui/pages/web.py:61 in decorated
lib/common/ui/pages/web.py:148 in wait_for_element
lib/ui/selenium/webdriver/support/wait.py:28 in until
Seen in: - altegio/biz.erp#227749 — shard 1 — launch 171616 (×1, last 2026-10-02 08:20 MSK)
TimeoutException — 1 occurrence(s) across 1 pipeline(s)¶
selenium.common.exceptions.TimeoutException: Message: Ожидаем элемент в DOM: "[data-locator="header_small_button_close"]", параметры метода ожидания: ([
"css selector",
"None",
"[data-locator=\"header_small_button_close\"]",
"<autotests.lib.apps.yclients.client.booking.web.pages.created_booking.CreatedBookingPage object at 0x7fbdf4b31520>"
]), условия ожидания: ([
"timeout: 25s"
])
Stacktrace:
#0 0x55f1e93215e3 <unknown>
#1 0x55f1e8fe40b7 <unknown>
#2 0x55f1e9031f53 <unknown>
#3 0x55f1e9032051 <unknown>
#4 0x55f1e90779c4 <unknown>
#5 0x55f1e9058f1d <unknown>
#6 0x55f1e9074b3d <unknown>
#7 0x55f1e9058cc3 <unknown>
#8 0x55f1e90240e4 <unknown>
#9 0x55f1e90250ae <unknown>
#10 0x55f1e92e7ce1 <unknown>
#11 0x55f1e92ebb7e <unknown>
#12 0x55f1e92d54b5 <unknown>
#13 0x55f1e92ec7d6 <unknown>
#14 0x55f1e92b8dbf <unknown>
#15 0x55f1e930f748 <unknown>
#16 0x55f1e930f917 <unknown>
#17 0x55f1e9320773 <unknown>
#18 0x7f55b58c2aa4 <unknown>
#19 0x7f55b594fa64 __clone
Stacktrace:
lib/common/ui/pages/web.py:61 in decorated
lib/apps/yclients/client/booking/web/pages/created_booking.py:396 in click_back_btn
lib/common/ui/pages/web.py:61 in decorated
lib/common/ui/pages/web.py:148 in wait_for_element
lib/ui/selenium/webdriver/support/wait.py:28 in until
Seen in: - altegio/biz.erp#227749 — shard 1 — launch 171616 (×1, last 2026-10-02 08:20 MSK)
TimeoutException — 1 occurrence(s) across 1 pipeline(s)¶
selenium.common.exceptions.TimeoutException: Message: Ожидаем элемент в DOM: "[data-locator="header_small_button_close"]", параметры метода ожидания: ([
"css selector",
"None",
"[data-locator=\"header_small_button_close\"]",
"<autotests.lib.apps.yclients.client.booking.web.pages.created_booking.CreatedBookingPage object at 0x7fac2d89f590>"
]), условия ожидания: ([
"timeout: 25s"
])
Stacktrace:
#0 0x563bc787e5e3 <unknown>
#1 0x563bc75410b7 <unknown>
#2 0x563bc758ef53 <unknown>
#3 0x563bc758f051 <unknown>
#4 0x563bc75d49c4 <unknown>
#5 0x563bc75b5f1d <unknown>
#6 0x563bc75d1b3d <unknown>
#7 0x563bc75b5cc3 <unknown>
#8 0x563bc75810e4 <unknown>
#9 0x563bc75820ae <unknown>
#10 0x563bc7844ce1 <unknown>
#11 0x563bc7848b7e <unknown>
#12 0x563bc78324b5 <unknown>
#13 0x563bc78497d6 <unknown>
#14 0x563bc7815dbf <unknown>
#15 0x563bc786c748 <unknown>
#16 0x563bc786c917 <unknown>
#17 0x563bc787d773 <unknown>
#18 0x7f2343a2aaa4 <unknown>
#19 0x7f2343ab7a64 __clone
Stacktrace:
lib/common/ui/pages/web.py:61 in decorated
lib/apps/yclients/client/booking/web/pages/created_booking.py:396 in click_back_btn
lib/common/ui/pages/web.py:61 in decorated
lib/common/ui/pages/web.py:148 in wait_for_element
lib/ui/selenium/webdriver/support/wait.py:28 in until
Seen in: - altegio/biz.erp#227749 — shard 1 — launch 171616 (×1, last 2026-10-02 08:20 MSK)
TimeoutException — 1 occurrence(s) across 1 pipeline(s)¶
selenium.common.exceptions.TimeoutException: Message: Ожидаем элемент в DOM: "[data-locator="header_small_button_close"]", параметры метода ожидания: ([
"css selector",
"None",
"[data-locator=\"header_small_button_close\"]",
"<autotests.lib.apps.yclients.client.booking.web.pages.created_booking.CreatedBookingPage object at 0x7f6ea0295e20>"
]), условия ожидания: ([
"timeout: 25s"
])
Stacktrace:
#0 0x56449bf355e3 <unknown>
#1 0x56449bbf80b7 <unknown>
#2 0x56449bc45f53 <unknown>
#3 0x56449bc46051 <unknown>
#4 0x56449bc8b9c4 <unknown>
#5 0x56449bc6cf1d <unknown>
#6 0x56449bc88b3d <unknown>
#7 0x56449bc6ccc3 <unknown>
#8 0x56449bc380e4 <unknown>
#9 0x56449bc390ae <unknown>
#10 0x56449befbce1 <unknown>
#11 0x56449beffb7e <unknown>
#12 0x56449bee94b5 <unknown>
#13 0x56449bf007d6 <unknown>
#14 0x56449beccdbf <unknown>
#15 0x56449bf23748 <unknown>
#16 0x56449bf23917 <unknown>
#17 0x56449bf34773 <unknown>
#18 0x7f556189baa4 <unknown>
#19 0x7f5561928a64 __clone
Stacktrace:
lib/common/ui/pages/web.py:61 in decorated
lib/apps/yclients/client/booking/web/pages/created_booking.py:396 in click_back_btn
lib/common/ui/pages/web.py:61 in decorated
lib/common/ui/pages/web.py:148 in wait_for_element
lib/ui/selenium/webdriver/support/wait.py:28 in until
Seen in: - altegio/biz.erp#227787 — shard 5 — launch 171752 (×1, last 2026-10-02 11:50 MSK)
WebDriverException — 1 occurrence(s) across 1 pipeline(s)¶
selenium.common.exceptions.WebDriverException: Message: <unknown>: Failed to read the 'localStorage' property from 'Window': Access is denied for this document.
(Session info: headless chrome=119.0.6045.199)
Stacktrace:
#0 0x564b3f7af5e3 <unknown>
#1 0x564b3f4720b7 <unknown>
#2 0x564b3f4782b5 <unknown>
#3 0x564b3f47a9b1 <unknown>
#4 0x564b3f50371f <unknown>
#5 0x564b3f4e6ef2 <unknown>
#6 0x564b3f502b3d <unknown>
#7 0x564b3f4e6cc3 <unknown>
#8 0x564b3f4b20e4 <unknown>
#9 0x564b3f4b30ae <unknown>
#10 0x564b3f775ce1 <unknown>
#11 0x564b3f779b7e <unknown>
#12 0x564b3f7634b5 <unknown>
#13 0x564b3f77a7d6 <unknown>
#14 0x564b3f746dbf <unknown>
#15 0x564b3f79d748 <unknown>
#16 0x564b3f79d917 <unknown>
#17 0x564b3f7ae773 <unknown>
#18 0x7f70ceb89aa4 <unknown>
#19 0x7f70cec16a64 __clone
Stacktrace:
lib/common/ui/pages/web.py:61 in decorated
lib/apps/yclients/client/booking/web/pages/__init__.py:80 in open
lib/common/ui/pages/web.py:61 in decorated
lib/apps/yclients/client/booking/web/pages/__init__.py:41 in set_environment
lib/ui/selenium/webdriver/__init__.py:52 in execute_script
Seen in: - altegio/client.booking#224668 — shard 8 — launch 165208 (×1, last 2026-09-21 08:16 MSK)
WebDriverException — 1 occurrence(s) across 1 pipeline(s)¶
selenium.common.exceptions.WebDriverException: Message: <unknown>: Failed to read the 'localStorage' property from 'Window': Access is denied for this document.
(Session info: headless chrome=119.0.6045.199)
Stacktrace:
#0 0x55c95a5a95e3 <unknown>
#1 0x55c95a26c0b7 <unknown>
#2 0x55c95a2722b5 <unknown>
#3 0x55c95a2749b1 <unknown>
#4 0x55c95a2fd71f <unknown>
#5 0x55c95a2e0ef2 <unknown>
#6 0x55c95a2fcb3d <unknown>
#7 0x55c95a2e0cc3 <unknown>
#8 0x55c95a2ac0e4 <unknown>
#9 0x55c95a2ad0ae <unknown>
#10 0x55c95a56fce1 <unknown>
#11 0x55c95a573b7e <unknown>
#12 0x55c95a55d4b5 <unknown>
#13 0x55c95a5747d6 <unknown>
#14 0x55c95a540dbf <unknown>
#15 0x55c95a597748 <unknown>
#16 0x55c95a597917 <unknown>
#17 0x55c95a5a8773 <unknown>
#18 0x7f2de271eaa4 <unknown>
#19 0x7f2de27aba64 __clone
Stacktrace:
lib/common/ui/pages/web.py:61 in decorated
lib/apps/yclients/client/booking/web/pages/__init__.py:80 in open
lib/common/ui/pages/web.py:61 in decorated
lib/apps/yclients/client/booking/web/pages/__init__.py:41 in set_environment
lib/ui/selenium/webdriver/__init__.py:52 in execute_script
Seen in: - altegio/client.booking#224668 — shard 8 — launch 165208 (×1, last 2026-09-21 08:16 MSK)
WebDriverException — 1 occurrence(s) across 1 pipeline(s)¶
selenium.common.exceptions.WebDriverException: Message: <unknown>: Failed to read the 'localStorage' property from 'Window': Access is denied for this document.
(Session info: headless chrome=119.0.6045.199)
Stacktrace:
#0 0x55b7f93e65e3 <unknown>
#1 0x55b7f90a90b7 <unknown>
#2 0x55b7f90af2b5 <unknown>
#3 0x55b7f90b19b1 <unknown>
#4 0x55b7f913a71f <unknown>
#5 0x55b7f911def2 <unknown>
#6 0x55b7f9139b3d <unknown>
#7 0x55b7f911dcc3 <unknown>
#8 0x55b7f90e90e4 <unknown>
#9 0x55b7f90ea0ae <unknown>
#10 0x55b7f93acce1 <unknown>
#11 0x55b7f93b0b7e <unknown>
#12 0x55b7f939a4b5 <unknown>
#13 0x55b7f93b17d6 <unknown>
#14 0x55b7f937ddbf <unknown>
#15 0x55b7f93d4748 <unknown>
#16 0x55b7f93d4917 <unknown>
#17 0x55b7f93e5773 <unknown>
#18 0x7fad2c165aa4 <unknown>
#19 0x7fad2c1f2a64 __clone
Stacktrace:
lib/common/ui/pages/web.py:61 in decorated
lib/apps/yclients/client/booking/web/pages/__init__.py:80 in open
lib/common/ui/pages/web.py:61 in decorated
lib/apps/yclients/client/booking/web/pages/__init__.py:41 in set_environment
lib/ui/selenium/webdriver/__init__.py:52 in execute_script
Seen in: - altegio/client.booking#224668 — shard 8 — launch 165208 (×1, last 2026-09-21 08:16 MSK)