Skip to content

Повтор записи на дефолтную услугу

test_default_service_second_record

Failures in last 30 days: 14

Generated at 2026-10-08 03:35 MSK

Last failure: 2026-10-02 11:50 MSK

Filter: pipelines with sandbox_biz_erp ∈ {master, testops-dev} AND autotests_branch ∈ {master, main} only (testops-dev — daytime ticks since 2026-08-05).

By exception class: - TimeoutException — 11 - WebDriverException — 3

Failure signatures (grouped by exception + full message):

TimeoutException — 1 occurrence(s) across 1 pipeline(s)

selenium.common.exceptions.TimeoutException: Message: Ожидаем элемент в DOM: "[data-locator="timeslot"]", параметры метода ожидания: ([
    "css selector",
    "None",
    "[data-locator=\"timeslot\"]",
    "<autotests.lib.apps.yclients.client.booking.web.pages.select_time.SelectTimePage object at 0x7f9b1d9a4050>"
]), условия ожидания: ([
    "timeout: 25s"
])
Stacktrace:
#0 0x5562e9f4b5e3 <unknown>
#1 0x5562e9c0e0b7 <unknown>
#2 0x5562e9c5bf53 <unknown>
#3 0x5562e9c5c051 <unknown>
#4 0x5562e9ca19c4 <unknown>
#5 0x5562e9c82f1d <unknown>
#6 0x5562e9c9eb3d <unknown>
#7 0x5562e9c82cc3 <unknown>
#8 0x5562e9c4e0e4 <unknown>
#9 0x5562e9c4f0ae <unknown>
#10 0x5562e9f11ce1 <unknown>
#11 0x5562e9f15b7e <unknown>
#12 0x5562e9eff4b5 <unknown>
#13 0x5562e9f167d6 <unknown>
#14 0x5562e9ee2dbf <unknown>
#15 0x5562e9f39748 <unknown>
#16 0x5562e9f39917 <unknown>
#17 0x5562e9f4a773 <unknown>
#18 0x7fc891709aa4 <unknown>
#19 0x7fc891796a64 __clone
Exception: There are no available spots for this day

Stacktrace:

suite/yclients/client/booking/web/online_booking/test_service_default.py:315 in test_default_service_second_record
lib/common/ui/pages/web.py:61 in decorated
lib/apps/yclients/client/booking/web/pages/select_time.py:302 in select_date_and_time
lib/common/ui/pages/web.py:61 in decorated
lib/apps/yclients/client/booking/web/pages/select_time.py:351 in select_time

Seen in: - altegio/biz.erp#227722 — shard 1 — launch 171516 (×1, last 2026-10-02 04:26 MSK)

TimeoutException — 1 occurrence(s) across 1 pipeline(s)

selenium.common.exceptions.TimeoutException: Message: Ожидаем элемент в DOM: "[data-locator="booking_date"]", параметры метода ожидания: ([
    "css selector",
    "None",
    "[data-locator=\"booking_date\"]",
    "<autotests.lib.apps.yclients.client.booking.web.pages.created_booking.CreatedBookingPage object at 0x7f3fbdeae480>"
]), условия ожидания: ([
    "timeout: 25s"
])
Stacktrace:
#0 0x5574efd2a5e3 <unknown>
#1 0x5574ef9ed0b7 <unknown>
#2 0x5574efa3af53 <unknown>
#3 0x5574efa3b051 <unknown>
#4 0x5574efa809c4 <unknown>
#5 0x5574efa61f1d <unknown>
#6 0x5574efa7db3d <unknown>
#7 0x5574efa61cc3 <unknown>
#8 0x5574efa2d0e4 <unknown>
#9 0x5574efa2e0ae <unknown>
#10 0x5574efcf0ce1 <unknown>
#11 0x5574efcf4b7e <unknown>
#12 0x5574efcde4b5 <unknown>
#13 0x5574efcf57d6 <unknown>
#14 0x5574efcc1dbf <unknown>
#15 0x5574efd18748 <unknown>
#16 0x5574efd18917 <unknown>
#17 0x5574efd29773 <unknown>
#18 0x7ff13b269aa4 <unknown>
#19 0x7ff13b2f6a64 __clone

Stacktrace:

lib/common/ui/pages/web.py:61 in decorated
lib/apps/yclients/client/booking/web/pages/created_booking.py:81 in get_booking_time
lib/common/ui/pages/web.py:61 in decorated
lib/common/ui/pages/web.py:148 in wait_for_element
lib/ui/selenium/webdriver/support/wait.py:28 in until

Seen in: - altegio/biz.erp#227722 — shard 1 — launch 171516 (×1, last 2026-10-02 04:26 MSK)

TimeoutException — 1 occurrence(s) across 1 pipeline(s)

selenium.common.exceptions.TimeoutException: Message: Ожидаем элемент в DOM: "[data-locator="timeslot"]", параметры метода ожидания: ([
    "css selector",
    "None",
    "[data-locator=\"timeslot\"]",
    "<autotests.lib.apps.yclients.client.booking.web.pages.select_time.SelectTimePage object at 0x7f87d492ac60>"
]), условия ожидания: ([
    "timeout: 25s"
])
Stacktrace:
#0 0x560e662f05e3 <unknown>
#1 0x560e65fb30b7 <unknown>
#2 0x560e66000f53 <unknown>
#3 0x560e66001051 <unknown>
#4 0x560e660469c4 <unknown>
#5 0x560e66027f1d <unknown>
#6 0x560e66043b3d <unknown>
#7 0x560e66027cc3 <unknown>
#8 0x560e65ff30e4 <unknown>
#9 0x560e65ff40ae <unknown>
#10 0x560e662b6ce1 <unknown>
#11 0x560e662bab7e <unknown>
#12 0x560e662a44b5 <unknown>
#13 0x560e662bb7d6 <unknown>
#14 0x560e66287dbf <unknown>
#15 0x560e662de748 <unknown>
#16 0x560e662de917 <unknown>
#17 0x560e662ef773 <unknown>
#18 0x7f307de5eaa4 <unknown>
#19 0x7f307deeba64 __clone
Exception: There are no available spots for this day

Stacktrace:

suite/yclients/client/booking/web/online_booking/test_service_default.py:315 in test_default_service_second_record
lib/common/ui/pages/web.py:61 in decorated
lib/apps/yclients/client/booking/web/pages/select_time.py:302 in select_date_and_time
lib/common/ui/pages/web.py:61 in decorated
lib/apps/yclients/client/booking/web/pages/select_time.py:351 in select_time

Seen in: - altegio/biz.erp#227722 — shard 1 — launch 171516 (×1, last 2026-10-02 04:26 MSK)

TimeoutException — 1 occurrence(s) across 1 pipeline(s)

selenium.common.exceptions.TimeoutException: Message: Ожидаем элемент в DOM: "[data-locator="timeslot"]", параметры метода ожидания: ([
    "css selector",
    "None",
    "[data-locator=\"timeslot\"]",
    "<autotests.lib.apps.yclients.client.booking.web.pages.select_time.SelectTimePage object at 0x7f2284508ad0>"
]), условия ожидания: ([
    "timeout: 25s"
])
Stacktrace:
#0 0x557739e4d5e3 <unknown>
#1 0x557739b100b7 <unknown>
#2 0x557739b5df53 <unknown>
#3 0x557739b5e051 <unknown>
#4 0x557739ba39c4 <unknown>
#5 0x557739b84f1d <unknown>
#6 0x557739ba0b3d <unknown>
#7 0x557739b84cc3 <unknown>
#8 0x557739b500e4 <unknown>
#9 0x557739b510ae <unknown>
#10 0x557739e13ce1 <unknown>
#11 0x557739e17b7e <unknown>
#12 0x557739e014b5 <unknown>
#13 0x557739e187d6 <unknown>
#14 0x557739de4dbf <unknown>
#15 0x557739e3b748 <unknown>
#16 0x557739e3b917 <unknown>
#17 0x557739e4c773 <unknown>
#18 0x7f9fc6df5aa4 <unknown>
#19 0x7f9fc6e82a64 __clone
Exception: There are no available spots for this day

Stacktrace:

suite/yclients/client/booking/web/online_booking/test_service_default.py:315 in test_default_service_second_record
lib/common/ui/pages/web.py:61 in decorated
lib/apps/yclients/client/booking/web/pages/select_time.py:302 in select_date_and_time
lib/common/ui/pages/web.py:61 in decorated
lib/apps/yclients/client/booking/web/pages/select_time.py:351 in select_time

Seen in: - altegio/biz.erp#227735 — shard 6 — launch 171549 (×1, last 2026-10-02 06:23 MSK)

TimeoutException — 1 occurrence(s) across 1 pipeline(s)

selenium.common.exceptions.TimeoutException: Message: Ожидаем элемент в DOM: "[data-locator="timeslot"]", параметры метода ожидания: ([
    "css selector",
    "None",
    "[data-locator=\"timeslot\"]",
    "<autotests.lib.apps.yclients.client.booking.web.pages.select_time.SelectTimePage object at 0x7f4ed881c980>"
]), условия ожидания: ([
    "timeout: 25s"
])
Stacktrace:
#0 0x55b20a7335e3 <unknown>
#1 0x55b20a3f60b7 <unknown>
#2 0x55b20a443f53 <unknown>
#3 0x55b20a444051 <unknown>
#4 0x55b20a4899c4 <unknown>
#5 0x55b20a46af1d <unknown>
#6 0x55b20a486b3d <unknown>
#7 0x55b20a46acc3 <unknown>
#8 0x55b20a4360e4 <unknown>
#9 0x55b20a4370ae <unknown>
#10 0x55b20a6f9ce1 <unknown>
#11 0x55b20a6fdb7e <unknown>
#12 0x55b20a6e74b5 <unknown>
#13 0x55b20a6fe7d6 <unknown>
#14 0x55b20a6cadbf <unknown>
#15 0x55b20a721748 <unknown>
#16 0x55b20a721917 <unknown>
#17 0x55b20a732773 <unknown>
#18 0x7f895af8caa4 <unknown>
#19 0x7f895b019a64 __clone
Exception: There are no available spots for this day

Stacktrace:

suite/yclients/client/booking/web/online_booking/test_service_default.py:315 in test_default_service_second_record
lib/common/ui/pages/web.py:61 in decorated
lib/apps/yclients/client/booking/web/pages/select_time.py:302 in select_date_and_time
lib/common/ui/pages/web.py:61 in decorated
lib/apps/yclients/client/booking/web/pages/select_time.py:351 in select_time

Seen in: - altegio/biz.erp#227735 — shard 6 — launch 171549 (×1, last 2026-10-02 06:23 MSK)

TimeoutException — 1 occurrence(s) across 1 pipeline(s)

selenium.common.exceptions.TimeoutException: Message: Ожидаем элемент в DOM: "[data-locator="booking_date"]", параметры метода ожидания: ([
    "css selector",
    "None",
    "[data-locator=\"booking_date\"]",
    "<autotests.lib.apps.yclients.client.booking.web.pages.created_booking.CreatedBookingPage object at 0x7f6384c0e9c0>"
]), условия ожидания: ([
    "timeout: 25s"
])
Stacktrace:
#0 0x557349d1e5e3 <unknown>
#1 0x5573499e10b7 <unknown>
#2 0x557349a2ef53 <unknown>
#3 0x557349a2f051 <unknown>
#4 0x557349a749c4 <unknown>
#5 0x557349a55f1d <unknown>
#6 0x557349a71b3d <unknown>
#7 0x557349a55cc3 <unknown>
#8 0x557349a210e4 <unknown>
#9 0x557349a220ae <unknown>
#10 0x557349ce4ce1 <unknown>
#11 0x557349ce8b7e <unknown>
#12 0x557349cd24b5 <unknown>
#13 0x557349ce97d6 <unknown>
#14 0x557349cb5dbf <unknown>
#15 0x557349d0c748 <unknown>
#16 0x557349d0c917 <unknown>
#17 0x557349d1d773 <unknown>
#18 0x7ffb5733eaa4 <unknown>
#19 0x7ffb573cba64 __clone

Stacktrace:

lib/common/ui/pages/web.py:61 in decorated
lib/apps/yclients/client/booking/web/pages/created_booking.py:81 in get_booking_time
lib/common/ui/pages/web.py:61 in decorated
lib/common/ui/pages/web.py:148 in wait_for_element
lib/ui/selenium/webdriver/support/wait.py:28 in until

Seen in: - altegio/biz.erp#227735 — shard 6 — launch 171549 (×1, last 2026-10-02 06:23 MSK)

TimeoutException — 1 occurrence(s) across 1 pipeline(s)

selenium.common.exceptions.TimeoutException: Message: Ожидаем элемент в DOM: "[data-locator="booking_date"]", параметры метода ожидания: ([
    "css selector",
    "None",
    "[data-locator=\"booking_date\"]",
    "<autotests.lib.apps.yclients.client.booking.web.pages.created_booking.CreatedBookingPage object at 0x7f947114c530>"
]), условия ожидания: ([
    "timeout: 25s"
])
Stacktrace:
#0 0x564e6c4625e3 <unknown>
#1 0x564e6c1250b7 <unknown>
#2 0x564e6c172f53 <unknown>
#3 0x564e6c173051 <unknown>
#4 0x564e6c1b89c4 <unknown>
#5 0x564e6c199f1d <unknown>
#6 0x564e6c1b5b3d <unknown>
#7 0x564e6c199cc3 <unknown>
#8 0x564e6c1650e4 <unknown>
#9 0x564e6c1660ae <unknown>
#10 0x564e6c428ce1 <unknown>
#11 0x564e6c42cb7e <unknown>
#12 0x564e6c4164b5 <unknown>
#13 0x564e6c42d7d6 <unknown>
#14 0x564e6c3f9dbf <unknown>
#15 0x564e6c450748 <unknown>
#16 0x564e6c450917 <unknown>
#17 0x564e6c461773 <unknown>
#18 0x7f7a150fdaa4 <unknown>
#19 0x7f7a1518aa64 __clone

Stacktrace:

lib/common/ui/pages/web.py:61 in decorated
lib/apps/yclients/client/booking/web/pages/created_booking.py:81 in get_booking_time
lib/common/ui/pages/web.py:61 in decorated
lib/common/ui/pages/web.py:148 in wait_for_element
lib/ui/selenium/webdriver/support/wait.py:28 in until

Seen in: - altegio/biz.erp#227749 — shard 5 — launch 171616 (×1, last 2026-10-02 08:20 MSK)

TimeoutException — 1 occurrence(s) across 1 pipeline(s)

selenium.common.exceptions.TimeoutException: Message: Ожидаем элемент в DOM: "[data-locator="booking_date"]", параметры метода ожидания: ([
    "css selector",
    "None",
    "[data-locator=\"booking_date\"]",
    "<autotests.lib.apps.yclients.client.booking.web.pages.created_booking.CreatedBookingPage object at 0x7f1796dd81d0>"
]), условия ожидания: ([
    "timeout: 25s"
])
Stacktrace:
#0 0x5619b67175e3 <unknown>
#1 0x5619b63da0b7 <unknown>
#2 0x5619b6427f53 <unknown>
#3 0x5619b6428051 <unknown>
#4 0x5619b646d9c4 <unknown>
#5 0x5619b644ef1d <unknown>
#6 0x5619b646ab3d <unknown>
#7 0x5619b644ecc3 <unknown>
#8 0x5619b641a0e4 <unknown>
#9 0x5619b641b0ae <unknown>
#10 0x5619b66ddce1 <unknown>
#11 0x5619b66e1b7e <unknown>
#12 0x5619b66cb4b5 <unknown>
#13 0x5619b66e27d6 <unknown>
#14 0x5619b66aedbf <unknown>
#15 0x5619b6705748 <unknown>
#16 0x5619b6705917 <unknown>
#17 0x5619b6716773 <unknown>
#18 0x7fbfade2faa4 <unknown>
#19 0x7fbfadebca64 __clone

Stacktrace:

lib/common/ui/pages/web.py:61 in decorated
lib/apps/yclients/client/booking/web/pages/created_booking.py:81 in get_booking_time
lib/common/ui/pages/web.py:61 in decorated
lib/common/ui/pages/web.py:148 in wait_for_element
lib/ui/selenium/webdriver/support/wait.py:28 in until

Seen in: - altegio/biz.erp#227749 — shard 5 — launch 171616 (×1, last 2026-10-02 08:20 MSK)

TimeoutException — 1 occurrence(s) across 1 pipeline(s)

selenium.common.exceptions.TimeoutException: Message: Ожидаем элемент в DOM: "[data-locator="booking_date"]", параметры метода ожидания: ([
    "css selector",
    "None",
    "[data-locator=\"booking_date\"]",
    "<autotests.lib.apps.yclients.client.booking.web.pages.created_booking.CreatedBookingPage object at 0x7fdb1dcf32c0>"
]), условия ожидания: ([
    "timeout: 25s"
])
Stacktrace:
#0 0x55cc494945e3 <unknown>
#1 0x55cc491570b7 <unknown>
#2 0x55cc491a4f53 <unknown>
#3 0x55cc491a5051 <unknown>
#4 0x55cc491ea9c4 <unknown>
#5 0x55cc491cbf1d <unknown>
#6 0x55cc491e7b3d <unknown>
#7 0x55cc491cbcc3 <unknown>
#8 0x55cc491970e4 <unknown>
#9 0x55cc491980ae <unknown>
#10 0x55cc4945ace1 <unknown>
#11 0x55cc4945eb7e <unknown>
#12 0x55cc494484b5 <unknown>
#13 0x55cc4945f7d6 <unknown>
#14 0x55cc4942bdbf <unknown>
#15 0x55cc49482748 <unknown>
#16 0x55cc49482917 <unknown>
#17 0x55cc49493773 <unknown>
#18 0x7f7a8a3a1aa4 <unknown>
#19 0x7f7a8a42ea64 __clone

Stacktrace:

lib/common/ui/pages/web.py:61 in decorated
lib/apps/yclients/client/booking/web/pages/created_booking.py:81 in get_booking_time
lib/common/ui/pages/web.py:61 in decorated
lib/common/ui/pages/web.py:148 in wait_for_element
lib/ui/selenium/webdriver/support/wait.py:28 in until

Seen in: - altegio/biz.erp#227749 — shard 5 — launch 171616 (×1, last 2026-10-02 08:20 MSK)

TimeoutException — 1 occurrence(s) across 1 pipeline(s)

selenium.common.exceptions.TimeoutException: Message: Ожидаем элемент в DOM: "[data-locator="booking_date"]", параметры метода ожидания: ([
    "css selector",
    "None",
    "[data-locator=\"booking_date\"]",
    "<autotests.lib.apps.yclients.client.booking.web.pages.created_booking.CreatedBookingPage object at 0x7fc03f628c20>"
]), условия ожидания: ([
    "timeout: 25s"
])
Stacktrace:
#0 0x5605be40c5e3 <unknown>
#1 0x5605be0cf0b7 <unknown>
#2 0x5605be11cf53 <unknown>
#3 0x5605be11d051 <unknown>
#4 0x5605be1629c4 <unknown>
#5 0x5605be143f1d <unknown>
#6 0x5605be15fb3d <unknown>
#7 0x5605be143cc3 <unknown>
#8 0x5605be10f0e4 <unknown>
#9 0x5605be1100ae <unknown>
#10 0x5605be3d2ce1 <unknown>
#11 0x5605be3d6b7e <unknown>
#12 0x5605be3c04b5 <unknown>
#13 0x5605be3d77d6 <unknown>
#14 0x5605be3a3dbf <unknown>
#15 0x5605be3fa748 <unknown>
#16 0x5605be3fa917 <unknown>
#17 0x5605be40b773 <unknown>
#18 0x7f4935074aa4 <unknown>
#19 0x7f4935101a64 __clone

Stacktrace:

lib/common/ui/pages/web.py:61 in decorated
lib/apps/yclients/client/booking/web/pages/created_booking.py:81 in get_booking_time
lib/common/ui/pages/web.py:61 in decorated
lib/common/ui/pages/web.py:148 in wait_for_element
lib/ui/selenium/webdriver/support/wait.py:28 in until

Seen in: - altegio/biz.erp#227787 — shard 8 — launch 171752 (×1, last 2026-10-02 11:50 MSK)

TimeoutException — 1 occurrence(s) across 1 pipeline(s)

selenium.common.exceptions.TimeoutException: Message: Ожидаем элемент в DOM: "[data-locator="booking_date"]", параметры метода ожидания: ([
    "css selector",
    "None",
    "[data-locator=\"booking_date\"]",
    "<autotests.lib.apps.yclients.client.booking.web.pages.created_booking.CreatedBookingPage object at 0x7fe79d824290>"
]), условия ожидания: ([
    "timeout: 25s"
])
Stacktrace:
#0 0x5626057165e3 <unknown>
#1 0x5626053d90b7 <unknown>
#2 0x562605426f53 <unknown>
#3 0x562605427051 <unknown>
#4 0x56260546c9c4 <unknown>
#5 0x56260544df1d <unknown>
#6 0x562605469b3d <unknown>
#7 0x56260544dcc3 <unknown>
#8 0x5626054190e4 <unknown>
#9 0x56260541a0ae <unknown>
#10 0x5626056dcce1 <unknown>
#11 0x5626056e0b7e <unknown>
#12 0x5626056ca4b5 <unknown>
#13 0x5626056e17d6 <unknown>
#14 0x5626056addbf <unknown>
#15 0x562605704748 <unknown>
#16 0x562605704917 <unknown>
#17 0x562605715773 <unknown>
#18 0x7f3afec23aa4 <unknown>
#19 0x7f3afecb0a64 __clone

Stacktrace:

lib/common/ui/pages/web.py:61 in decorated
lib/apps/yclients/client/booking/web/pages/created_booking.py:81 in get_booking_time
lib/common/ui/pages/web.py:61 in decorated
lib/common/ui/pages/web.py:148 in wait_for_element
lib/ui/selenium/webdriver/support/wait.py:28 in until

Seen in: - altegio/biz.erp#227787 — shard 8 — launch 171752 (×1, last 2026-10-02 11:50 MSK)

WebDriverException — 1 occurrence(s) across 1 pipeline(s)

selenium.common.exceptions.WebDriverException: Message: <unknown>: Failed to read the 'localStorage' property from 'Window': Access is denied for this document.
  (Session info: headless chrome=119.0.6045.199)
Stacktrace:
#0 0x557f8c0605e3 <unknown>
#1 0x557f8bd230b7 <unknown>
#2 0x557f8bd292b5 <unknown>
#3 0x557f8bd2b9b1 <unknown>
#4 0x557f8bdb471f <unknown>
#5 0x557f8bd97ef2 <unknown>
#6 0x557f8bdb3b3d <unknown>
#7 0x557f8bd97cc3 <unknown>
#8 0x557f8bd630e4 <unknown>
#9 0x557f8bd640ae <unknown>
#10 0x557f8c026ce1 <unknown>
#11 0x557f8c02ab7e <unknown>
#12 0x557f8c0144b5 <unknown>
#13 0x557f8c02b7d6 <unknown>
#14 0x557f8bff7dbf <unknown>
#15 0x557f8c04e748 <unknown>
#16 0x557f8c04e917 <unknown>
#17 0x557f8c05f773 <unknown>
#18 0x7f7338783aa4 <unknown>
#19 0x7f7338810a64 __clone

Stacktrace:

lib/common/ui/pages/web.py:61 in decorated
lib/apps/yclients/client/booking/web/pages/__init__.py:80 in open
lib/common/ui/pages/web.py:61 in decorated
lib/apps/yclients/client/booking/web/pages/__init__.py:41 in set_environment
lib/ui/selenium/webdriver/__init__.py:52 in execute_script

Seen in: - altegio/client.booking#224668 — shard 6 — launch 165208 (×1, last 2026-09-21 08:16 MSK)

WebDriverException — 1 occurrence(s) across 1 pipeline(s)

selenium.common.exceptions.WebDriverException: Message: <unknown>: Failed to read the 'localStorage' property from 'Window': Access is denied for this document.
  (Session info: headless chrome=119.0.6045.199)
Stacktrace:
#0 0x558cf6f4e5e3 <unknown>
#1 0x558cf6c110b7 <unknown>
#2 0x558cf6c172b5 <unknown>
#3 0x558cf6c199b1 <unknown>
#4 0x558cf6ca271f <unknown>
#5 0x558cf6c85ef2 <unknown>
#6 0x558cf6ca1b3d <unknown>
#7 0x558cf6c85cc3 <unknown>
#8 0x558cf6c510e4 <unknown>
#9 0x558cf6c520ae <unknown>
#10 0x558cf6f14ce1 <unknown>
#11 0x558cf6f18b7e <unknown>
#12 0x558cf6f024b5 <unknown>
#13 0x558cf6f197d6 <unknown>
#14 0x558cf6ee5dbf <unknown>
#15 0x558cf6f3c748 <unknown>
#16 0x558cf6f3c917 <unknown>
#17 0x558cf6f4d773 <unknown>
#18 0x7fc32c9fcaa4 <unknown>
#19 0x7fc32ca89a64 __clone

Stacktrace:

lib/common/ui/pages/web.py:61 in decorated
lib/apps/yclients/client/booking/web/pages/__init__.py:80 in open
lib/common/ui/pages/web.py:61 in decorated
lib/apps/yclients/client/booking/web/pages/__init__.py:41 in set_environment
lib/ui/selenium/webdriver/__init__.py:52 in execute_script

Seen in: - altegio/client.booking#224668 — shard 6 — launch 165208 (×1, last 2026-09-21 08:16 MSK)

WebDriverException — 1 occurrence(s) across 1 pipeline(s)

selenium.common.exceptions.WebDriverException: Message: <unknown>: Failed to read the 'localStorage' property from 'Window': Access is denied for this document.
  (Session info: headless chrome=119.0.6045.199)
Stacktrace:
#0 0x55851dbaa5e3 <unknown>
#1 0x55851d86d0b7 <unknown>
#2 0x55851d8732b5 <unknown>
#3 0x55851d8759b1 <unknown>
#4 0x55851d8fe71f <unknown>
#5 0x55851d8e1ef2 <unknown>
#6 0x55851d8fdb3d <unknown>
#7 0x55851d8e1cc3 <unknown>
#8 0x55851d8ad0e4 <unknown>
#9 0x55851d8ae0ae <unknown>
#10 0x55851db70ce1 <unknown>
#11 0x55851db74b7e <unknown>
#12 0x55851db5e4b5 <unknown>
#13 0x55851db757d6 <unknown>
#14 0x55851db41dbf <unknown>
#15 0x55851db98748 <unknown>
#16 0x55851db98917 <unknown>
#17 0x55851dba9773 <unknown>
#18 0x7fe1f7c94aa4 <unknown>
#19 0x7fe1f7d21a64 __clone

Stacktrace:

lib/common/ui/pages/web.py:61 in decorated
lib/apps/yclients/client/booking/web/pages/__init__.py:80 in open
lib/common/ui/pages/web.py:61 in decorated
lib/apps/yclients/client/booking/web/pages/__init__.py:41 in set_environment
lib/ui/selenium/webdriver/__init__.py:52 in execute_script

Seen in: - altegio/client.booking#224668 — shard 6 — launch 165208 (×1, last 2026-09-21 08:16 MSK)