Отображение информации в плашке визита¶
test_display_information_in_panel_record
Failures in last 30 days: 99
Generated at 2026-10-08 03:48 MSK
Last failure: 2026-10-07 20:41 MSK
Filter: pipelines with sandbox_biz_erp ∈ {master, testops-dev} AND autotests_branch ∈ {master, main} only (testops-dev — daytime ticks since 2026-08-05).
🏥 12 of these ran under the quarantine tier: XFAIL, pipeline stayed green, excluded from the red statistics and incidents (see Карантин).
By exception class:
- SigninRedirectMissingError — 40
- Exception — 37
- TimeoutError — 21
- KeyError — 1
Failure signatures (grouped by exception + full message):
Exception — 2 occurrence(s) across 2 pipeline(s)¶
Exception: Время записи 2026-09-11 20:45:00 - 2026-09-11 22:15:00 Не входит в доступные таймслоты сотрудника [(DateTime(2026, 9, 11, 0, 0), DateTime(2026, 9, 11, 22, 0))]
Stacktrace:
lib/fixture/salon/__init__.py:195 in salon_with_entities
lib/preconditions/yclients/biz/erp/display_information_in_panel_record.py:58 in prepare
data/db/orm/models/salons.py:985 in create_record
Seen in: - altegio/biz.erp#223040 — shard 1 — launch 161600 (×1, last 2026-09-11 17:23 MSK) - altegio/biz.erp#222948 — shard 2 — launch 161149 (×1, last 2026-09-11 07:41 MSK)
Exception — 2 occurrence(s) across 2 pipeline(s)¶
Exception: Время записи 2026-09-11 21:00:00 - 2026-09-11 22:30:00 Не входит в доступные таймслоты сотрудника [(DateTime(2026, 9, 11, 0, 45), DateTime(2026, 9, 11, 22, 0))]
Stacktrace:
lib/fixture/salon/__init__.py:195 in salon_with_entities
lib/preconditions/yclients/biz/erp/display_information_in_panel_record.py:58 in prepare
data/db/orm/models/salons.py:985 in create_record
Seen in: - altegio/biz.erp#223050 — shard 6 — launch 161637 (×1, last 2026-09-11 18:12 MSK) - altegio/biz.erp#223006 — shard 2 — launch 161459 (×1, last 2026-09-11 15:23 MSK)
Exception — 2 occurrence(s) across 2 pipeline(s)¶
Exception: Время записи 2026-09-30 21:00:00 - 2026-09-30 22:30:00 Не входит в доступные таймслоты сотрудника [(DateTime(2026, 9, 30, 0, 30), DateTime(2026, 9, 30, 22, 0))]
Stacktrace:
lib/fixture/salon/__init__.py:195 in salon_with_entities
lib/preconditions/yclients/biz/erp/display_information_in_panel_record.py:58 in prepare
data/db/orm/models/salons.py:985 in create_record
Seen in: - altegio/biz.erp#227164 — shard 1 — launch 170484 (×1, last 2026-09-30 12:45 MSK) - altegio/biz.erp#227069 — shard 6 — launch 170205 (×1, last 2026-09-30 05:39 MSK)
Exception — 2 occurrence(s) across 2 pipeline(s)¶
Exception: Время записи 2026-10-01 21:00:00 - 2026-10-01 22:30:00 Не входит в доступные таймслоты сотрудника [(DateTime(2026, 10, 1, 0, 30), DateTime(2026, 10, 1, 22, 0))]
Stacktrace:
lib/fixture/salon/__init__.py:195 in salon_with_entities
lib/preconditions/yclients/biz/erp/display_information_in_panel_record.py:58 in prepare
data/db/orm/models/salons.py:985 in create_record
Seen in: - altegio/biz.erp#227558 — shard 6 — launch 171165 (×1, last 2026-10-01 15:20 MSK) - altegio/biz.erp#227451 — shard 2 — launch 170874 (×1, last 2026-10-01 05:37 MSK)
Exception — 2 occurrence(s) across 2 pipeline(s)¶
Exception: Время записи 2026-10-07 21:00:00 - 2026-10-07 22:30:00 Не входит в доступные таймслоты сотрудника [(DateTime(2026, 10, 7, 0, 30), DateTime(2026, 10, 7, 22, 0))]
Stacktrace:
lib/fixture/salon/__init__.py:195 in salon_with_entities
lib/preconditions/yclients/biz/erp/display_information_in_panel_record.py:58 in prepare
data/db/orm/models/salons.py:985 in create_record
Seen in: - altegio/biz.erp#229294 — shard 3 — launch 174222 (×1, last 2026-10-07 20:41 MSK) - altegio/biz.erp#229100 — shard 3 — launch 173738 (×1, last 2026-10-07 05:34 MSK)
Exception — 1 occurrence(s) across 1 pipeline(s)¶
Exception: Время записи 2026-09-09 20:45:00 - 2026-09-09 22:15:00 Не входит в доступные таймслоты сотрудника [(DateTime(2026, 9, 9, 0, 15), DateTime(2026, 9, 9, 22, 0))]
Stacktrace:
lib/fixture/salon/__init__.py:195 in salon_with_entities
lib/preconditions/yclients/biz/erp/display_information_in_panel_record.py:58 in prepare
data/db/orm/models/salons.py:985 in create_record
Seen in: - altegio/biz.erp#222522 — shard 3 — launch 159733 (×1, last 2026-09-09 12:01 MSK)
Exception — 1 occurrence(s) across 1 pipeline(s)¶
Exception: Время записи 2026-09-11 21:00:00 - 2026-09-11 22:30:00 Не входит в доступные таймслоты сотрудника [(DateTime(2026, 9, 11, 0, 30), DateTime(2026, 9, 11, 22, 0))]
Stacktrace:
lib/fixture/salon/__init__.py:195 in salon_with_entities
lib/preconditions/yclients/biz/erp/display_information_in_panel_record.py:58 in prepare
data/db/orm/models/salons.py:985 in create_record
Seen in: - altegio/biz.erp#222948 — shard 7 — launch 161149 (×1, last 2026-09-11 07:41 MSK)
Exception — 1 occurrence(s) across 1 pipeline(s)¶
Exception: Время записи 2026-09-13 20:45:00 - 2026-09-13 22:15:00 Не входит в доступные таймслоты сотрудника [(DateTime(2026, 9, 13, 0, 15), DateTime(2026, 9, 13, 22, 0))]
Stacktrace:
lib/fixture/salon/__init__.py:195 in salon_with_entities
lib/preconditions/yclients/biz/erp/display_information_in_panel_record.py:58 in prepare
data/db/orm/models/salons.py:985 in create_record
Seen in: - altegio/biz.erp#223177 — shard 5 — launch 161816 (×1, last 2026-09-13 03:43 MSK)
Exception — 1 occurrence(s) across 1 pipeline(s)¶
Exception: Время записи 2026-09-13 21:00:00 - 2026-09-13 22:30:00 Не входит в доступные таймслоты сотрудника [(DateTime(2026, 9, 13, 0, 45), DateTime(2026, 9, 13, 22, 0))]
Stacktrace:
lib/fixture/salon/__init__.py:195 in salon_with_entities
lib/preconditions/yclients/biz/erp/display_information_in_panel_record.py:58 in prepare
data/db/orm/models/salons.py:985 in create_record
Seen in: - altegio/biz.erp#223191 — shard 4 — launch 161882 (×1, last 2026-09-13 07:42 MSK)
Exception — 1 occurrence(s) across 1 pipeline(s)¶
Exception: Время записи 2026-09-15 21:00:00 - 2026-09-15 22:30:00 Не входит в доступные таймслоты сотрудника [(DateTime(2026, 9, 15, 0, 15), DateTime(2026, 9, 15, 22, 0))]
Stacktrace:
lib/fixture/salon/__init__.py:195 in salon_with_entities
lib/preconditions/yclients/biz/erp/display_information_in_panel_record.py:58 in prepare
data/db/orm/models/salons.py:985 in create_record
Seen in: - altegio/biz.erp#223752 — shard 1 — launch 162916 (×1, last 2026-09-15 17:46 MSK)
Exception — 1 occurrence(s) across 1 pipeline(s)¶
Exception: Время записи 2026-09-16 21:00:00 - 2026-09-16 22:30:00 Не входит в доступные таймслоты сотрудника [(DateTime(2026, 9, 16, 0, 30), DateTime(2026, 9, 16, 22, 0))]
Stacktrace:
lib/fixture/salon/__init__.py:195 in salon_with_entities
lib/preconditions/yclients/biz/erp/display_information_in_panel_record.py:58 in prepare
data/db/orm/models/salons.py:985 in create_record
Seen in: - altegio/biz.erp#223949 — shard 4 — launch 163429 (×1, last 2026-09-16 16:13 MSK)
Exception — 1 occurrence(s) across 1 pipeline(s)¶
Exception: Время записи 2026-09-17 21:00:00 - 2026-09-17 22:30:00 Не входит в доступные таймслоты сотрудника [(DateTime(2026, 9, 17, 0, 30), DateTime(2026, 9, 17, 22, 0))]
Stacktrace:
lib/fixture/salon/__init__.py:195 in salon_with_entities
lib/preconditions/yclients/biz/erp/display_information_in_panel_record.py:58 in prepare
data/db/orm/models/salons.py:985 in create_record
Seen in: - altegio/biz.erp#224036 — shard 6 — launch 163577 (×1, last 2026-09-17 04:16 MSK)
Exception — 1 occurrence(s) across 1 pipeline(s)¶
Exception: Время записи 2026-09-17 21:00:00 - 2026-09-17 22:30:00 Не входит в доступные таймслоты сотрудника [(DateTime(2026, 9, 17, 0, 45), DateTime(2026, 9, 17, 22, 0))]
Stacktrace:
lib/fixture/salon/__init__.py:195 in salon_with_entities
lib/preconditions/yclients/biz/erp/display_information_in_panel_record.py:58 in prepare
data/db/orm/models/salons.py:985 in create_record
Seen in: - altegio/biz.erp#224050 — shard 8 — launch 163643 (×1, last 2026-09-17 07:40 MSK)
Exception — 1 occurrence(s) across 1 pipeline(s)¶
Exception: Время записи 2026-09-19 20:45:00 - 2026-09-19 22:15:00 Не входит в доступные таймслоты сотрудника [(DateTime(2026, 9, 19, 0, 30), DateTime(2026, 9, 19, 22, 0))]
Stacktrace:
lib/fixture/salon/__init__.py:195 in salon_with_entities
lib/preconditions/yclients/biz/erp/display_information_in_panel_record.py:58 in prepare
data/db/orm/models/salons.py:985 in create_record
Seen in: - altegio/biz.erp#224491 — shard 3 — launch 164971 (×1, last 2026-09-19 07:41 MSK)
Exception — 1 occurrence(s) across 1 pipeline(s)¶
Exception: Время записи 2026-09-22 21:00:00 - 2026-09-22 22:30:00 Не входит в доступные таймслоты сотрудника [(DateTime(2026, 9, 22, 0, 30), DateTime(2026, 9, 22, 22, 0))]
Stacktrace:
lib/fixture/salon/__init__.py:195 in salon_with_entities
lib/preconditions/yclients/biz/erp/display_information_in_panel_record.py:58 in prepare
data/db/orm/models/salons.py:985 in create_record
Seen in: - altegio/biz.erp#225113 — shard 2 — launch 166447 (×1, last 2026-09-22 21:58 MSK)
Exception — 1 occurrence(s) across 1 pipeline(s)¶
Exception: Время записи 2026-09-24 20:45:00 - 2026-09-24 22:15:00 Не входит в доступные таймслоты сотрудника [(DateTime(2026, 9, 24, 0, 0), DateTime(2026, 9, 24, 22, 0))]
Stacktrace:
lib/fixture/salon/__init__.py:195 in salon_with_entities
lib/preconditions/yclients/biz/erp/display_information_in_panel_record.py:58 in prepare
data/db/orm/models/salons.py:985 in create_record
Seen in: - altegio/biz.erp#225579 — shard 4 — launch 167254 (×1, last 2026-09-24 11:36 MSK)
Exception — 1 occurrence(s) across 1 pipeline(s)¶
Exception: Время записи 2026-09-25 21:00:00 - 2026-09-25 22:30:00 Не входит в доступные таймслоты сотрудника [(DateTime(2026, 9, 25, 0, 15), DateTime(2026, 9, 25, 22, 0))]
Stacktrace:
lib/fixture/salon/__init__.py:195 in salon_with_entities
lib/preconditions/yclients/biz/erp/display_information_in_panel_record.py:58 in prepare
data/db/orm/models/salons.py:985 in create_record
Seen in: - altegio/biz.erp#225894 — shard 6 — launch 167979 (×1, last 2026-09-25 15:46 MSK)
Exception — 1 occurrence(s) across 1 pipeline(s)¶
Exception: Время записи 2026-09-26 21:00:00 - 2026-09-26 22:30:00 Не входит в доступные таймслоты сотрудника [(DateTime(2026, 9, 26, 0, 30), DateTime(2026, 9, 26, 22, 0))]
Stacktrace:
lib/fixture/salon/__init__.py:195 in salon_with_entities
lib/preconditions/yclients/biz/erp/display_information_in_panel_record.py:58 in prepare
data/db/orm/models/salons.py:985 in create_record
Seen in: - altegio/biz.erp#226028 — shard 3 — launch 168233 (×1, last 2026-09-26 07:36 MSK)
Exception — 1 occurrence(s) across 1 pipeline(s)¶
Exception: Время записи 2026-09-27 21:00:00 - 2026-09-27 22:30:00 Не входит в доступные таймслоты сотрудника [(DateTime(2026, 9, 27, 0, 45), DateTime(2026, 9, 27, 22, 0))]
Stacktrace:
lib/fixture/salon/__init__.py:195 in salon_with_entities
lib/preconditions/yclients/biz/erp/display_information_in_panel_record.py:58 in prepare
data/db/orm/models/salons.py:985 in create_record
Seen in: - altegio/biz.erp#226285 — shard 8 — launch 168442 (×1, last 2026-09-27 19:13 MSK)
Exception — 1 occurrence(s) across 1 pipeline(s)¶
Exception: Время записи 2026-09-28 20:45:00 - 2026-09-28 22:15:00 Не входит в доступные таймслоты сотрудника [(DateTime(2026, 9, 28, 0, 15), DateTime(2026, 9, 28, 22, 0))]
Stacktrace:
lib/fixture/salon/__init__.py:195 in salon_with_entities
lib/preconditions/yclients/biz/erp/display_information_in_panel_record.py:58 in prepare
data/db/orm/models/salons.py:985 in create_record
Seen in: - altegio/biz.erp#226416 — shard 6 — launch 168644 (×1, last 2026-09-28 07:38 MSK)
Exception — 1 occurrence(s) across 1 pipeline(s)¶
Exception: Время записи 2026-09-29 21:00:00 - 2026-09-29 22:30:00 Не входит в доступные таймслоты сотрудника [(DateTime(2026, 9, 29, 0, 30), DateTime(2026, 9, 29, 22, 0))]
Stacktrace:
lib/fixture/salon/__init__.py:195 in salon_with_entities
lib/preconditions/yclients/biz/erp/display_information_in_panel_record.py:58 in prepare
data/db/orm/models/salons.py:985 in create_record
Seen in: - altegio/biz.erp#226747 — shard 1 — launch 169383 (×1, last 2026-09-29 05:54 MSK)
Exception — 1 occurrence(s) across 1 pipeline(s)¶
Exception: Время записи 2026-09-29 21:00:00 - 2026-09-29 22:30:00 Не входит в доступные таймслоты сотрудника [(DateTime(2026, 9, 29, 0, 15), DateTime(2026, 9, 29, 22, 0))]
Stacktrace:
lib/fixture/salon/__init__.py:195 in salon_with_entities
lib/preconditions/yclients/biz/erp/display_information_in_panel_record.py:58 in prepare
data/db/orm/models/salons.py:985 in create_record
Seen in: - altegio/biz.erp#226747 — shard 3 — launch 169383 (×1, last 2026-09-29 05:54 MSK)
Exception — 1 occurrence(s) across 1 pipeline(s)¶
Exception: Время записи 2026-09-29 21:00:00 - 2026-09-29 22:30:00 Не входит в доступные таймслоты сотрудника [(DateTime(2026, 9, 29, 0, 0), DateTime(2026, 9, 29, 22, 0))]
Stacktrace:
lib/fixture/salon/__init__.py:195 in salon_with_entities
lib/preconditions/yclients/biz/erp/display_information_in_panel_record.py:58 in prepare
data/db/orm/models/salons.py:985 in create_record
Seen in: - altegio/biz.erp#226954 — shard 2 — launch 170045 (×1, last 2026-09-29 18:38 MSK)
Exception — 1 occurrence(s) across 1 pipeline(s)¶
Exception: Время записи 2026-09-30 20:45:00 - 2026-09-30 22:15:00 Не входит в доступные таймслоты сотрудника [(DateTime(2026, 9, 30, 0, 15), DateTime(2026, 9, 30, 22, 0))]
Stacktrace:
lib/fixture/salon/__init__.py:195 in salon_with_entities
lib/preconditions/yclients/biz/erp/display_information_in_panel_record.py:58 in prepare
data/db/orm/models/salons.py:985 in create_record
Seen in: - altegio/biz.erp#227142 — shard 3 — launch 170415 (×1, last 2026-09-30 11:52 MSK)
Exception — 1 occurrence(s) across 1 pipeline(s)¶
Exception: Время записи 2026-09-30 20:45:00 - 2026-09-30 22:15:00 Не входит в доступные таймслоты сотрудника [(DateTime(2026, 9, 30, 0, 45), DateTime(2026, 9, 30, 22, 0))]
Stacktrace:
lib/fixture/salon/__init__.py:195 in salon_with_entities
lib/preconditions/yclients/biz/erp/display_information_in_panel_record.py:58 in prepare
data/db/orm/models/salons.py:985 in create_record
Seen in: - altegio/biz.erp#227285 — shard 2 — launch 170698 (×1, last 2026-09-30 17:24 MSK)
Exception — 1 occurrence(s) across 1 pipeline(s)¶
Exception: Время записи 2026-09-30 20:45:00 - 2026-09-30 22:15:00 Не входит в доступные таймслоты сотрудника [(DateTime(2026, 9, 30, 0, 0), DateTime(2026, 9, 30, 22, 0))]
Stacktrace:
lib/fixture/salon/__init__.py:195 in salon_with_entities
lib/preconditions/yclients/biz/erp/display_information_in_panel_record.py:58 in prepare
data/db/orm/models/salons.py:985 in create_record
Seen in: - altegio/biz.erp#227285 — shard 5 — launch 170698 (×1, last 2026-09-30 17:24 MSK)
Exception — 1 occurrence(s) across 1 pipeline(s)¶
Exception: Время записи 2026-10-02 21:00:00 - 2026-10-02 22:30:00 Не входит в доступные таймслоты сотрудника [(DateTime(2026, 10, 2, 0, 45), DateTime(2026, 10, 2, 22, 0))]
Stacktrace:
lib/fixture/salon/__init__.py:195 in salon_with_entities
lib/preconditions/yclients/biz/erp/display_information_in_panel_record.py:58 in prepare
data/db/orm/models/salons.py:985 in create_record
Seen in: - altegio/biz.erp#227735 — shard 4 — launch 171549 (×1, last 2026-10-02 06:23 MSK)
Exception — 1 occurrence(s) across 1 pipeline(s)¶
Exception: Время записи 2026-10-02 20:45:00 - 2026-10-02 22:15:00 Не входит в доступные таймслоты сотрудника [(DateTime(2026, 10, 2, 0, 30), DateTime(2026, 10, 2, 22, 0))]
Stacktrace:
lib/fixture/salon/__init__.py:195 in salon_with_entities
lib/preconditions/yclients/biz/erp/display_information_in_panel_record.py:58 in prepare
data/db/orm/models/salons.py:985 in create_record
Seen in: - altegio/biz.erp#227943 — shard 6 — launch 172189 (×1, last 2026-10-02 18:44 MSK)
Exception — 1 occurrence(s) across 1 pipeline(s)¶
Exception: Время записи 2026-10-04 20:45:00 - 2026-10-04 22:15:00 Не входит в доступные таймслоты сотрудника [(DateTime(2026, 10, 4, 0, 45), DateTime(2026, 10, 4, 22, 0))]
Stacktrace:
lib/fixture/salon/__init__.py:195 in salon_with_entities
lib/preconditions/yclients/biz/erp/display_information_in_panel_record.py:58 in prepare
data/db/orm/models/salons.py:985 in create_record
Seen in: - altegio/biz.erp#228157 — shard 1 — launch 172400 (×1, last 2026-10-04 03:37 MSK)
Exception — 1 occurrence(s) across 1 pipeline(s)¶
Exception: Время записи 2026-10-06 21:00:00 - 2026-10-06 22:30:00 Не входит в доступные таймслоты сотрудника [(DateTime(2026, 10, 6, 0, 30), DateTime(2026, 10, 6, 22, 0))]
Stacktrace:
lib/fixture/salon/__init__.py:195 in salon_with_entities
lib/preconditions/yclients/biz/erp/display_information_in_panel_record.py:58 in prepare
data/db/orm/models/salons.py:985 in create_record
Seen in: - altegio/biz.erp#228717 — shard 6 — launch 173273 (×1, last 2026-10-06 03:40 MSK)
Exception — 1 occurrence(s) across 1 pipeline(s)¶
Exception: Время записи 2026-10-06 20:45:00 - 2026-10-06 22:15:00 Не входит в доступные таймслоты сотрудника [(DateTime(2026, 10, 6, 0, 45), DateTime(2026, 10, 6, 22, 0))]
Stacktrace:
lib/fixture/salon/__init__.py:195 in salon_with_entities
lib/preconditions/yclients/biz/erp/display_information_in_panel_record.py:58 in prepare
data/db/orm/models/salons.py:985 in create_record
Seen in: - altegio/biz.erp#228899 — shard 5 — launch 173568 (×1, last 2026-10-06 16:25 MSK)
Exception — 1 occurrence(s) across 1 pipeline(s)¶
Exception: Время записи 2026-10-06 20:45:00 - 2026-10-06 22:15:00 Не входит в доступные таймслоты сотрудника [(DateTime(2026, 10, 6, 0, 15), DateTime(2026, 10, 6, 22, 0))]
Stacktrace:
lib/fixture/salon/__init__.py:195 in salon_with_entities
lib/preconditions/yclients/biz/erp/display_information_in_panel_record.py:58 in prepare
data/db/orm/models/salons.py:985 in create_record
Seen in: - altegio/biz.erp#228913 — shard 8 — launch 173607 (×1, last 2026-10-06 17:30 MSK)
KeyError — 1 occurrence(s) across 1 pipeline(s)¶
KeyError: 'salon_with_entities'
Seen in: - altegio/biz.erp#227749 — shard 1 — launch 171616 (×1, last 2026-10-02 08:20 MSK)
SigninRedirectMissingError — 1 occurrence(s) across 1 pipeline(s)¶
autotests.lib.exception.SigninRedirectMissingError: login-XHR завершился со статусом 200, но редиректа со /signin/ не случилось за 30 с — подозрение на фронт biz.erp
--- причина (playwright) ---
Timeout 30000ms exceeded.
=========================== logs ===========================
waiting for navigation to "<function ImplToApiMapping.wrap_handler.<locals>.wrapper_func at 0x7efd3e73a660>" until 'commit'
navigated to "https://erp-testops-dev.infra.altegio.cloud/signin/"
navigated to "https://erp-testops-dev.infra.altegio.cloud/signin/"
navigated to "https://erp-testops-dev.infra.altegio.cloud/signin/JTJGdGltZXRhYmxlJTJGMTYzNTY1MjYlMkY="
navigated to "https://erp-testops-dev.infra.altegio.cloud/signin/JTJGdGltZXRhYmxlJTJGMTYzNTY1MjYlMkY="
navigated to "https://erp-testops-dev.infra.altegio.cloud/signin/JTJGdGltZXRhYmxlJTJGMTYzNTY1MjYlMkY="
============================================================
Stacktrace:
suite/yclients/biz/erp/web/records/test_create_and_move_record_pw.py:520 in test_display_information_in_panel_record
lib/apps_pw/yclients/biz/erp/web/pages/guest/signin.py:115 in sign_in
Seen in: - altegio/biz.erp#227596 — shard 8 — launch 171280 (×1, last 2026-10-01 17:40 MSK)
SigninRedirectMissingError — 1 occurrence(s) across 1 pipeline(s)¶
autotests.lib.exception.SigninRedirectMissingError: login-XHR завершился со статусом 200, но редиректа со /signin/ не случилось за 30 с — подозрение на фронт biz.erp
--- причина (playwright) ---
Timeout 30000ms exceeded.
=========================== logs ===========================
waiting for navigation to "<function ImplToApiMapping.wrap_handler.<locals>.wrapper_func at 0x7f2a7fd9c5e0>" until 'commit'
navigated to "https://erp-testops-dev.infra.altegio.cloud/signin/"
navigated to "https://erp-testops-dev.infra.altegio.cloud/signin/"
navigated to "https://erp-testops-dev.infra.altegio.cloud/signin/JTJGdGltZXRhYmxlJTJGMTYzNTcyNDAlMkY="
navigated to "https://erp-testops-dev.infra.altegio.cloud/signin/JTJGdGltZXRhYmxlJTJGMTYzNTcyNDAlMkY="
navigated to "https://erp-testops-dev.infra.altegio.cloud/signin/JTJGdGltZXRhYmxlJTJGMTYzNTcyNDAlMkY="
============================================================
Stacktrace:
suite/yclients/biz/erp/web/records/test_create_and_move_record_pw.py:520 in test_display_information_in_panel_record
lib/apps_pw/yclients/biz/erp/web/pages/guest/signin.py:115 in sign_in
Seen in: - altegio/biz.erp#227722 — shard 3 — launch 171516 (×1, last 2026-10-02 04:26 MSK)
SigninRedirectMissingError — 1 occurrence(s) across 1 pipeline(s)¶
autotests.lib.exception.SigninRedirectMissingError: login-XHR завершился со статусом 200, но редиректа со /signin/ не случилось за 30 с — подозрение на фронт biz.erp
--- причина (playwright) ---
Timeout 30000ms exceeded.
=========================== logs ===========================
waiting for navigation to "<function ImplToApiMapping.wrap_handler.<locals>.wrapper_func at 0x7f1bfc110540>" until 'commit'
navigated to "https://erp-testops-dev.infra.altegio.cloud/signin/"
navigated to "https://erp-testops-dev.infra.altegio.cloud/signin/"
navigated to "https://erp-testops-dev.infra.altegio.cloud/signin/JTJGdGltZXRhYmxlJTJGMTYzNTcyMTAlMkY="
navigated to "https://erp-testops-dev.infra.altegio.cloud/signin/JTJGdGltZXRhYmxlJTJGMTYzNTcyMTAlMkY="
navigated to "https://erp-testops-dev.infra.altegio.cloud/signin/JTJGdGltZXRhYmxlJTJGMTYzNTcyMTAlMkY="
============================================================
Stacktrace:
suite/yclients/biz/erp/web/records/test_create_and_move_record_pw.py:520 in test_display_information_in_panel_record
lib/apps_pw/yclients/biz/erp/web/pages/guest/signin.py:115 in sign_in
Seen in: - altegio/biz.erp#227722 — shard 3 — launch 171516 (×1, last 2026-10-02 04:26 MSK)
SigninRedirectMissingError — 1 occurrence(s) across 1 pipeline(s)¶
autotests.lib.exception.SigninRedirectMissingError: login-XHR завершился со статусом 200, но редиректа со /signin/ не случилось за 30 с — подозрение на фронт biz.erp
--- причина (playwright) ---
Timeout 30000ms exceeded.
=========================== logs ===========================
waiting for navigation to "<function ImplToApiMapping.wrap_handler.<locals>.wrapper_func at 0x7f56dd214cc0>" until 'commit'
navigated to "https://erp-testops-dev.infra.altegio.cloud/signin/"
navigated to "https://erp-testops-dev.infra.altegio.cloud/signin/"
navigated to "https://erp-testops-dev.infra.altegio.cloud/signin/JTJGdGltZXRhYmxlJTJGMTYzNTg5MDElMkY="
navigated to "https://erp-testops-dev.infra.altegio.cloud/signin/JTJGdGltZXRhYmxlJTJGMTYzNTg5MDElMkY="
navigated to "https://erp-testops-dev.infra.altegio.cloud/signin/JTJGdGltZXRhYmxlJTJGMTYzNTg5MDElMkY="
============================================================
Stacktrace:
suite/yclients/biz/erp/web/records/test_create_and_move_record_pw.py:520 in test_display_information_in_panel_record
lib/apps_pw/yclients/biz/erp/web/pages/guest/signin.py:115 in sign_in
Seen in: - altegio/biz.erp#227722 — shard 3 — launch 171516 (×1, last 2026-10-02 04:26 MSK)
SigninRedirectMissingError — 1 occurrence(s) across 1 pipeline(s)¶
autotests.lib.exception.SigninRedirectMissingError: login-XHR завершился со статусом 200, но редиректа со /signin/ не случилось за 30 с — подозрение на фронт biz.erp
--- причина (playwright) ---
Timeout 30000ms exceeded.
=========================== logs ===========================
waiting for navigation to "<function ImplToApiMapping.wrap_handler.<locals>.wrapper_func at 0x7fd6351ed580>" until 'commit'
navigated to "https://erp-testops-dev.infra.altegio.cloud/signin/"
navigated to "https://erp-testops-dev.infra.altegio.cloud/signin/"
navigated to "https://erp-testops-dev.infra.altegio.cloud/signin/JTJGdGltZXRhYmxlJTJGMTYzNjAwNTElMkY="
navigated to "https://erp-testops-dev.infra.altegio.cloud/signin/JTJGdGltZXRhYmxlJTJGMTYzNjAwNTElMkY="
navigated to "https://erp-testops-dev.infra.altegio.cloud/signin/JTJGdGltZXRhYmxlJTJGMTYzNjAwNTElMkY="
============================================================
Stacktrace:
suite/yclients/biz/erp/web/records/test_create_and_move_record_pw.py:520 in test_display_information_in_panel_record
lib/apps_pw/yclients/biz/erp/web/pages/guest/signin.py:115 in sign_in
Seen in: - altegio/biz.erp#227722 — shard 3 — launch 171516 (×1, last 2026-10-02 04:26 MSK)
SigninRedirectMissingError — 1 occurrence(s) across 1 pipeline(s)¶
autotests.lib.exception.SigninRedirectMissingError: login-XHR завершился со статусом 200, но редиректа со /signin/ не случилось за 30 с — подозрение на фронт biz.erp
--- причина (playwright) ---
Timeout 30000ms exceeded.
=========================== logs ===========================
waiting for navigation to "<function ImplToApiMapping.wrap_handler.<locals>.wrapper_func at 0x7f1ce49111c0>" until 'commit'
navigated to "https://erp-testops-dev.infra.altegio.cloud/signin/"
navigated to "https://erp-testops-dev.infra.altegio.cloud/signin/"
navigated to "https://erp-testops-dev.infra.altegio.cloud/signin/JTJGdGltZXRhYmxlJTJGMTYzNjAxODglMkY="
navigated to "https://erp-testops-dev.infra.altegio.cloud/signin/JTJGdGltZXRhYmxlJTJGMTYzNjAxODglMkY="
navigated to "https://erp-testops-dev.infra.altegio.cloud/signin/JTJGdGltZXRhYmxlJTJGMTYzNjAxODglMkY="
============================================================
Stacktrace:
suite/yclients/biz/erp/web/records/test_create_and_move_record_pw.py:520 in test_display_information_in_panel_record
lib/apps_pw/yclients/biz/erp/web/pages/guest/signin.py:115 in sign_in
Seen in: - altegio/biz.erp#227722 — shard 3 — launch 171516 (×1, last 2026-10-02 04:26 MSK)
SigninRedirectMissingError — 1 occurrence(s) across 1 pipeline(s)¶
autotests.lib.exception.SigninRedirectMissingError: login-XHR завершился со статусом 200, но редиректа со /signin/ не случилось за 30 с — подозрение на фронт biz.erp
--- причина (playwright) ---
Timeout 30000ms exceeded.
=========================== logs ===========================
waiting for navigation to "<function ImplToApiMapping.wrap_handler.<locals>.wrapper_func at 0x7f69a1e22de0>" until 'commit'
navigated to "https://erp-testops-dev.infra.altegio.cloud/signin/"
navigated to "https://erp-testops-dev.infra.altegio.cloud/signin/"
navigated to "https://erp-testops-dev.infra.altegio.cloud/signin/JTJGdGltZXRhYmxlJTJGMTYzNTc1ODIlMkY="
navigated to "https://erp-testops-dev.infra.altegio.cloud/signin/JTJGdGltZXRhYmxlJTJGMTYzNTc1ODIlMkY="
navigated to "https://erp-testops-dev.infra.altegio.cloud/signin/JTJGdGltZXRhYmxlJTJGMTYzNTc1ODIlMkY="
============================================================
Stacktrace:
suite/yclients/biz/erp/web/records/test_create_and_move_record_pw.py:520 in test_display_information_in_panel_record
lib/apps_pw/yclients/biz/erp/web/pages/guest/signin.py:115 in sign_in
Seen in: - altegio/biz.erp#227722 — shard 4 — launch 171516 (×1, last 2026-10-02 04:26 MSK)
SigninRedirectMissingError — 1 occurrence(s) across 1 pipeline(s)¶
autotests.lib.exception.SigninRedirectMissingError: login-XHR завершился со статусом 200, но редиректа со /signin/ не случилось за 30 с — подозрение на фронт biz.erp
--- причина (playwright) ---
Timeout 30000ms exceeded.
=========================== logs ===========================
waiting for navigation to "<function ImplToApiMapping.wrap_handler.<locals>.wrapper_func at 0x7f99ca9f2fc0>" until 'commit'
navigated to "https://erp-testops-dev.infra.altegio.cloud/signin/"
navigated to "https://erp-testops-dev.infra.altegio.cloud/signin/"
navigated to "https://erp-testops-dev.infra.altegio.cloud/signin/JTJGdGltZXRhYmxlJTJGMTYzNTc4NDAlMkY="
navigated to "https://erp-testops-dev.infra.altegio.cloud/signin/JTJGdGltZXRhYmxlJTJGMTYzNTc4NDAlMkY="
navigated to "https://erp-testops-dev.infra.altegio.cloud/signin/JTJGdGltZXRhYmxlJTJGMTYzNTc4NDAlMkY="
============================================================
Stacktrace:
suite/yclients/biz/erp/web/records/test_create_and_move_record_pw.py:520 in test_display_information_in_panel_record
lib/apps_pw/yclients/biz/erp/web/pages/guest/signin.py:115 in sign_in
Seen in: - altegio/biz.erp#227722 — shard 4 — launch 171516 (×1, last 2026-10-02 04:26 MSK)
SigninRedirectMissingError — 1 occurrence(s) across 1 pipeline(s)¶
autotests.lib.exception.SigninRedirectMissingError: login-XHR завершился со статусом 200, но редиректа со /signin/ не случилось за 30 с — подозрение на фронт biz.erp
--- причина (playwright) ---
Timeout 30000ms exceeded.
=========================== logs ===========================
waiting for navigation to "<function ImplToApiMapping.wrap_handler.<locals>.wrapper_func at 0x7fac6ae2d580>" until 'commit'
navigated to "https://erp-testops-dev.infra.altegio.cloud/signin/"
navigated to "https://erp-testops-dev.infra.altegio.cloud/signin/"
navigated to "https://erp-testops-dev.infra.altegio.cloud/signin/JTJGdGltZXRhYmxlJTJGMTYzNTkzNDYlMkY="
navigated to "https://erp-testops-dev.infra.altegio.cloud/signin/JTJGdGltZXRhYmxlJTJGMTYzNTkzNDYlMkY="
navigated to "https://erp-testops-dev.infra.altegio.cloud/signin/JTJGdGltZXRhYmxlJTJGMTYzNTkzNDYlMkY="
============================================================
Stacktrace:
suite/yclients/biz/erp/web/records/test_create_and_move_record_pw.py:520 in test_display_information_in_panel_record
lib/apps_pw/yclients/biz/erp/web/pages/guest/signin.py:115 in sign_in
Seen in: - altegio/biz.erp#227722 — shard 4 — launch 171516 (×1, last 2026-10-02 04:26 MSK)
SigninRedirectMissingError — 1 occurrence(s) across 1 pipeline(s)¶
autotests.lib.exception.SigninRedirectMissingError: login-XHR завершился со статусом 200, но редиректа со /signin/ не случилось за 30 с — подозрение на фронт biz.erp
--- причина (playwright) ---
Timeout 30000ms exceeded.
=========================== logs ===========================
waiting for navigation to "<function ImplToApiMapping.wrap_handler.<locals>.wrapper_func at 0x7fe42431ca40>" until 'commit'
navigated to "https://erp-testops-dev.infra.altegio.cloud/signin/"
navigated to "https://erp-testops-dev.infra.altegio.cloud/signin/"
navigated to "https://erp-testops-dev.infra.altegio.cloud/signin/JTJGdGltZXRhYmxlJTJGMTYzNTkzNTglMkY="
navigated to "https://erp-testops-dev.infra.altegio.cloud/signin/JTJGdGltZXRhYmxlJTJGMTYzNTkzNTglMkY="
navigated to "https://erp-testops-dev.infra.altegio.cloud/signin/JTJGdGltZXRhYmxlJTJGMTYzNTkzNTglMkY="
============================================================
Stacktrace:
suite/yclients/biz/erp/web/records/test_create_and_move_record_pw.py:520 in test_display_information_in_panel_record
lib/apps_pw/yclients/biz/erp/web/pages/guest/signin.py:115 in sign_in
Seen in: - altegio/biz.erp#227722 — shard 4 — launch 171516 (×1, last 2026-10-02 04:26 MSK)
SigninRedirectMissingError — 1 occurrence(s) across 1 pipeline(s)¶
autotests.lib.exception.SigninRedirectMissingError: login-XHR завершился со статусом 200, но редиректа со /signin/ не случилось за 30 с — подозрение на фронт biz.erp
--- причина (playwright) ---
Timeout 30000ms exceeded.
=========================== logs ===========================
waiting for navigation to "<function ImplToApiMapping.wrap_handler.<locals>.wrapper_func at 0x7f174ce527a0>" until 'commit'
navigated to "https://erp-testops-dev.infra.altegio.cloud/signin/"
navigated to "https://erp-testops-dev.infra.altegio.cloud/signin/"
navigated to "https://erp-testops-dev.infra.altegio.cloud/signin/JTJGdGltZXRhYmxlJTJGMTYzNjAxMzQlMkY="
navigated to "https://erp-testops-dev.infra.altegio.cloud/signin/JTJGdGltZXRhYmxlJTJGMTYzNjAxMzQlMkY="
navigated to "https://erp-testops-dev.infra.altegio.cloud/signin/JTJGdGltZXRhYmxlJTJGMTYzNjAxMzQlMkY="
============================================================
Stacktrace:
suite/yclients/biz/erp/web/records/test_create_and_move_record_pw.py:520 in test_display_information_in_panel_record
lib/apps_pw/yclients/biz/erp/web/pages/guest/signin.py:115 in sign_in
Seen in: - altegio/biz.erp#227722 — shard 4 — launch 171516 (×1, last 2026-10-02 04:26 MSK)
SigninRedirectMissingError — 1 occurrence(s) across 1 pipeline(s)¶
autotests.lib.exception.SigninRedirectMissingError: login-XHR завершился со статусом 200, но редиректа со /signin/ не случилось за 30 с — подозрение на фронт biz.erp
--- причина (playwright) ---
Timeout 30000ms exceeded.
=========================== logs ===========================
waiting for navigation to "<function ImplToApiMapping.wrap_handler.<locals>.wrapper_func at 0x7f736a6e58a0>" until 'commit'
navigated to "https://erp-testops-dev.infra.altegio.cloud/signin/"
navigated to "https://erp-testops-dev.infra.altegio.cloud/signin/"
navigated to "https://erp-testops-dev.infra.altegio.cloud/signin/JTJGdGltZXRhYmxlJTJGMTYzNjA0MTklMkY="
navigated to "https://erp-testops-dev.infra.altegio.cloud/signin/JTJGdGltZXRhYmxlJTJGMTYzNjA0MTklMkY="
navigated to "https://erp-testops-dev.infra.altegio.cloud/signin/JTJGdGltZXRhYmxlJTJGMTYzNjA0MTklMkY="
============================================================
Stacktrace:
suite/yclients/biz/erp/web/records/test_create_and_move_record_pw.py:520 in test_display_information_in_panel_record
lib/apps_pw/yclients/biz/erp/web/pages/guest/signin.py:115 in sign_in
Seen in: - altegio/biz.erp#227722 — shard 4 — launch 171516 (×1, last 2026-10-02 04:26 MSK)
SigninRedirectMissingError — 1 occurrence(s) across 1 pipeline(s)¶
autotests.lib.exception.SigninRedirectMissingError: login-XHR завершился со статусом 200, но редиректа со /signin/ не случилось за 30 с — подозрение на фронт biz.erp
--- причина (playwright) ---
Timeout 30000ms exceeded.
=========================== logs ===========================
waiting for navigation to "<function ImplToApiMapping.wrap_handler.<locals>.wrapper_func at 0x7f16e044ff60>" until 'commit'
navigated to "https://erp-testops-dev.infra.altegio.cloud/signin/"
navigated to "https://erp-testops-dev.infra.altegio.cloud/signin/"
navigated to "https://erp-testops-dev.infra.altegio.cloud/signin/JTJGdGltZXRhYmxlJTJGMTYzNjA0MjQlMkY="
navigated to "https://erp-testops-dev.infra.altegio.cloud/signin/JTJGdGltZXRhYmxlJTJGMTYzNjA0MjQlMkY="
navigated to "https://erp-testops-dev.infra.altegio.cloud/signin/JTJGdGltZXRhYmxlJTJGMTYzNjA0MjQlMkY="
============================================================
Stacktrace:
suite/yclients/biz/erp/web/records/test_create_and_move_record_pw.py:520 in test_display_information_in_panel_record
lib/apps_pw/yclients/biz/erp/web/pages/guest/signin.py:115 in sign_in
Seen in: - altegio/biz.erp#227722 — shard 4 — launch 171516 (×1, last 2026-10-02 04:26 MSK)
SigninRedirectMissingError — 1 occurrence(s) across 1 pipeline(s)¶
autotests.lib.exception.SigninRedirectMissingError: login-XHR завершился со статусом 200, но редиректа со /signin/ не случилось за 30 с — подозрение на фронт biz.erp
--- причина (playwright) ---
Timeout 30000ms exceeded.
=========================== logs ===========================
waiting for navigation to "<function ImplToApiMapping.wrap_handler.<locals>.wrapper_func at 0x7f03ec19b7e0>" until 'commit'
navigated to "https://erp-testops-dev.infra.altegio.cloud/signin/"
navigated to "https://erp-testops-dev.infra.altegio.cloud/signin/"
navigated to "https://erp-testops-dev.infra.altegio.cloud/signin/JTJGdGltZXRhYmxlJTJGMTYzNTk2MTElMkY="
navigated to "https://erp-testops-dev.infra.altegio.cloud/signin/JTJGdGltZXRhYmxlJTJGMTYzNTk2MTElMkY="
navigated to "https://erp-testops-dev.infra.altegio.cloud/signin/JTJGdGltZXRhYmxlJTJGMTYzNTk2MTElMkY="
============================================================
Stacktrace:
suite/yclients/biz/erp/web/records/test_create_and_move_record_pw.py:520 in test_display_information_in_panel_record
lib/apps_pw/yclients/biz/erp/web/pages/guest/signin.py:115 in sign_in
Seen in: - altegio/biz.erp#227722 — shard 8 — launch 171516 (×1, last 2026-10-02 04:26 MSK)
SigninRedirectMissingError — 1 occurrence(s) across 1 pipeline(s)¶
autotests.lib.exception.SigninRedirectMissingError: login-XHR завершился со статусом 200, но редиректа со /signin/ не случилось за 30 с — подозрение на фронт biz.erp
--- причина (playwright) ---
Timeout 30000ms exceeded.
=========================== logs ===========================
waiting for navigation to "<function ImplToApiMapping.wrap_handler.<locals>.wrapper_func at 0x7f651d17e840>" until 'commit'
navigated to "https://erp-testops-dev.infra.altegio.cloud/signin/"
navigated to "https://erp-testops-dev.infra.altegio.cloud/signin/"
navigated to "https://erp-testops-dev.infra.altegio.cloud/signin/JTJGdGltZXRhYmxlJTJGMTYzNjA3MjklMkY="
navigated to "https://erp-testops-dev.infra.altegio.cloud/signin/JTJGdGltZXRhYmxlJTJGMTYzNjA3MjklMkY="
navigated to "https://erp-testops-dev.infra.altegio.cloud/signin/JTJGdGltZXRhYmxlJTJGMTYzNjA3MjklMkY="
============================================================
Stacktrace:
suite/yclients/biz/erp/web/records/test_create_and_move_record_pw.py:520 in test_display_information_in_panel_record
lib/apps_pw/yclients/biz/erp/web/pages/guest/signin.py:115 in sign_in
Seen in: - altegio/biz.erp#227722 — shard 8 — launch 171516 (×1, last 2026-10-02 04:26 MSK)
SigninRedirectMissingError — 1 occurrence(s) across 1 pipeline(s)¶
autotests.lib.exception.SigninRedirectMissingError: login-XHR завершился со статусом 200, но редиректа со /signin/ не случилось за 30 с — подозрение на фронт biz.erp
--- причина (playwright) ---
Timeout 30000ms exceeded.
=========================== logs ===========================
waiting for navigation to "<function ImplToApiMapping.wrap_handler.<locals>.wrapper_func at 0x7f701c634ea0>" until 'commit'
navigated to "https://erp-testops-dev.infra.altegio.cloud/signin/"
navigated to "https://erp-testops-dev.infra.altegio.cloud/signin/"
navigated to "https://erp-testops-dev.infra.altegio.cloud/signin/JTJGdGltZXRhYmxlJTJGMTYzNjE0NDIlMkY="
navigated to "https://erp-testops-dev.infra.altegio.cloud/signin/JTJGdGltZXRhYmxlJTJGMTYzNjE0NDIlMkY="
navigated to "https://erp-testops-dev.infra.altegio.cloud/signin/JTJGdGltZXRhYmxlJTJGMTYzNjE0NDIlMkY="
============================================================
Stacktrace:
suite/yclients/biz/erp/web/records/test_create_and_move_record_pw.py:520 in test_display_information_in_panel_record
lib/apps_pw/yclients/biz/erp/web/pages/guest/signin.py:115 in sign_in
Seen in: - altegio/biz.erp#227735 — shard 3 — launch 171549 (×1, last 2026-10-02 06:23 MSK)
SigninRedirectMissingError — 1 occurrence(s) across 1 pipeline(s)¶
autotests.lib.exception.SigninRedirectMissingError: login-XHR завершился со статусом 200, но редиректа со /signin/ не случилось за 30 с — подозрение на фронт biz.erp
--- причина (playwright) ---
Timeout 30000ms exceeded.
=========================== logs ===========================
waiting for navigation to "<function ImplToApiMapping.wrap_handler.<locals>.wrapper_func at 0x7f08be7e7100>" until 'commit'
navigated to "https://erp-testops-dev.infra.altegio.cloud/signin/"
navigated to "https://erp-testops-dev.infra.altegio.cloud/signin/"
navigated to "https://erp-testops-dev.infra.altegio.cloud/signin/JTJGdGltZXRhYmxlJTJGMTYzNjI5NTklMkY="
navigated to "https://erp-testops-dev.infra.altegio.cloud/signin/JTJGdGltZXRhYmxlJTJGMTYzNjI5NTklMkY="
navigated to "https://erp-testops-dev.infra.altegio.cloud/signin/JTJGdGltZXRhYmxlJTJGMTYzNjI5NTklMkY="
============================================================
Stacktrace:
suite/yclients/biz/erp/web/records/test_create_and_move_record_pw.py:520 in test_display_information_in_panel_record
lib/apps_pw/yclients/biz/erp/web/pages/guest/signin.py:115 in sign_in
Seen in: - altegio/biz.erp#227735 — shard 3 — launch 171549 (×1, last 2026-10-02 06:23 MSK)
SigninRedirectMissingError — 1 occurrence(s) across 1 pipeline(s)¶
autotests.lib.exception.SigninRedirectMissingError: login-XHR завершился со статусом 200, но редиректа со /signin/ не случилось за 30 с — подозрение на фронт biz.erp
--- причина (playwright) ---
Timeout 30000ms exceeded.
=========================== logs ===========================
waiting for navigation to "<function ImplToApiMapping.wrap_handler.<locals>.wrapper_func at 0x7fe86457f420>" until 'commit'
navigated to "https://erp-testops-dev.infra.altegio.cloud/signin/"
navigated to "https://erp-testops-dev.infra.altegio.cloud/signin/"
navigated to "https://erp-testops-dev.infra.altegio.cloud/signin/JTJGdGltZXRhYmxlJTJGMTYzNjQxNDQlMkY="
navigated to "https://erp-testops-dev.infra.altegio.cloud/signin/JTJGdGltZXRhYmxlJTJGMTYzNjQxNDQlMkY="
navigated to "https://erp-testops-dev.infra.altegio.cloud/signin/JTJGdGltZXRhYmxlJTJGMTYzNjQxNDQlMkY="
============================================================
Stacktrace:
suite/yclients/biz/erp/web/records/test_create_and_move_record_pw.py:520 in test_display_information_in_panel_record
lib/apps_pw/yclients/biz/erp/web/pages/guest/signin.py:115 in sign_in
Seen in: - altegio/biz.erp#227735 — shard 3 — launch 171549 (×1, last 2026-10-02 06:23 MSK)
SigninRedirectMissingError — 1 occurrence(s) across 1 pipeline(s)¶
autotests.lib.exception.SigninRedirectMissingError: login-XHR завершился со статусом 200, но редиректа со /signin/ не случилось за 30 с — подозрение на фронт biz.erp
--- причина (playwright) ---
Timeout 30000ms exceeded.
=========================== logs ===========================
waiting for navigation to "<function ImplToApiMapping.wrap_handler.<locals>.wrapper_func at 0x7fc6f015bb00>" until 'commit'
navigated to "https://erp-testops-dev.infra.altegio.cloud/signin/"
navigated to "https://erp-testops-dev.infra.altegio.cloud/signin/"
navigated to "https://erp-testops-dev.infra.altegio.cloud/signin/JTJGdGltZXRhYmxlJTJGMTYzNjE1MjAlMkY="
navigated to "https://erp-testops-dev.infra.altegio.cloud/signin/JTJGdGltZXRhYmxlJTJGMTYzNjE1MjAlMkY="
navigated to "https://erp-testops-dev.infra.altegio.cloud/signin/JTJGdGltZXRhYmxlJTJGMTYzNjE1MjAlMkY="
============================================================
Stacktrace:
suite/yclients/biz/erp/web/records/test_create_and_move_record_pw.py:520 in test_display_information_in_panel_record
lib/apps_pw/yclients/biz/erp/web/pages/guest/signin.py:115 in sign_in
Seen in: - altegio/biz.erp#227735 — shard 4 — launch 171549 (×1, last 2026-10-02 06:23 MSK)
SigninRedirectMissingError — 1 occurrence(s) across 1 pipeline(s)¶
autotests.lib.exception.SigninRedirectMissingError: login-XHR завершился со статусом 200, но редиректа со /signin/ не случилось за 30 с — подозрение на фронт biz.erp
--- причина (playwright) ---
Timeout 30000ms exceeded.
=========================== logs ===========================
waiting for navigation to "<function ImplToApiMapping.wrap_handler.<locals>.wrapper_func at 0x7f4e5a36f560>" until 'commit'
navigated to "https://erp-testops-dev.infra.altegio.cloud/signin/"
navigated to "https://erp-testops-dev.infra.altegio.cloud/signin/"
navigated to "https://erp-testops-dev.infra.altegio.cloud/signin/JTJGdGltZXRhYmxlJTJGMTYzNjE3NzAlMkY="
navigated to "https://erp-testops-dev.infra.altegio.cloud/signin/JTJGdGltZXRhYmxlJTJGMTYzNjE3NzAlMkY="
navigated to "https://erp-testops-dev.infra.altegio.cloud/signin/JTJGdGltZXRhYmxlJTJGMTYzNjE3NzAlMkY="
============================================================
Stacktrace:
suite/yclients/biz/erp/web/records/test_create_and_move_record_pw.py:520 in test_display_information_in_panel_record
lib/apps_pw/yclients/biz/erp/web/pages/guest/signin.py:115 in sign_in
Seen in: - altegio/biz.erp#227735 — shard 4 — launch 171549 (×1, last 2026-10-02 06:23 MSK)
SigninRedirectMissingError — 1 occurrence(s) across 1 pipeline(s)¶
autotests.lib.exception.SigninRedirectMissingError: login-XHR завершился со статусом 200, но редиректа со /signin/ не случилось за 30 с — подозрение на фронт biz.erp
--- причина (playwright) ---
Timeout 30000ms exceeded.
=========================== logs ===========================
waiting for navigation to "<function ImplToApiMapping.wrap_handler.<locals>.wrapper_func at 0x7f2400a7b740>" until 'commit'
navigated to "https://erp-testops-dev.infra.altegio.cloud/signin/"
navigated to "https://erp-testops-dev.infra.altegio.cloud/signin/"
navigated to "https://erp-testops-dev.infra.altegio.cloud/signin/JTJGdGltZXRhYmxlJTJGMTYzNjMyODYlMkY="
navigated to "https://erp-testops-dev.infra.altegio.cloud/signin/JTJGdGltZXRhYmxlJTJGMTYzNjMyODYlMkY="
navigated to "https://erp-testops-dev.infra.altegio.cloud/signin/JTJGdGltZXRhYmxlJTJGMTYzNjMyODYlMkY="
============================================================
Stacktrace:
suite/yclients/biz/erp/web/records/test_create_and_move_record_pw.py:520 in test_display_information_in_panel_record
lib/apps_pw/yclients/biz/erp/web/pages/guest/signin.py:115 in sign_in
Seen in: - altegio/biz.erp#227735 — shard 4 — launch 171549 (×1, last 2026-10-02 06:23 MSK)
SigninRedirectMissingError — 1 occurrence(s) across 1 pipeline(s)¶
autotests.lib.exception.SigninRedirectMissingError: login-XHR завершился со статусом 200, но редиректа со /signin/ не случилось за 30 с — подозрение на фронт biz.erp
--- причина (playwright) ---
Timeout 30000ms exceeded.
=========================== logs ===========================
waiting for navigation to "<function ImplToApiMapping.wrap_handler.<locals>.wrapper_func at 0x7fbeb38951c0>" until 'commit'
navigated to "https://erp-testops-dev.infra.altegio.cloud/signin/"
navigated to "https://erp-testops-dev.infra.altegio.cloud/signin/"
navigated to "https://erp-testops-dev.infra.altegio.cloud/signin/JTJGdGltZXRhYmxlJTJGMTYzNjQ0NTElMkY="
navigated to "https://erp-testops-dev.infra.altegio.cloud/signin/JTJGdGltZXRhYmxlJTJGMTYzNjQ0NTElMkY="
navigated to "https://erp-testops-dev.infra.altegio.cloud/signin/JTJGdGltZXRhYmxlJTJGMTYzNjQ0NTElMkY="
============================================================
Stacktrace:
suite/yclients/biz/erp/web/records/test_create_and_move_record_pw.py:520 in test_display_information_in_panel_record
lib/apps_pw/yclients/biz/erp/web/pages/guest/signin.py:115 in sign_in
Seen in: - altegio/biz.erp#227735 — shard 4 — launch 171549 (×1, last 2026-10-02 06:23 MSK)
SigninRedirectMissingError — 1 occurrence(s) across 1 pipeline(s)¶
autotests.lib.exception.SigninRedirectMissingError: login-XHR завершился со статусом 200, но редиректа со /signin/ не случилось за 30 с — подозрение на фронт biz.erp
--- причина (playwright) ---
Timeout 30000ms exceeded.
=========================== logs ===========================
waiting for navigation to "<function ImplToApiMapping.wrap_handler.<locals>.wrapper_func at 0x7f8fc0a744a0>" until 'commit'
navigated to "https://erp-testops-dev.infra.altegio.cloud/signin/"
navigated to "https://erp-testops-dev.infra.altegio.cloud/signin/"
navigated to "https://erp-testops-dev.infra.altegio.cloud/signin/JTJGdGltZXRhYmxlJTJGMTYzNjI4MzQlMkY="
navigated to "https://erp-testops-dev.infra.altegio.cloud/signin/JTJGdGltZXRhYmxlJTJGMTYzNjI4MzQlMkY="
navigated to "https://erp-testops-dev.infra.altegio.cloud/signin/JTJGdGltZXRhYmxlJTJGMTYzNjI4MzQlMkY="
============================================================
Stacktrace:
suite/yclients/biz/erp/web/records/test_create_and_move_record_pw.py:520 in test_display_information_in_panel_record
lib/apps_pw/yclients/biz/erp/web/pages/guest/signin.py:115 in sign_in
Seen in: - altegio/biz.erp#227735 — shard 6 — launch 171549 (×1, last 2026-10-02 06:23 MSK)
SigninRedirectMissingError — 1 occurrence(s) across 1 pipeline(s)¶
autotests.lib.exception.SigninRedirectMissingError: login-XHR завершился со статусом 200, но редиректа со /signin/ не случилось за 30 с — подозрение на фронт biz.erp
--- причина (playwright) ---
Timeout 30000ms exceeded.
=========================== logs ===========================
waiting for navigation to "<function ImplToApiMapping.wrap_handler.<locals>.wrapper_func at 0x7fcfb805c9a0>" until 'commit'
navigated to "https://erp-testops-dev.infra.altegio.cloud/signin/"
navigated to "https://erp-testops-dev.infra.altegio.cloud/signin/"
navigated to "https://erp-testops-dev.infra.altegio.cloud/signin/JTJGdGltZXRhYmxlJTJGMTYzNjQwODQlMkY="
navigated to "https://erp-testops-dev.infra.altegio.cloud/signin/JTJGdGltZXRhYmxlJTJGMTYzNjQwODQlMkY="
navigated to "https://erp-testops-dev.infra.altegio.cloud/signin/JTJGdGltZXRhYmxlJTJGMTYzNjQwODQlMkY="
============================================================
Stacktrace:
suite/yclients/biz/erp/web/records/test_create_and_move_record_pw.py:520 in test_display_information_in_panel_record
lib/apps_pw/yclients/biz/erp/web/pages/guest/signin.py:115 in sign_in
Seen in: - altegio/biz.erp#227735 — shard 6 — launch 171549 (×1, last 2026-10-02 06:23 MSK)
SigninRedirectMissingError — 1 occurrence(s) across 1 pipeline(s)¶
autotests.lib.exception.SigninRedirectMissingError: login-XHR завершился со статусом 200, но редиректа со /signin/ не случилось за 30 с — подозрение на фронт biz.erp
--- причина (playwright) ---
Timeout 30000ms exceeded.
=========================== logs ===========================
waiting for navigation to "<function ImplToApiMapping.wrap_handler.<locals>.wrapper_func at 0x7fdae5377ce0>" until 'commit'
navigated to "https://erp-testops-dev.infra.altegio.cloud/signin/"
navigated to "https://erp-testops-dev.infra.altegio.cloud/signin/"
navigated to "https://erp-testops-dev.infra.altegio.cloud/signin/JTJGdGltZXRhYmxlJTJGMTYzNjQ4NTIlMkY="
navigated to "https://erp-testops-dev.infra.altegio.cloud/signin/JTJGdGltZXRhYmxlJTJGMTYzNjQ4NTIlMkY="
navigated to "https://erp-testops-dev.infra.altegio.cloud/signin/JTJGdGltZXRhYmxlJTJGMTYzNjQ4NTIlMkY="
============================================================
Stacktrace:
suite/yclients/biz/erp/web/records/test_create_and_move_record_pw.py:520 in test_display_information_in_panel_record
lib/apps_pw/yclients/biz/erp/web/pages/guest/signin.py:115 in sign_in
Seen in: - altegio/biz.erp#227735 — shard 6 — launch 171549 (×1, last 2026-10-02 06:23 MSK)
🏥 SigninRedirectMissingError — 1 occurrence(s) across 1 pipeline(s)¶
autotests.lib.exception.SigninRedirectMissingError: login-XHR завершился со статусом 200, но редиректа со /signin/ не случилось за 30 с — подозрение на фронт biz.erp
--- причина (playwright) ---
Timeout 30000ms exceeded.
=========================== logs ===========================
waiting for navigation to "<function ImplToApiMapping.wrap_handler.<locals>.wrapper_func at 0x7f3ce4440360>" until 'commit'
navigated to "https://erp-testops-dev.infra.altegio.cloud/signin/"
navigated to "https://erp-testops-dev.infra.altegio.cloud/signin/"
navigated to "https://erp-testops-dev.infra.altegio.cloud/signin/JTJGdGltZXRhYmxlJTJGMTYzNjcwNDUlMkY="
navigated to "https://erp-testops-dev.infra.altegio.cloud/signin/JTJGdGltZXRhYmxlJTJGMTYzNjcwNDUlMkY="
navigated to "https://erp-testops-dev.infra.altegio.cloud/signin/JTJGdGltZXRhYmxlJTJGMTYzNjcwNDUlMkY="
============================================================
Stacktrace:
suite/yclients/biz/erp/web/records/test_create_and_move_record_pw.py:520 in test_display_information_in_panel_record
lib/apps_pw/yclients/biz/erp/web/pages/guest/signin.py:115 in sign_in
Seen in: - altegio/biz.erp#227749 — shard 1 — launch 171616 (×1, last 2026-10-02 08:20 MSK)
🏥 SigninRedirectMissingError — 1 occurrence(s) across 1 pipeline(s)¶
autotests.lib.exception.SigninRedirectMissingError: login-XHR завершился со статусом 200, но редиректа со /signin/ не случилось за 30 с — подозрение на фронт biz.erp
--- причина (playwright) ---
Timeout 30000ms exceeded.
=========================== logs ===========================
waiting for navigation to "<function ImplToApiMapping.wrap_handler.<locals>.wrapper_func at 0x7fb0cb67a8e0>" until 'commit'
navigated to "https://erp-testops-dev.infra.altegio.cloud/signin/"
navigated to "https://erp-testops-dev.infra.altegio.cloud/signin/"
navigated to "https://erp-testops-dev.infra.altegio.cloud/signin/JTJGdGltZXRhYmxlJTJGMTYzNjY4MTklMkY="
navigated to "https://erp-testops-dev.infra.altegio.cloud/signin/JTJGdGltZXRhYmxlJTJGMTYzNjY4MTklMkY="
navigated to "https://erp-testops-dev.infra.altegio.cloud/signin/JTJGdGltZXRhYmxlJTJGMTYzNjY4MTklMkY="
============================================================
Stacktrace:
suite/yclients/biz/erp/web/records/test_create_and_move_record_pw.py:520 in test_display_information_in_panel_record
lib/apps_pw/yclients/biz/erp/web/pages/guest/signin.py:115 in sign_in
Seen in: - altegio/biz.erp#227749 — shard 1 — launch 171616 (×1, last 2026-10-02 08:20 MSK)
🏥 SigninRedirectMissingError — 1 occurrence(s) across 1 pipeline(s)¶
autotests.lib.exception.SigninRedirectMissingError: login-XHR завершился со статусом 200, но редиректа со /signin/ не случилось за 30 с — подозрение на фронт biz.erp
--- причина (playwright) ---
Timeout 30000ms exceeded.
=========================== logs ===========================
waiting for navigation to "<function ImplToApiMapping.wrap_handler.<locals>.wrapper_func at 0x7f91931451c0>" until 'commit'
navigated to "https://erp-testops-dev.infra.altegio.cloud/signin/"
navigated to "https://erp-testops-dev.infra.altegio.cloud/signin/"
navigated to "https://erp-testops-dev.infra.altegio.cloud/signin/JTJGdGltZXRhYmxlJTJGMTYzNjY4MDklMkY="
navigated to "https://erp-testops-dev.infra.altegio.cloud/signin/JTJGdGltZXRhYmxlJTJGMTYzNjY4MDklMkY="
navigated to "https://erp-testops-dev.infra.altegio.cloud/signin/JTJGdGltZXRhYmxlJTJGMTYzNjY4MDklMkY="
============================================================
Stacktrace:
suite/yclients/biz/erp/web/records/test_create_and_move_record_pw.py:520 in test_display_information_in_panel_record
lib/apps_pw/yclients/biz/erp/web/pages/guest/signin.py:115 in sign_in
Seen in: - altegio/biz.erp#227749 — shard 2 — launch 171616 (×1, last 2026-10-02 08:20 MSK)
SigninRedirectMissingError — 1 occurrence(s) across 1 pipeline(s)¶
autotests.lib.exception.SigninRedirectMissingError: login-XHR завершился со статусом 200, но редиректа со /signin/ не случилось за 30 с — подозрение на фронт biz.erp
--- причина (playwright) ---
Timeout 30000ms exceeded.
=========================== logs ===========================
waiting for navigation to "<function ImplToApiMapping.wrap_handler.<locals>.wrapper_func at 0x7f1871b1d260>" until 'commit'
navigated to "https://erp-testops-dev.infra.altegio.cloud/signin/"
navigated to "https://erp-testops-dev.infra.altegio.cloud/signin/"
navigated to "https://erp-testops-dev.infra.altegio.cloud/signin/JTJGdGltZXRhYmxlJTJGMTYzNjYxMjElMkY="
navigated to "https://erp-testops-dev.infra.altegio.cloud/signin/JTJGdGltZXRhYmxlJTJGMTYzNjYxMjElMkY="
navigated to "https://erp-testops-dev.infra.altegio.cloud/signin/JTJGdGltZXRhYmxlJTJGMTYzNjYxMjElMkY="
============================================================
Stacktrace:
suite/yclients/biz/erp/web/records/test_create_and_move_record_pw.py:520 in test_display_information_in_panel_record
lib/apps_pw/yclients/biz/erp/web/pages/guest/signin.py:115 in sign_in
Seen in: - altegio/biz.erp#227749 — shard 3 — launch 171616 (×1, last 2026-10-02 08:20 MSK)
🏥 SigninRedirectMissingError — 1 occurrence(s) across 1 pipeline(s)¶
autotests.lib.exception.SigninRedirectMissingError: login-XHR завершился со статусом 200, но редиректа со /signin/ не случилось за 30 с — подозрение на фронт biz.erp
--- причина (playwright) ---
Timeout 30000ms exceeded.
=========================== logs ===========================
waiting for navigation to "<function ImplToApiMapping.wrap_handler.<locals>.wrapper_func at 0x7f79bc273240>" until 'commit'
navigated to "https://erp-testops-dev.infra.altegio.cloud/signin/"
navigated to "https://erp-testops-dev.infra.altegio.cloud/signin/"
navigated to "https://erp-testops-dev.infra.altegio.cloud/signin/JTJGdGltZXRhYmxlJTJGMTYzNjc2MTclMkY="
navigated to "https://erp-testops-dev.infra.altegio.cloud/signin/JTJGdGltZXRhYmxlJTJGMTYzNjc2MTclMkY="
navigated to "https://erp-testops-dev.infra.altegio.cloud/signin/JTJGdGltZXRhYmxlJTJGMTYzNjc2MTclMkY="
============================================================
Stacktrace:
suite/yclients/biz/erp/web/records/test_create_and_move_record_pw.py:520 in test_display_information_in_panel_record
lib/apps_pw/yclients/biz/erp/web/pages/guest/signin.py:115 in sign_in
Seen in: - altegio/biz.erp#227749 — shard 3 — launch 171616 (×1, last 2026-10-02 08:20 MSK)
SigninRedirectMissingError — 1 occurrence(s) across 1 pipeline(s)¶
autotests.lib.exception.SigninRedirectMissingError: login-XHR завершился со статусом 200, но редиректа со /signin/ не случилось за 30 с — подозрение на фронт biz.erp
--- причина (playwright) ---
Timeout 30000ms exceeded.
=========================== logs ===========================
waiting for navigation to "<function ImplToApiMapping.wrap_handler.<locals>.wrapper_func at 0x7fd02043a7a0>" until 'commit'
navigated to "https://erp-testops-dev.infra.altegio.cloud/signin/"
navigated to "https://erp-testops-dev.infra.altegio.cloud/signin/"
navigated to "https://erp-testops-dev.infra.altegio.cloud/signin/JTJGdGltZXRhYmxlJTJGMTYzNjU0MDYlMkY="
navigated to "https://erp-testops-dev.infra.altegio.cloud/signin/JTJGdGltZXRhYmxlJTJGMTYzNjU0MDYlMkY="
navigated to "https://erp-testops-dev.infra.altegio.cloud/signin/JTJGdGltZXRhYmxlJTJGMTYzNjU0MDYlMkY="
============================================================
Stacktrace:
suite/yclients/biz/erp/web/records/test_create_and_move_record_pw.py:520 in test_display_information_in_panel_record
lib/apps_pw/yclients/biz/erp/web/pages/guest/signin.py:115 in sign_in
Seen in: - altegio/biz.erp#227749 — shard 7 — launch 171616 (×1, last 2026-10-02 08:20 MSK)
🏥 SigninRedirectMissingError — 1 occurrence(s) across 1 pipeline(s)¶
autotests.lib.exception.SigninRedirectMissingError: login-XHR завершился со статусом 200, но редиректа со /signin/ не случилось за 30 с — подозрение на фронт biz.erp
--- причина (playwright) ---
Timeout 30000ms exceeded.
=========================== logs ===========================
waiting for navigation to "<function ImplToApiMapping.wrap_handler.<locals>.wrapper_func at 0x7fa42047e660>" until 'commit'
navigated to "https://erp-testops-dev.infra.altegio.cloud/signin/"
navigated to "https://erp-testops-dev.infra.altegio.cloud/signin/"
navigated to "https://erp-testops-dev.infra.altegio.cloud/signin/JTJGdGltZXRhYmxlJTJGMTYzNjcxNzUlMkY="
navigated to "https://erp-testops-dev.infra.altegio.cloud/signin/JTJGdGltZXRhYmxlJTJGMTYzNjcxNzUlMkY="
navigated to "https://erp-testops-dev.infra.altegio.cloud/signin/JTJGdGltZXRhYmxlJTJGMTYzNjcxNzUlMkY="
============================================================
Stacktrace:
suite/yclients/biz/erp/web/records/test_create_and_move_record_pw.py:520 in test_display_information_in_panel_record
lib/apps_pw/yclients/biz/erp/web/pages/guest/signin.py:115 in sign_in
Seen in: - altegio/biz.erp#227749 — shard 7 — launch 171616 (×1, last 2026-10-02 08:20 MSK)
SigninRedirectMissingError — 1 occurrence(s) across 1 pipeline(s)¶
autotests.lib.exception.SigninRedirectMissingError: login-XHR завершился со статусом 200, но редиректа со /signin/ не случилось за 30 с — подозрение на фронт biz.erp
--- причина (playwright) ---
Timeout 30000ms exceeded.
=========================== logs ===========================
waiting for navigation to "<function ImplToApiMapping.wrap_handler.<locals>.wrapper_func at 0x7f860476ae80>" until 'commit'
navigated to "https://erp-testops-dev.infra.altegio.cloud/signin/"
navigated to "https://erp-testops-dev.infra.altegio.cloud/signin/"
navigated to "https://erp-testops-dev.infra.altegio.cloud/signin/JTJGdGltZXRhYmxlJTJGMTYzNjU3MjYlMkY="
navigated to "https://erp-testops-dev.infra.altegio.cloud/signin/JTJGdGltZXRhYmxlJTJGMTYzNjU3MjYlMkY="
navigated to "https://erp-testops-dev.infra.altegio.cloud/signin/JTJGdGltZXRhYmxlJTJGMTYzNjU3MjYlMkY="
============================================================
Stacktrace:
suite/yclients/biz/erp/web/records/test_create_and_move_record_pw.py:520 in test_display_information_in_panel_record
lib/apps_pw/yclients/biz/erp/web/pages/guest/signin.py:115 in sign_in
Seen in: - altegio/biz.erp#227749 — shard 8 — launch 171616 (×1, last 2026-10-02 08:20 MSK)
🏥 SigninRedirectMissingError — 1 occurrence(s) across 1 pipeline(s)¶
autotests.lib.exception.SigninRedirectMissingError: login-XHR завершился со статусом 200, но редиректа со /signin/ не случилось за 30 с — подозрение на фронт biz.erp
--- причина (playwright) ---
Timeout 30000ms exceeded.
=========================== logs ===========================
waiting for navigation to "<function ImplToApiMapping.wrap_handler.<locals>.wrapper_func at 0x7f56a9e92e80>" until 'commit'
navigated to "https://erp-testops-dev.infra.altegio.cloud/signin/"
navigated to "https://erp-testops-dev.infra.altegio.cloud/signin/"
navigated to "https://erp-testops-dev.infra.altegio.cloud/signin/JTJGdGltZXRhYmxlJTJGMTYzNjczMzMlMkY="
navigated to "https://erp-testops-dev.infra.altegio.cloud/signin/JTJGdGltZXRhYmxlJTJGMTYzNjczMzMlMkY="
navigated to "https://erp-testops-dev.infra.altegio.cloud/signin/JTJGdGltZXRhYmxlJTJGMTYzNjczMzMlMkY="
============================================================
Stacktrace:
suite/yclients/biz/erp/web/records/test_create_and_move_record_pw.py:520 in test_display_information_in_panel_record
lib/apps_pw/yclients/biz/erp/web/pages/guest/signin.py:115 in sign_in
Seen in: - altegio/biz.erp#227749 — shard 8 — launch 171616 (×1, last 2026-10-02 08:20 MSK)
🏥 SigninRedirectMissingError — 1 occurrence(s) across 1 pipeline(s)¶
autotests.lib.exception.SigninRedirectMissingError: login-XHR завершился со статусом 200, но редиректа со /signin/ не случилось за 30 с — подозрение на фронт biz.erp
--- причина (playwright) ---
Timeout 30000ms exceeded.
=========================== logs ===========================
waiting for navigation to "<function ImplToApiMapping.wrap_handler.<locals>.wrapper_func at 0x7ff7d295ad40>" until 'commit'
navigated to "https://erp-testops-dev.infra.altegio.cloud/signin/"
navigated to "https://erp-testops-dev.infra.altegio.cloud/signin/"
navigated to "https://erp-testops-dev.infra.altegio.cloud/signin/JTJGdGltZXRhYmxlJTJGMTYzNzAzMjMlMkY="
navigated to "https://erp-testops-dev.infra.altegio.cloud/signin/JTJGdGltZXRhYmxlJTJGMTYzNzAzMjMlMkY="
navigated to "https://erp-testops-dev.infra.altegio.cloud/signin/JTJGdGltZXRhYmxlJTJGMTYzNzAzMjMlMkY="
============================================================
Stacktrace:
suite/yclients/biz/erp/web/records/test_create_and_move_record_pw.py:520 in test_display_information_in_panel_record
lib/apps_pw/yclients/biz/erp/web/pages/guest/signin.py:115 in sign_in
Seen in: - altegio/biz.erp#227787 — shard 2 — launch 171752 (×1, last 2026-10-02 11:50 MSK)
🏥 SigninRedirectMissingError — 1 occurrence(s) across 1 pipeline(s)¶
autotests.lib.exception.SigninRedirectMissingError: login-XHR завершился со статусом 200, но редиректа со /signin/ не случилось за 30 с — подозрение на фронт biz.erp
--- причина (playwright) ---
Timeout 30000ms exceeded.
=========================== logs ===========================
waiting for navigation to "<function ImplToApiMapping.wrap_handler.<locals>.wrapper_func at 0x7f05c4eaff60>" until 'commit'
navigated to "https://erp-testops-dev.infra.altegio.cloud/signin/"
navigated to "https://erp-testops-dev.infra.altegio.cloud/signin/"
navigated to "https://erp-testops-dev.infra.altegio.cloud/signin/JTJGdGltZXRhYmxlJTJGMTYzNzExNjQlMkY="
navigated to "https://erp-testops-dev.infra.altegio.cloud/signin/JTJGdGltZXRhYmxlJTJGMTYzNzExNjQlMkY="
navigated to "https://erp-testops-dev.infra.altegio.cloud/signin/JTJGdGltZXRhYmxlJTJGMTYzNzExNjQlMkY="
============================================================
Stacktrace:
suite/yclients/biz/erp/web/records/test_create_and_move_record_pw.py:520 in test_display_information_in_panel_record
lib/apps_pw/yclients/biz/erp/web/pages/guest/signin.py:115 in sign_in
Seen in: - altegio/biz.erp#227787 — shard 2 — launch 171752 (×1, last 2026-10-02 11:50 MSK)
🏥 SigninRedirectMissingError — 1 occurrence(s) across 1 pipeline(s)¶
autotests.lib.exception.SigninRedirectMissingError: login-XHR завершился со статусом 200, но редиректа со /signin/ не случилось за 30 с — подозрение на фронт biz.erp
--- причина (playwright) ---
Timeout 30000ms exceeded.
=========================== logs ===========================
waiting for navigation to "<function ImplToApiMapping.wrap_handler.<locals>.wrapper_func at 0x7fad30fe40e0>" until 'commit'
navigated to "https://erp-testops-dev.infra.altegio.cloud/signin/"
navigated to "https://erp-testops-dev.infra.altegio.cloud/signin/"
navigated to "https://erp-testops-dev.infra.altegio.cloud/signin/JTJGdGltZXRhYmxlJTJGMTYzNzEwMDAlMkY="
navigated to "https://erp-testops-dev.infra.altegio.cloud/signin/JTJGdGltZXRhYmxlJTJGMTYzNzEwMDAlMkY="
navigated to "https://erp-testops-dev.infra.altegio.cloud/signin/JTJGdGltZXRhYmxlJTJGMTYzNzEwMDAlMkY="
============================================================
Stacktrace:
suite/yclients/biz/erp/web/records/test_create_and_move_record_pw.py:520 in test_display_information_in_panel_record
lib/apps_pw/yclients/biz/erp/web/pages/guest/signin.py:115 in sign_in
Seen in: - altegio/biz.erp#227787 — shard 3 — launch 171752 (×1, last 2026-10-02 11:50 MSK)
🏥 SigninRedirectMissingError — 1 occurrence(s) across 1 pipeline(s)¶
autotests.lib.exception.SigninRedirectMissingError: login-XHR завершился со статусом 200, но редиректа со /signin/ не случилось за 30 с — подозрение на фронт biz.erp
--- причина (playwright) ---
Timeout 30000ms exceeded.
=========================== logs ===========================
waiting for navigation to "<function ImplToApiMapping.wrap_handler.<locals>.wrapper_func at 0x7f6b6b90aca0>" until 'commit'
navigated to "https://erp-testops-dev.infra.altegio.cloud/signin/"
navigated to "https://erp-testops-dev.infra.altegio.cloud/signin/"
navigated to "https://erp-testops-dev.infra.altegio.cloud/signin/JTJGdGltZXRhYmxlJTJGMTYzNjk3OTIlMkY="
navigated to "https://erp-testops-dev.infra.altegio.cloud/signin/JTJGdGltZXRhYmxlJTJGMTYzNjk3OTIlMkY="
navigated to "https://erp-testops-dev.infra.altegio.cloud/signin/JTJGdGltZXRhYmxlJTJGMTYzNjk3OTIlMkY="
============================================================
Stacktrace:
suite/yclients/biz/erp/web/records/test_create_and_move_record_pw.py:520 in test_display_information_in_panel_record
lib/apps_pw/yclients/biz/erp/web/pages/guest/signin.py:115 in sign_in
Seen in: - altegio/biz.erp#227787 — shard 4 — launch 171752 (×1, last 2026-10-02 11:50 MSK)
🏥 SigninRedirectMissingError — 1 occurrence(s) across 1 pipeline(s)¶
autotests.lib.exception.SigninRedirectMissingError: login-XHR завершился со статусом 200, но редиректа со /signin/ не случилось за 30 с — подозрение на фронт biz.erp
--- причина (playwright) ---
Timeout 30000ms exceeded.
=========================== logs ===========================
waiting for navigation to "<function ImplToApiMapping.wrap_handler.<locals>.wrapper_func at 0x7f2ad81411c0>" until 'commit'
navigated to "https://erp-testops-dev.infra.altegio.cloud/signin/"
navigated to "https://erp-testops-dev.infra.altegio.cloud/signin/"
navigated to "https://erp-testops-dev.infra.altegio.cloud/signin/JTJGdGltZXRhYmxlJTJGMTYzNzAyMzklMkY="
navigated to "https://erp-testops-dev.infra.altegio.cloud/signin/JTJGdGltZXRhYmxlJTJGMTYzNzAyMzklMkY="
navigated to "https://erp-testops-dev.infra.altegio.cloud/signin/JTJGdGltZXRhYmxlJTJGMTYzNzAyMzklMkY="
============================================================
Stacktrace:
suite/yclients/biz/erp/web/records/test_create_and_move_record_pw.py:520 in test_display_information_in_panel_record
lib/apps_pw/yclients/biz/erp/web/pages/guest/signin.py:115 in sign_in
Seen in: - altegio/biz.erp#227787 — shard 4 — launch 171752 (×1, last 2026-10-02 11:50 MSK)
🏥 SigninRedirectMissingError — 1 occurrence(s) across 1 pipeline(s)¶
autotests.lib.exception.SigninRedirectMissingError: login-XHR завершился со статусом 200, но редиректа со /signin/ не случилось за 30 с — подозрение на фронт biz.erp
--- причина (playwright) ---
Timeout 30000ms exceeded.
=========================== logs ===========================
waiting for navigation to "<function ImplToApiMapping.wrap_handler.<locals>.wrapper_func at 0x7f68fcfb2520>" until 'commit'
navigated to "https://erp-testops-dev.infra.altegio.cloud/signin/"
navigated to "https://erp-testops-dev.infra.altegio.cloud/signin/"
navigated to "https://erp-testops-dev.infra.altegio.cloud/signin/JTJGdGltZXRhYmxlJTJGMTYzNzEwNzAlMkY="
navigated to "https://erp-testops-dev.infra.altegio.cloud/signin/JTJGdGltZXRhYmxlJTJGMTYzNzEwNzAlMkY="
navigated to "https://erp-testops-dev.infra.altegio.cloud/signin/JTJGdGltZXRhYmxlJTJGMTYzNzEwNzAlMkY="
============================================================
Stacktrace:
suite/yclients/biz/erp/web/records/test_create_and_move_record_pw.py:520 in test_display_information_in_panel_record
lib/apps_pw/yclients/biz/erp/web/pages/guest/signin.py:115 in sign_in
Seen in: - altegio/biz.erp#227787 — shard 4 — launch 171752 (×1, last 2026-10-02 11:50 MSK)
TimeoutError — 1 occurrence(s) across 1 pipeline(s)¶
TimeoutError: timed out
pymysql.err.OperationalError: (2013, 'Lost connection to MySQL server during query (timed out)')
sqlalchemy.exc.OperationalError: (pymysql.err.OperationalError) (2013, 'Lost connection to MySQL server during query (timed out)')
[SQL: INSERT INTO documents (user_id, salon_id, storage_id, category_id, visit_id, record_id, type, comment, date_create, date, number, services_count) VALUES (%(user_id)s, %(salon_id)s, %(storage_id)s, %(category_id)s, %(visit_id)s, %(record_id)s, %(type)s, %(comment)s, %(date_create)s, %(date)s, %(number)s, %(services_count)s)]
[parameters: {'user_id': 20305287, 'salon_id': 16118303, 'storage_id': 0, 'category_id': 0, 'visit_id': 15083064, 'record_id': 20309512, 'type': 7, 'comment': '', 'date_create': datetime.datetime(2026, 9, 28, 22, 30, 8, 990774), 'date': '0000-00-00 00:00:00', 'number': 1, 'services_count': 1}]
(Background on this error at: http://sqlalche.me/e/e3q8)
Stacktrace:
lib/fixture/salon/__init__.py:196 in salon_with_entities
lib/preconditions/__init__.py:86 in create
data/db/orm/__init__.py:365 in add_entities
data/db/orm/__init__.py:74 in call_with_session
Seen in: - altegio/biz.erp#226698 — shard 1 — launch 169315 (×1, last 2026-09-28 22:50 MSK)
TimeoutError — 1 occurrence(s) across 1 pipeline(s)¶
TimeoutError: timed out
pymysql.err.OperationalError: (2013, 'Lost connection to MySQL server during query (timed out)')
sqlalchemy.exc.OperationalError: (pymysql.err.OperationalError) (2013, 'Lost connection to MySQL server during query (timed out)')
[SQL: INSERT INTO documents (user_id, salon_id, storage_id, category_id, visit_id, record_id, type, comment, date_create, date, number, services_count) VALUES (%(user_id)s, %(salon_id)s, %(storage_id)s, %(category_id)s, %(visit_id)s, %(record_id)s, %(type)s, %(comment)s, %(date_create)s, %(date)s, %(number)s, %(services_count)s)]
[parameters: {'user_id': 20305614, 'salon_id': 16118630, 'storage_id': 0, 'category_id': 0, 'visit_id': 15083294, 'record_id': 20309761, 'type': 7, 'comment': '', 'date_create': datetime.datetime(2026, 9, 28, 22, 32, 31, 300788), 'date': '0000-00-00 00:00:00', 'number': 1, 'services_count': 1}]
(Background on this error at: http://sqlalche.me/e/e3q8)
Stacktrace:
lib/fixture/salon/__init__.py:196 in salon_with_entities
lib/preconditions/__init__.py:86 in create
data/db/orm/__init__.py:365 in add_entities
data/db/orm/__init__.py:74 in call_with_session
Seen in: - altegio/biz.erp#226698 — shard 1 — launch 169315 (×1, last 2026-09-28 22:50 MSK)
TimeoutError — 1 occurrence(s) across 1 pipeline(s)¶
TimeoutError: timed out
pymysql.err.OperationalError: (2013, 'Lost connection to MySQL server during query (timed out)')
sqlalchemy.exc.OperationalError: (pymysql.err.OperationalError) (2013, 'Lost connection to MySQL server during query (timed out)')
[SQL: INSERT INTO documents (user_id, salon_id, storage_id, category_id, visit_id, record_id, type, comment, date_create, date, number, services_count) VALUES (%(user_id)s, %(salon_id)s, %(storage_id)s, %(category_id)s, %(visit_id)s, %(record_id)s, %(type)s, %(comment)s, %(date_create)s, %(date)s, %(number)s, %(services_count)s)]
[parameters: {'user_id': 20306226, 'salon_id': 16119243, 'storage_id': 0, 'category_id': 0, 'visit_id': 15083885, 'record_id': 20310452, 'type': 7, 'comment': '', 'date_create': datetime.datetime(2026, 9, 28, 22, 38, 53, 167080), 'date': '0000-00-00 00:00:00', 'number': 1, 'services_count': 1}]
(Background on this error at: http://sqlalche.me/e/e3q8)
Stacktrace:
lib/fixture/salon/__init__.py:196 in salon_with_entities
lib/preconditions/__init__.py:86 in create
data/db/orm/__init__.py:365 in add_entities
data/db/orm/__init__.py:74 in call_with_session
Seen in: - altegio/biz.erp#226698 — shard 1 — launch 169315 (×1, last 2026-09-28 22:50 MSK)
TimeoutError — 1 occurrence(s) across 1 pipeline(s)¶
TimeoutError: timed out
pymysql.err.OperationalError: (2013, 'Lost connection to MySQL server during query (timed out)')
sqlalchemy.exc.OperationalError: (pymysql.err.OperationalError) (2013, 'Lost connection to MySQL server during query (timed out)')
[SQL: INSERT INTO documents (user_id, salon_id, storage_id, category_id, visit_id, record_id, type, comment, date_create, date, number, services_count) VALUES (%(user_id)s, %(salon_id)s, %(storage_id)s, %(category_id)s, %(visit_id)s, %(record_id)s, %(type)s, %(comment)s, %(date_create)s, %(date)s, %(number)s, %(services_count)s)]
[parameters: {'user_id': 20306360, 'salon_id': 16119377, 'storage_id': 0, 'category_id': 0, 'visit_id': 15084066, 'record_id': 20310663, 'type': 7, 'comment': '', 'date_create': datetime.datetime(2026, 9, 28, 22, 40, 49, 827023), 'date': '0000-00-00 00:00:00', 'number': 1, 'services_count': 1}]
(Background on this error at: http://sqlalche.me/e/e3q8)
Stacktrace:
lib/fixture/salon/__init__.py:196 in salon_with_entities
lib/preconditions/__init__.py:86 in create
data/db/orm/__init__.py:365 in add_entities
data/db/orm/__init__.py:74 in call_with_session
Seen in: - altegio/biz.erp#226698 — shard 1 — launch 169315 (×1, last 2026-09-28 22:50 MSK)
TimeoutError — 1 occurrence(s) across 1 pipeline(s)¶
TimeoutError: timed out
pymysql.err.OperationalError: (2013, 'Lost connection to MySQL server during query (timed out)')
sqlalchemy.exc.OperationalError: (pymysql.err.OperationalError) (2013, 'Lost connection to MySQL server during query (timed out)')
[SQL: INSERT INTO documents (user_id, salon_id, storage_id, category_id, visit_id, record_id, type, comment, date_create, date, number, services_count) VALUES (%(user_id)s, %(salon_id)s, %(storage_id)s, %(category_id)s, %(visit_id)s, %(record_id)s, %(type)s, %(comment)s, %(date_create)s, %(date)s, %(number)s, %(services_count)s)]
[parameters: {'user_id': 20305843, 'salon_id': 16118869, 'storage_id': 0, 'category_id': 0, 'visit_id': 15083473, 'record_id': 20309972, 'type': 7, 'comment': '', 'date_create': datetime.datetime(2026, 9, 28, 22, 34, 12, 541413), 'date': '0000-00-00 00:00:00', 'number': 1, 'services_count': 1}]
(Background on this error at: http://sqlalche.me/e/e3q8)
Stacktrace:
lib/fixture/salon/__init__.py:196 in salon_with_entities
lib/preconditions/__init__.py:86 in create
data/db/orm/__init__.py:365 in add_entities
data/db/orm/__init__.py:74 in call_with_session
Seen in: - altegio/biz.erp#226698 — shard 2 — launch 169315 (×1, last 2026-09-28 22:50 MSK)
TimeoutError — 1 occurrence(s) across 1 pipeline(s)¶
TimeoutError: timed out
pymysql.err.OperationalError: (2013, 'Lost connection to MySQL server during query (timed out)')
sqlalchemy.exc.OperationalError: (pymysql.err.OperationalError) (2013, 'Lost connection to MySQL server during query (timed out)')
[SQL: INSERT INTO documents (user_id, salon_id, storage_id, category_id, visit_id, record_id, type, comment, date_create, date, number, services_count) VALUES (%(user_id)s, %(salon_id)s, %(storage_id)s, %(category_id)s, %(visit_id)s, %(record_id)s, %(type)s, %(comment)s, %(date_create)s, %(date)s, %(number)s, %(services_count)s)]
[parameters: {'user_id': 20305893, 'salon_id': 16118919, 'storage_id': 0, 'category_id': 0, 'visit_id': 15083519, 'record_id': 20310021, 'type': 7, 'comment': '', 'date_create': datetime.datetime(2026, 9, 28, 22, 34, 40, 304173), 'date': '0000-00-00 00:00:00', 'number': 1, 'services_count': 1}]
(Background on this error at: http://sqlalche.me/e/e3q8)
Stacktrace:
lib/fixture/salon/__init__.py:196 in salon_with_entities
lib/preconditions/__init__.py:86 in create
data/db/orm/__init__.py:365 in add_entities
data/db/orm/__init__.py:74 in call_with_session
Seen in: - altegio/biz.erp#226698 — shard 2 — launch 169315 (×1, last 2026-09-28 22:50 MSK)
TimeoutError — 1 occurrence(s) across 1 pipeline(s)¶
TimeoutError: timed out
pymysql.err.OperationalError: (2013, 'Lost connection to MySQL server during query (timed out)')
sqlalchemy.exc.OperationalError: (pymysql.err.OperationalError) (2013, 'Lost connection to MySQL server during query (timed out)')
[SQL: INSERT INTO documents (user_id, salon_id, storage_id, category_id, visit_id, record_id, type, comment, date_create, date, number, services_count) VALUES (%(user_id)s, %(salon_id)s, %(storage_id)s, %(category_id)s, %(visit_id)s, %(record_id)s, %(type)s, %(comment)s, %(date_create)s, %(date)s, %(number)s, %(services_count)s)]
[parameters: {'user_id': 20306313, 'salon_id': 16119331, 'storage_id': 0, 'category_id': 0, 'visit_id': 15084015, 'record_id': 20310601, 'type': 7, 'comment': '', 'date_create': datetime.datetime(2026, 9, 28, 22, 40, 12, 821621), 'date': '0000-00-00 00:00:00', 'number': 1, 'services_count': 1}]
(Background on this error at: http://sqlalche.me/e/e3q8)
Stacktrace:
lib/fixture/salon/__init__.py:196 in salon_with_entities
lib/preconditions/__init__.py:86 in create
data/db/orm/__init__.py:365 in add_entities
data/db/orm/__init__.py:74 in call_with_session
Seen in: - altegio/biz.erp#226698 — shard 2 — launch 169315 (×1, last 2026-09-28 22:50 MSK)
TimeoutError — 1 occurrence(s) across 1 pipeline(s)¶
TimeoutError: timed out
pymysql.err.OperationalError: (2013, 'Lost connection to MySQL server during query (timed out)')
sqlalchemy.exc.OperationalError: (pymysql.err.OperationalError) (2013, 'Lost connection to MySQL server during query (timed out)')
[SQL: INSERT INTO documents (user_id, salon_id, storage_id, category_id, visit_id, record_id, type, comment, date_create, date, number, services_count) VALUES (%(user_id)s, %(salon_id)s, %(storage_id)s, %(category_id)s, %(visit_id)s, %(record_id)s, %(type)s, %(comment)s, %(date_create)s, %(date)s, %(number)s, %(services_count)s)]
[parameters: {'user_id': 20306376, 'salon_id': 16119394, 'storage_id': 0, 'category_id': 0, 'visit_id': 15084084, 'record_id': 20310688, 'type': 7, 'comment': '', 'date_create': datetime.datetime(2026, 9, 28, 22, 41, 2, 774274), 'date': '0000-00-00 00:00:00', 'number': 1, 'services_count': 1}]
(Background on this error at: http://sqlalche.me/e/e3q8)
Stacktrace:
lib/fixture/salon/__init__.py:196 in salon_with_entities
lib/preconditions/__init__.py:86 in create
data/db/orm/__init__.py:365 in add_entities
data/db/orm/__init__.py:74 in call_with_session
Seen in: - altegio/biz.erp#226698 — shard 2 — launch 169315 (×1, last 2026-09-28 22:50 MSK)
TimeoutError — 1 occurrence(s) across 1 pipeline(s)¶
TimeoutError: timed out
pymysql.err.OperationalError: (2013, 'Lost connection to MySQL server during query (timed out)')
sqlalchemy.exc.OperationalError: (pymysql.err.OperationalError) (2013, 'Lost connection to MySQL server during query (timed out)')
[SQL: INSERT INTO documents (user_id, salon_id, storage_id, category_id, visit_id, record_id, type, comment, date_create, date, number, services_count) VALUES (%(user_id)s, %(salon_id)s, %(storage_id)s, %(category_id)s, %(visit_id)s, %(record_id)s, %(type)s, %(comment)s, %(date_create)s, %(date)s, %(number)s, %(services_count)s)]
[parameters: {'user_id': 20305521, 'salon_id': 16118536, 'storage_id': 0, 'category_id': 0, 'visit_id': 15083247, 'record_id': 20309713, 'type': 7, 'comment': '', 'date_create': datetime.datetime(2026, 9, 28, 22, 31, 55, 1147), 'date': '0000-00-00 00:00:00', 'number': 1, 'services_count': 1}]
(Background on this error at: http://sqlalche.me/e/e3q8)
Stacktrace:
lib/fixture/salon/__init__.py:196 in salon_with_entities
lib/preconditions/__init__.py:86 in create
data/db/orm/__init__.py:365 in add_entities
data/db/orm/__init__.py:74 in call_with_session
Seen in: - altegio/biz.erp#226698 — shard 6 — launch 169315 (×1, last 2026-09-28 22:50 MSK)
TimeoutError — 1 occurrence(s) across 1 pipeline(s)¶
TimeoutError: timed out
pymysql.err.OperationalError: (2013, 'Lost connection to MySQL server during query (timed out)')
sqlalchemy.exc.OperationalError: (pymysql.err.OperationalError) (2013, 'Lost connection to MySQL server during query (timed out)')
[SQL: INSERT INTO documents (user_id, salon_id, storage_id, category_id, visit_id, record_id, type, comment, date_create, date, number, services_count) VALUES (%(user_id)s, %(salon_id)s, %(storage_id)s, %(category_id)s, %(visit_id)s, %(record_id)s, %(type)s, %(comment)s, %(date_create)s, %(date)s, %(number)s, %(services_count)s)]
[parameters: {'user_id': 20305677, 'salon_id': 16118699, 'storage_id': 0, 'category_id': 0, 'visit_id': 15083325, 'record_id': 20309807, 'type': 7, 'comment': '', 'date_create': datetime.datetime(2026, 9, 28, 22, 32, 56, 730602), 'date': '0000-00-00 00:00:00', 'number': 1, 'services_count': 1}]
(Background on this error at: http://sqlalche.me/e/e3q8)
Stacktrace:
lib/fixture/salon/__init__.py:196 in salon_with_entities
lib/preconditions/__init__.py:86 in create
data/db/orm/__init__.py:365 in add_entities
data/db/orm/__init__.py:74 in call_with_session
Seen in: - altegio/biz.erp#226698 — shard 6 — launch 169315 (×1, last 2026-09-28 22:50 MSK)
TimeoutError — 1 occurrence(s) across 1 pipeline(s)¶
TimeoutError: timed out
pymysql.err.OperationalError: (2013, 'Lost connection to MySQL server during query (timed out)')
sqlalchemy.exc.OperationalError: (pymysql.err.OperationalError) (2013, 'Lost connection to MySQL server during query (timed out)')
[SQL: INSERT INTO documents (user_id, salon_id, storage_id, category_id, visit_id, record_id, type, comment, date_create, date, number, services_count) VALUES (%(user_id)s, %(salon_id)s, %(storage_id)s, %(category_id)s, %(visit_id)s, %(record_id)s, %(type)s, %(comment)s, %(date_create)s, %(date)s, %(number)s, %(services_count)s)]
[parameters: {'user_id': 20306236, 'salon_id': 16119255, 'storage_id': 0, 'category_id': 0, 'visit_id': 15083895, 'record_id': 20310471, 'type': 7, 'comment': '', 'date_create': datetime.datetime(2026, 9, 28, 22, 39, 3, 793817), 'date': '0000-00-00 00:00:00', 'number': 1, 'services_count': 1}]
(Background on this error at: http://sqlalche.me/e/e3q8)
Stacktrace:
lib/fixture/salon/__init__.py:196 in salon_with_entities
lib/preconditions/__init__.py:86 in create
data/db/orm/__init__.py:365 in add_entities
data/db/orm/__init__.py:74 in call_with_session
Seen in: - altegio/biz.erp#226698 — shard 6 — launch 169315 (×1, last 2026-09-28 22:50 MSK)
TimeoutError — 1 occurrence(s) across 1 pipeline(s)¶
TimeoutError: timed out
pymysql.err.OperationalError: (2013, 'Lost connection to MySQL server during query (timed out)')
sqlalchemy.exc.OperationalError: (pymysql.err.OperationalError) (2013, 'Lost connection to MySQL server during query (timed out)')
[SQL: INSERT INTO documents (user_id, salon_id, storage_id, category_id, visit_id, record_id, type, comment, date_create, date, number, services_count) VALUES (%(user_id)s, %(salon_id)s, %(storage_id)s, %(category_id)s, %(visit_id)s, %(record_id)s, %(type)s, %(comment)s, %(date_create)s, %(date)s, %(number)s, %(services_count)s)]
[parameters: {'user_id': 20306436, 'salon_id': 16119452, 'storage_id': 0, 'category_id': 0, 'visit_id': 15084171, 'record_id': 20310787, 'type': 7, 'comment': '', 'date_create': datetime.datetime(2026, 9, 28, 22, 41, 48, 807812), 'date': '0000-00-00 00:00:00', 'number': 1, 'services_count': 1}]
(Background on this error at: http://sqlalche.me/e/e3q8)
Stacktrace:
lib/fixture/salon/__init__.py:196 in salon_with_entities
lib/preconditions/__init__.py:86 in create
data/db/orm/__init__.py:365 in add_entities
data/db/orm/__init__.py:74 in call_with_session
Seen in: - altegio/biz.erp#226698 — shard 6 — launch 169315 (×1, last 2026-09-28 22:50 MSK)
TimeoutError — 1 occurrence(s) across 1 pipeline(s)¶
playwright._impl._errors.TimeoutError: Locator.click: Timeout 30000ms exceeded.
Call log:
- waiting for locator("div#calendar-block").locator("td[data-handler=\"selectDay\"]:not([class*=\"ui-datepicker-other-month\"])").filter(has=locator("[class*=\"ui-datepicker-day-text\"]").filter(has_text=re.compile(r"^\s*1\s*$"))).first.locator("a")
- locator resolved to <a href="#" class="ui-state-default ui-state-highlight ui-state-active">…</a>
- attempting click action
2 × waiting for element to be visible, enabled and stable
- element is visible, enabled and stable
- scrolling into view if needed
- done scrolling
- <a target="_self" class="yc-link yc-link_light" href="https://erp-testops-dev.infra.altegio.cloud/timetable/16356707/#mode=1">Reload this Page</a> from <div class="v-error-modal v-error-modal--unauthorized v-error-modal__fade-enter-active v-error-modal__fade-enter-to">…</div> subtree intercepts pointer events
- retrying click action
- waiting 20ms
- waiting for element to be visible, enabled and stable
- element is visible, enabled and stable
- scrolling into view if needed
- done scrolling
- <a target="_self" class="yc-link yc-link_light" href="https://erp-testops-dev.infra.altegio.cloud/timetable/16356707/#mode=1">Reload this Page</a> from <div class="v-error-modal v-error-modal--unauthorized v-error-modal__fade-enter-active v-error-modal__fade-enter-to">…</div> subtree intercepts pointer events
2 × retrying click action
- waiting 100ms
- waiting for element to be visible, enabled and stable
- element is visible, enabled and stable
- scrolling into view if needed
- done scrolling
- <div class="v-error-modal v-error-modal--unauthorized">…</div> intercepts pointer events
13 × retrying click action
- waiting 500ms
- waiting for element to be visible, enabled and stable
- element is visible, enabled and stable
- scrolling into view if needed
- done scrolling
- <a target="_self" class="yc-link yc-link_light" href="https://erp-testops-dev.infra.altegio.cloud/timetable/16356707/#mode=1">Reload this Page</a> from <div class="v-error-modal v-error-modal--unauthorized">…</div> subtree intercepts pointer events
- retrying click action
- waiting 500ms
- waiting for element to be visible, enabled and stable
- element is visible, enabled and stable
- scrolling into view if needed
- done scrolling
- <a target="_self" class="yc-link yc-link_light" href="https://erp-testops-dev.infra.altegio.cloud/timetable/16356707/#mode=1">Reload this Page</a> from <div class="v-error-modal v-error-modal--unauthorized">…</div> subtree intercepts pointer events
- retrying click action
- waiting 500ms
- waiting for element to be visible, enabled and stable
- element is visible, enabled and stable
- scrolling into view if needed
- done scrolling
- <div class="v-error-modal v-error-modal--unauthorized">…</div> intercepts pointer events
- retrying click action
- waiting 500ms
- waiting for element to be visible, enabled and stable
- element is visible, enabled and stable
- scrolling into view if needed
- done scrolling
- <div class="v-error-modal v-error-modal--unauthorized">…</div> intercepts pointer events
2 × retrying click action
- waiting 500ms
- waiting for element to be visible, enabled and stable
- element is visible, enabled and stable
- scrolling into view if needed
- done scrolling
- <a target="_self" class="yc-link yc-link_light" href="https://erp-testops-dev.infra.altegio.cloud/timetable/16356707/#mode=1">Reload this Page</a> from <div class="v-error-modal v-error-modal--unauthorized">…</div> subtree intercepts pointer events
- retrying click action
- waiting 500ms
- waiting for element to be visible, enabled and st... [truncated]
Stacktrace:
suite/yclients/biz/erp/web/records/test_create_and_move_record_pw.py:527 in test_display_information_in_panel_record
lib/apps_pw/yclients/biz/erp/web/pages/__init__.py:77 in decorated
lib/apps_pw/yclients/biz/erp/web/pages/user.py:497 in open_timetable
lib/apps_pw/yclients/biz/erp/web/pages/user.py:635 in _set_calendar_date
lib/apps_pw/yclients/biz/erp/web/pages/user.py:621 in _navigate_and_click
Seen in: - altegio/biz.erp#227596 — shard 8 — launch 171280 (×1, last 2026-10-01 17:40 MSK)
TimeoutError — 1 occurrence(s) across 1 pipeline(s)¶
playwright._impl._errors.TimeoutError: Locator.click: Timeout 30000ms exceeded.
Call log:
- waiting for locator("div#calendar-block").locator("td[data-handler=\"selectDay\"]:not([class*=\"ui-datepicker-other-month\"])").filter(has=locator("[class*=\"ui-datepicker-day-text\"]").filter(has_text=re.compile(r"^\s*2\s*$"))).first.locator("a")
- locator resolved to <a href="#" class="ui-state-default ui-state-highlight ui-state-active">…</a>
- attempting click action
2 × waiting for element to be visible, enabled and stable
- element is visible, enabled and stable
- scrolling into view if needed
- done scrolling
- <a target="_self" class="yc-link yc-link_light" href="https://erp-testops-dev.infra.altegio.cloud/timetable/16358837/#mode=1">Reload this Page</a> from <div class="v-error-modal v-error-modal--unauthorized v-error-modal__fade-enter-active v-error-modal__fade-enter-to">…</div> subtree intercepts pointer events
- retrying click action
- waiting 20ms
- waiting for element to be visible, enabled and stable
- element is visible, enabled and stable
- scrolling into view if needed
- done scrolling
- <a target="_self" class="yc-link yc-link_light" href="https://erp-testops-dev.infra.altegio.cloud/timetable/16358837/#mode=1">Reload this Page</a> from <div class="v-error-modal v-error-modal--unauthorized v-error-modal__fade-enter-active v-error-modal__fade-enter-to">…</div> subtree intercepts pointer events
2 × retrying click action
- waiting 100ms
- waiting for element to be visible, enabled and stable
- element is visible, enabled and stable
- scrolling into view if needed
- done scrolling
- <div class="v-error-modal v-error-modal--unauthorized">…</div> intercepts pointer events
13 × retrying click action
- waiting 500ms
- waiting for element to be visible, enabled and stable
- element is visible, enabled and stable
- scrolling into view if needed
- done scrolling
- <a target="_self" class="yc-link yc-link_light" href="https://erp-testops-dev.infra.altegio.cloud/timetable/16358837/#mode=1">Reload this Page</a> from <div class="v-error-modal v-error-modal--unauthorized">…</div> subtree intercepts pointer events
- retrying click action
- waiting 500ms
- waiting for element to be visible, enabled and stable
- element is visible, enabled and stable
- scrolling into view if needed
- done scrolling
- <a target="_self" class="yc-link yc-link_light" href="https://erp-testops-dev.infra.altegio.cloud/timetable/16358837/#mode=1">Reload this Page</a> from <div class="v-error-modal v-error-modal--unauthorized">…</div> subtree intercepts pointer events
- retrying click action
- waiting 500ms
- waiting for element to be visible, enabled and stable
- element is visible, enabled and stable
- scrolling into view if needed
- done scrolling
- <div class="v-error-modal v-error-modal--unauthorized">…</div> intercepts pointer events
- retrying click action
- waiting 500ms
- waiting for element to be visible, enabled and stable
- element is visible, enabled and stable
- scrolling into view if needed
- done scrolling
- <div class="v-error-modal v-error-modal--unauthorized">…</div> intercepts pointer events
2 × retrying click action
- waiting 500ms
- waiting for element to be visible, enabled and stable
- element is visible, enabled and stable
- scrolling into view if needed
- done scrolling
- <a target="_self" class="yc-link yc-link_light" href="https://erp-testops-dev.infra.altegio.cloud/timetable/16358837/#mode=1">Reload this Page</a> from <div class="v-error-modal v-error-modal--unauthorized">…</div> subtree intercepts pointer events
- retrying click action
- waiting 500ms
- waiting for element to be visible, enabled and st... [truncated]
Stacktrace:
suite/yclients/biz/erp/web/records/test_create_and_move_record_pw.py:527 in test_display_information_in_panel_record
lib/apps_pw/yclients/biz/erp/web/pages/__init__.py:77 in decorated
lib/apps_pw/yclients/biz/erp/web/pages/user.py:497 in open_timetable
lib/apps_pw/yclients/biz/erp/web/pages/user.py:635 in _set_calendar_date
lib/apps_pw/yclients/biz/erp/web/pages/user.py:621 in _navigate_and_click
Seen in: - altegio/biz.erp#227722 — shard 3 — launch 171516 (×1, last 2026-10-02 04:26 MSK)
TimeoutError — 1 occurrence(s) across 1 pipeline(s)¶
playwright._impl._errors.TimeoutError: Locator.click: Timeout 30000ms exceeded.
Call log:
- waiting for locator("div#calendar-block").locator("td[data-handler=\"selectDay\"]:not([class*=\"ui-datepicker-other-month\"])").filter(has=locator("[class*=\"ui-datepicker-day-text\"]").filter(has_text=re.compile(r"^\s*2\s*$"))).first.locator("a")
- locator resolved to <a href="#" class="ui-state-default ui-state-highlight ui-state-active ui-state-hover">…</a>
- attempting click action
2 × waiting for element to be visible, enabled and stable
- element is visible, enabled and stable
- scrolling into view if needed
- done scrolling
- <a target="_self" class="yc-link yc-link_light" href="https://erp-testops-dev.infra.altegio.cloud/timetable/16357891/#mode=1&main_date=2026-10-02">Reload this Page</a> from <div class="v-error-modal v-error-modal--unauthorized v-error-modal__fade-enter-active v-error-modal__fade-enter-to">…</div> subtree intercepts pointer events
- retrying click action
- waiting 20ms
- waiting for element to be visible, enabled and stable
- element is visible, enabled and stable
- scrolling into view if needed
- done scrolling
- <a target="_self" class="yc-link yc-link_light" href="https://erp-testops-dev.infra.altegio.cloud/timetable/16357891/#mode=1&main_date=2026-10-02">Reload this Page</a> from <div class="v-error-modal v-error-modal--unauthorized v-error-modal__fade-enter-active v-error-modal__fade-enter-to">…</div> subtree intercepts pointer events
- retrying click action
- waiting 100ms
- waiting for element to be visible, enabled and stable
- element is visible, enabled and stable
- scrolling into view if needed
- done scrolling
- <div class="v-error-modal v-error-modal--unauthorized v-error-modal__fade-enter-active v-error-modal__fade-enter-to">…</div> intercepts pointer events
- retrying click action
- waiting 100ms
14 × waiting for element to be visible, enabled and stable
- element is visible, enabled and stable
- scrolling into view if needed
- done scrolling
- <div class="v-error-modal v-error-modal--unauthorized">…</div> intercepts pointer events
- retrying click action
- waiting 500ms
- waiting for element to be visible, enabled and stable
- element is visible, enabled and stable
- scrolling into view if needed
- done scrolling
- <a target="_self" class="yc-link yc-link_light" href="https://erp-testops-dev.infra.altegio.cloud/timetable/16357891/#mode=1&main_date=2026-10-02">Reload this Page</a> from <div class="v-error-modal v-error-modal--unauthorized">…</div> subtree intercepts pointer events
- retrying click action
- waiting 500ms
- waiting for element to be visible, enabled and stable
- element is visible, enabled and stable
- scrolling into view if needed
- done scrolling
- <a target="_self" class="yc-link yc-link_light" href="https://erp-testops-dev.infra.altegio.cloud/timetable/16357891/#mode=1&main_date=2026-10-02">Reload this Page</a> from <div class="v-error-modal v-error-modal--unauthorized">…</div> subtree intercepts pointer events
- retrying click action
- waiting 500ms
- waiting for element to be visible, enabled and stable
- element is visible, enabled and stable
- scrolling into view if needed
- done scrolling
- <div class="v-error-modal v-error-modal--unauthorized">…</div> intercepts pointer events
- retrying click action
- waiting 500ms
- waiting for element to be visible, enabled and stable
- element is visible, enabled and stable
- scrolling into view if needed
- done scrolling
- <div class="v-error-modal v-error-modal--unauthorized">…</div> intercepts pointer events
- retrying click action
- waiting 500ms
- waiting for element to be visible, enabled and stable
- element is visib... [truncated]
Stacktrace:
suite/yclients/biz/erp/web/records/test_create_and_move_record_pw.py:527 in test_display_information_in_panel_record
lib/apps_pw/yclients/biz/erp/web/pages/__init__.py:77 in decorated
lib/apps_pw/yclients/biz/erp/web/pages/user.py:497 in open_timetable
lib/apps_pw/yclients/biz/erp/web/pages/user.py:635 in _set_calendar_date
lib/apps_pw/yclients/biz/erp/web/pages/user.py:621 in _navigate_and_click
Seen in: - altegio/biz.erp#227722 — shard 4 — launch 171516 (×1, last 2026-10-02 04:26 MSK)
TimeoutError — 1 occurrence(s) across 1 pipeline(s)¶
playwright._impl._errors.TimeoutError: Locator.click: Timeout 30000ms exceeded.
Call log:
- waiting for locator("div#calendar-block").locator("td[data-handler=\"selectDay\"]:not([class*=\"ui-datepicker-other-month\"])").filter(has=locator("[class*=\"ui-datepicker-day-text\"]").filter(has_text=re.compile(r"^\s*2\s*$"))).first.locator("a")
- locator resolved to <a href="#" class="ui-state-default ui-state-highlight ui-state-active">…</a>
- attempting click action
2 × waiting for element to be visible, enabled and stable
- element is visible, enabled and stable
- scrolling into view if needed
- done scrolling
- <a target="_self" class="yc-link yc-link_light" href="https://erp-testops-dev.infra.altegio.cloud/timetable/16359055/#mode=1">Reload this Page</a> from <div class="v-error-modal v-error-modal--unauthorized v-error-modal__fade-enter-active v-error-modal__fade-enter-to">…</div> subtree intercepts pointer events
- retrying click action
- waiting 20ms
- waiting for element to be visible, enabled and stable
- element is visible, enabled and stable
- scrolling into view if needed
- done scrolling
- <a target="_self" class="yc-link yc-link_light" href="https://erp-testops-dev.infra.altegio.cloud/timetable/16359055/#mode=1">Reload this Page</a> from <div class="v-error-modal v-error-modal--unauthorized v-error-modal__fade-enter-active v-error-modal__fade-enter-to">…</div> subtree intercepts pointer events
2 × retrying click action
- waiting 100ms
- waiting for element to be visible, enabled and stable
- element is visible, enabled and stable
- scrolling into view if needed
- done scrolling
- <div class="v-error-modal v-error-modal--unauthorized">…</div> intercepts pointer events
13 × retrying click action
- waiting 500ms
- waiting for element to be visible, enabled and stable
- element is visible, enabled and stable
- scrolling into view if needed
- done scrolling
- <a target="_self" class="yc-link yc-link_light" href="https://erp-testops-dev.infra.altegio.cloud/timetable/16359055/#mode=1">Reload this Page</a> from <div class="v-error-modal v-error-modal--unauthorized">…</div> subtree intercepts pointer events
- retrying click action
- waiting 500ms
- waiting for element to be visible, enabled and stable
- element is visible, enabled and stable
- scrolling into view if needed
- done scrolling
- <a target="_self" class="yc-link yc-link_light" href="https://erp-testops-dev.infra.altegio.cloud/timetable/16359055/#mode=1">Reload this Page</a> from <div class="v-error-modal v-error-modal--unauthorized">…</div> subtree intercepts pointer events
- retrying click action
- waiting 500ms
- waiting for element to be visible, enabled and stable
- element is visible, enabled and stable
- scrolling into view if needed
- done scrolling
- <div class="v-error-modal v-error-modal--unauthorized">…</div> intercepts pointer events
- retrying click action
- waiting 500ms
- waiting for element to be visible, enabled and stable
- element is visible, enabled and stable
- scrolling into view if needed
- done scrolling
- <div class="v-error-modal v-error-modal--unauthorized">…</div> intercepts pointer events
2 × retrying click action
- waiting 500ms
- waiting for element to be visible, enabled and stable
- element is visible, enabled and stable
- scrolling into view if needed
- done scrolling
- <a target="_self" class="yc-link yc-link_light" href="https://erp-testops-dev.infra.altegio.cloud/timetable/16359055/#mode=1">Reload this Page</a> from <div class="v-error-modal v-error-modal--unauthorized">…</div> subtree intercepts pointer events
- retrying click action
- waiting 500ms
- waiting for element to be visible, enabled and st... [truncated]
Stacktrace:
suite/yclients/biz/erp/web/records/test_create_and_move_record_pw.py:527 in test_display_information_in_panel_record
lib/apps_pw/yclients/biz/erp/web/pages/__init__.py:77 in decorated
lib/apps_pw/yclients/biz/erp/web/pages/user.py:497 in open_timetable
lib/apps_pw/yclients/biz/erp/web/pages/user.py:635 in _set_calendar_date
lib/apps_pw/yclients/biz/erp/web/pages/user.py:621 in _navigate_and_click
Seen in: - altegio/biz.erp#227722 — shard 4 — launch 171516 (×1, last 2026-10-02 04:26 MSK)
TimeoutError — 1 occurrence(s) across 1 pipeline(s)¶
playwright._impl._errors.TimeoutError: Locator.click: Timeout 30000ms exceeded.
Call log:
- waiting for locator("div#calendar-block").locator("td[data-handler=\"selectDay\"]:not([class*=\"ui-datepicker-other-month\"])").filter(has=locator("[class*=\"ui-datepicker-day-text\"]").filter(has_text=re.compile(r"^\s*2\s*$"))).first.locator("a")
- locator resolved to <a href="#" class="ui-state-default ui-state-highlight ui-state-active ui-state-hover">…</a>
- attempting click action
2 × waiting for element to be visible, enabled and stable
- element is visible, enabled and stable
- scrolling into view if needed
- done scrolling
- <a target="_self" class="yc-link yc-link_light" href="https://erp-testops-dev.infra.altegio.cloud/timetable/16358387/#mode=1&main_date=2026-10-02">Reload this Page</a> from <div class="v-error-modal v-error-modal--unauthorized v-error-modal__fade-enter-active v-error-modal__fade-enter-to">…</div> subtree intercepts pointer events
- retrying click action
- waiting 20ms
- waiting for element to be visible, enabled and stable
- element is visible, enabled and stable
- scrolling into view if needed
- done scrolling
- <a target="_self" class="yc-link yc-link_light" href="https://erp-testops-dev.infra.altegio.cloud/timetable/16358387/#mode=1&main_date=2026-10-02">Reload this Page</a> from <div class="v-error-modal v-error-modal--unauthorized v-error-modal__fade-enter-active v-error-modal__fade-enter-to">…</div> subtree intercepts pointer events
2 × retrying click action
- waiting 100ms
- waiting for element to be visible, enabled and stable
- element is visible, enabled and stable
- scrolling into view if needed
- done scrolling
- <div class="v-error-modal v-error-modal--unauthorized">…</div> intercepts pointer events
14 × retrying click action
- waiting 500ms
- waiting for element to be visible, enabled and stable
- element is visible, enabled and stable
- scrolling into view if needed
- done scrolling
- <a target="_self" class="yc-link yc-link_light" href="https://erp-testops-dev.infra.altegio.cloud/timetable/16358387/#mode=1&main_date=2026-10-02">Reload this Page</a> from <div class="v-error-modal v-error-modal--unauthorized">…</div> subtree intercepts pointer events
- retrying click action
- waiting 500ms
- waiting for element to be visible, enabled and stable
- element is visible, enabled and stable
- scrolling into view if needed
- done scrolling
- <a target="_self" class="yc-link yc-link_light" href="https://erp-testops-dev.infra.altegio.cloud/timetable/16358387/#mode=1&main_date=2026-10-02">Reload this Page</a> from <div class="v-error-modal v-error-modal--unauthorized">…</div> subtree intercepts pointer events
- retrying click action
- waiting 500ms
- waiting for element to be visible, enabled and stable
- element is visible, enabled and stable
- scrolling into view if needed
- done scrolling
- <div class="v-error-modal v-error-modal--unauthorized">…</div> intercepts pointer events
- retrying click action
- waiting 500ms
- waiting for element to be visible, enabled and stable
- element is visible, enabled and stable
- scrolling into view if needed
- done scrolling
- <div class="v-error-modal v-error-modal--unauthorized">…</div> intercepts pointer events
- retrying click action
- waiting 500ms
- waiting for element to be visible, enabled and stable
- element is visible, enabled and stable
- scrolling into view if needed
- done scrolling
- <a target="_self" class="yc-link yc-link_light" href="https://erp-testops-dev.infra.altegio.cloud/timetable/16358387/#mode=1&main_date=2026-10-02">Reload this Page</a> from <div class="v-error-modal v-error-modal--unauthorized">…</div> subtree intercepts pointer ev... [truncated]
Stacktrace:
suite/yclients/biz/erp/web/records/test_create_and_move_record_pw.py:527 in test_display_information_in_panel_record
lib/apps_pw/yclients/biz/erp/web/pages/__init__.py:77 in decorated
lib/apps_pw/yclients/biz/erp/web/pages/user.py:497 in open_timetable
lib/apps_pw/yclients/biz/erp/web/pages/user.py:635 in _set_calendar_date
lib/apps_pw/yclients/biz/erp/web/pages/user.py:621 in _navigate_and_click
Seen in: - altegio/biz.erp#227722 — shard 8 — launch 171516 (×1, last 2026-10-02 04:26 MSK)
TimeoutError — 1 occurrence(s) across 1 pipeline(s)¶
playwright._impl._errors.TimeoutError: Locator.click: Timeout 30000ms exceeded.
Call log:
- waiting for locator("div#calendar-block").locator("td[data-handler=\"selectDay\"]:not([class*=\"ui-datepicker-other-month\"])").filter(has=locator("[class*=\"ui-datepicker-day-text\"]").filter(has_text=re.compile(r"^\s*2\s*$"))).first.locator("a")
- locator resolved to <a href="#" class="ui-state-default ui-state-highlight ui-state-active">…</a>
- attempting click action
2 × waiting for element to be visible, enabled and stable
- element is visible, enabled and stable
- scrolling into view if needed
- done scrolling
- <a target="_self" class="yc-link yc-link_light" href="https://erp-testops-dev.infra.altegio.cloud/timetable/16363096/#mode=1">Reload this Page</a> from <div class="v-error-modal v-error-modal--unauthorized v-error-modal__fade-enter-active v-error-modal__fade-enter-to">…</div> subtree intercepts pointer events
- retrying click action
- waiting 20ms
- waiting for element to be visible, enabled and stable
- element is visible, enabled and stable
- scrolling into view if needed
- done scrolling
- <a target="_self" class="yc-link yc-link_light" href="https://erp-testops-dev.infra.altegio.cloud/timetable/16363096/#mode=1">Reload this Page</a> from <div class="v-error-modal v-error-modal--unauthorized v-error-modal__fade-enter-active v-error-modal__fade-enter-to">…</div> subtree intercepts pointer events
2 × retrying click action
- waiting 100ms
- waiting for element to be visible, enabled and stable
- element is visible, enabled and stable
- scrolling into view if needed
- done scrolling
- <div class="v-error-modal v-error-modal--unauthorized">…</div> intercepts pointer events
13 × retrying click action
- waiting 500ms
- waiting for element to be visible, enabled and stable
- element is visible, enabled and stable
- scrolling into view if needed
- done scrolling
- <a target="_self" class="yc-link yc-link_light" href="https://erp-testops-dev.infra.altegio.cloud/timetable/16363096/#mode=1">Reload this Page</a> from <div class="v-error-modal v-error-modal--unauthorized">…</div> subtree intercepts pointer events
- retrying click action
- waiting 500ms
- waiting for element to be visible, enabled and stable
- element is visible, enabled and stable
- scrolling into view if needed
- done scrolling
- <a target="_self" class="yc-link yc-link_light" href="https://erp-testops-dev.infra.altegio.cloud/timetable/16363096/#mode=1">Reload this Page</a> from <div class="v-error-modal v-error-modal--unauthorized">…</div> subtree intercepts pointer events
- retrying click action
- waiting 500ms
- waiting for element to be visible, enabled and stable
- element is visible, enabled and stable
- scrolling into view if needed
- done scrolling
- <div class="v-error-modal v-error-modal--unauthorized">…</div> intercepts pointer events
- retrying click action
- waiting 500ms
- waiting for element to be visible, enabled and stable
- element is visible, enabled and stable
- scrolling into view if needed
- done scrolling
- <div class="v-error-modal v-error-modal--unauthorized">…</div> intercepts pointer events
2 × retrying click action
- waiting 500ms
- waiting for element to be visible, enabled and stable
- element is visible, enabled and stable
- scrolling into view if needed
- done scrolling
- <a target="_self" class="yc-link yc-link_light" href="https://erp-testops-dev.infra.altegio.cloud/timetable/16363096/#mode=1">Reload this Page</a> from <div class="v-error-modal v-error-modal--unauthorized">…</div> subtree intercepts pointer events
- retrying click action
- waiting 500ms
- waiting for element to be visible, enabled and st... [truncated]
Stacktrace:
suite/yclients/biz/erp/web/records/test_create_and_move_record_pw.py:527 in test_display_information_in_panel_record
lib/apps_pw/yclients/biz/erp/web/pages/__init__.py:77 in decorated
lib/apps_pw/yclients/biz/erp/web/pages/user.py:497 in open_timetable
lib/apps_pw/yclients/biz/erp/web/pages/user.py:635 in _set_calendar_date
lib/apps_pw/yclients/biz/erp/web/pages/user.py:621 in _navigate_and_click
Seen in: - altegio/biz.erp#227735 — shard 4 — launch 171549 (×1, last 2026-10-02 06:23 MSK)
TimeoutError — 1 occurrence(s) across 1 pipeline(s)¶
playwright._impl._errors.TimeoutError: Locator.click: Timeout 30000ms exceeded.
Call log:
- waiting for locator("div#calendar-block").locator("td[data-handler=\"selectDay\"]:not([class*=\"ui-datepicker-other-month\"])").filter(has=locator("[class*=\"ui-datepicker-day-text\"]").filter(has_text=re.compile(r"^\s*2\s*$"))).first.locator("a")
- locator resolved to <a href="#" class="ui-state-default ui-state-highlight ui-state-active">…</a>
- attempting click action
2 × waiting for element to be visible, enabled and stable
- element is visible, enabled and stable
- scrolling into view if needed
- done scrolling
- <a target="_self" class="yc-link yc-link_light" href="https://erp-testops-dev.infra.altegio.cloud/timetable/16362200/#mode=1">Reload this Page</a> from <div class="v-error-modal v-error-modal--unauthorized v-error-modal__fade-enter-active v-error-modal__fade-enter-to">…</div> subtree intercepts pointer events
- retrying click action
- waiting 20ms
- waiting for element to be visible, enabled and stable
- element is visible, enabled and stable
- scrolling into view if needed
- done scrolling
- <a target="_self" class="yc-link yc-link_light" href="https://erp-testops-dev.infra.altegio.cloud/timetable/16362200/#mode=1">Reload this Page</a> from <div class="v-error-modal v-error-modal--unauthorized v-error-modal__fade-enter-active v-error-modal__fade-enter-to">…</div> subtree intercepts pointer events
2 × retrying click action
- waiting 100ms
- waiting for element to be visible, enabled and stable
- element is visible, enabled and stable
- scrolling into view if needed
- done scrolling
- <div class="v-error-modal v-error-modal--unauthorized">…</div> intercepts pointer events
13 × retrying click action
- waiting 500ms
- waiting for element to be visible, enabled and stable
- element is visible, enabled and stable
- scrolling into view if needed
- done scrolling
- <a target="_self" class="yc-link yc-link_light" href="https://erp-testops-dev.infra.altegio.cloud/timetable/16362200/#mode=1">Reload this Page</a> from <div class="v-error-modal v-error-modal--unauthorized">…</div> subtree intercepts pointer events
- retrying click action
- waiting 500ms
- waiting for element to be visible, enabled and stable
- element is visible, enabled and stable
- scrolling into view if needed
- done scrolling
- <a target="_self" class="yc-link yc-link_light" href="https://erp-testops-dev.infra.altegio.cloud/timetable/16362200/#mode=1">Reload this Page</a> from <div class="v-error-modal v-error-modal--unauthorized">…</div> subtree intercepts pointer events
- retrying click action
- waiting 500ms
- waiting for element to be visible, enabled and stable
- element is visible, enabled and stable
- scrolling into view if needed
- done scrolling
- <div class="v-error-modal v-error-modal--unauthorized">…</div> intercepts pointer events
- retrying click action
- waiting 500ms
- waiting for element to be visible, enabled and stable
- element is visible, enabled and stable
- scrolling into view if needed
- done scrolling
- <div class="v-error-modal v-error-modal--unauthorized">…</div> intercepts pointer events
2 × retrying click action
- waiting 500ms
- waiting for element to be visible, enabled and stable
- element is visible, enabled and stable
- scrolling into view if needed
- done scrolling
- <a target="_self" class="yc-link yc-link_light" href="https://erp-testops-dev.infra.altegio.cloud/timetable/16362200/#mode=1">Reload this Page</a> from <div class="v-error-modal v-error-modal--unauthorized">…</div> subtree intercepts pointer events
- retrying click action
- waiting 500ms
- waiting for element to be visible, enabled and st... [truncated]
Stacktrace:
suite/yclients/biz/erp/web/records/test_create_and_move_record_pw.py:527 in test_display_information_in_panel_record
lib/apps_pw/yclients/biz/erp/web/pages/__init__.py:77 in decorated
lib/apps_pw/yclients/biz/erp/web/pages/user.py:497 in open_timetable
lib/apps_pw/yclients/biz/erp/web/pages/user.py:635 in _set_calendar_date
lib/apps_pw/yclients/biz/erp/web/pages/user.py:621 in _navigate_and_click
Seen in: - altegio/biz.erp#227735 — shard 6 — launch 171549 (×1, last 2026-10-02 06:23 MSK)
TimeoutError — 1 occurrence(s) across 1 pipeline(s)¶
playwright._impl._errors.TimeoutError: Locator.click: Timeout 30000ms exceeded.
Call log:
- waiting for locator("div#calendar-block").locator("td[data-handler=\"selectDay\"]:not([class*=\"ui-datepicker-other-month\"])").filter(has=locator("[class*=\"ui-datepicker-day-text\"]").filter(has_text=re.compile(r"^\s*2\s*$"))).first.locator("a")
- locator resolved to <a href="#" class="ui-state-default ui-state-highlight ui-state-active">…</a>
- attempting click action
2 × waiting for element to be visible, enabled and stable
- element is visible, enabled and stable
- scrolling into view if needed
- done scrolling
- <a target="_self" class="yc-link yc-link_light" href="https://erp-testops-dev.infra.altegio.cloud/timetable/16363603/#mode=1">Reload this Page</a> from <div class="v-error-modal v-error-modal--unauthorized">…</div> subtree intercepts pointer events
- retrying click action
- waiting 20ms
- waiting for element to be visible, enabled and stable
- element is visible, enabled and stable
- scrolling into view if needed
- done scrolling
- <a target="_self" class="yc-link yc-link_light" href="https://erp-testops-dev.infra.altegio.cloud/timetable/16363603/#mode=1">Reload this Page</a> from <div class="v-error-modal v-error-modal--unauthorized">…</div> subtree intercepts pointer events
2 × retrying click action
- waiting 100ms
- waiting for element to be visible, enabled and stable
- element is visible, enabled and stable
- scrolling into view if needed
- done scrolling
- <div class="v-error-modal v-error-modal--unauthorized">…</div> intercepts pointer events
13 × retrying click action
- waiting 500ms
- waiting for element to be visible, enabled and stable
- element is visible, enabled and stable
- scrolling into view if needed
- done scrolling
- <a target="_self" class="yc-link yc-link_light" href="https://erp-testops-dev.infra.altegio.cloud/timetable/16363603/#mode=1">Reload this Page</a> from <div class="v-error-modal v-error-modal--unauthorized">…</div> subtree intercepts pointer events
- retrying click action
- waiting 500ms
- waiting for element to be visible, enabled and stable
- element is visible, enabled and stable
- scrolling into view if needed
- done scrolling
- <a target="_self" class="yc-link yc-link_light" href="https://erp-testops-dev.infra.altegio.cloud/timetable/16363603/#mode=1">Reload this Page</a> from <div class="v-error-modal v-error-modal--unauthorized">…</div> subtree intercepts pointer events
- retrying click action
- waiting 500ms
- waiting for element to be visible, enabled and stable
- element is visible, enabled and stable
- scrolling into view if needed
- done scrolling
- <div class="v-error-modal v-error-modal--unauthorized">…</div> intercepts pointer events
- retrying click action
- waiting 500ms
- waiting for element to be visible, enabled and stable
- element is visible, enabled and stable
- scrolling into view if needed
- done scrolling
- <div class="v-error-modal v-error-modal--unauthorized">…</div> intercepts pointer events
2 × retrying click action
- waiting 500ms
- waiting for element to be visible, enabled and stable
- element is visible, enabled and stable
- scrolling into view if needed
- done scrolling
- <a target="_self" class="yc-link yc-link_light" href="https://erp-testops-dev.infra.altegio.cloud/timetable/16363603/#mode=1">Reload this Page</a> from <div class="v-error-modal v-error-modal--unauthorized">…</div> subtree intercepts pointer events
- retrying click action
- waiting 500ms
- waiting for element to be visible, enabled and stable
- element is visible, enabled and stable
- scrolling into view if needed
- done scrolling
- <div class=... [truncated]
Stacktrace:
suite/yclients/biz/erp/web/records/test_create_and_move_record_pw.py:527 in test_display_information_in_panel_record
lib/apps_pw/yclients/biz/erp/web/pages/__init__.py:77 in decorated
lib/apps_pw/yclients/biz/erp/web/pages/user.py:497 in open_timetable
lib/apps_pw/yclients/biz/erp/web/pages/user.py:635 in _set_calendar_date
lib/apps_pw/yclients/biz/erp/web/pages/user.py:621 in _navigate_and_click
Seen in: - altegio/biz.erp#227735 — shard 6 — launch 171549 (×1, last 2026-10-02 06:23 MSK)
TimeoutError — 1 occurrence(s) across 1 pipeline(s)¶
playwright._impl._errors.TimeoutError: Locator.click: Timeout 30000ms exceeded.
Call log:
- waiting for locator("div#calendar-block").locator("td[data-handler=\"selectDay\"]:not([class*=\"ui-datepicker-other-month\"])").filter(has=locator("[class*=\"ui-datepicker-day-text\"]").filter(has_text=re.compile(r"^\s*2\s*$"))).first.locator("a")
- locator resolved to <a href="#" class="ui-state-default ui-state-highlight ui-state-active">…</a>
- attempting click action
2 × waiting for element to be visible, enabled and stable
- element is visible, enabled and stable
- scrolling into view if needed
- done scrolling
- <a target="_self" class="yc-link yc-link_light" href="https://erp-testops-dev.infra.altegio.cloud/timetable/16365155/#mode=1">Reload this Page</a> from <div class="v-error-modal v-error-modal--unauthorized v-error-modal__fade-enter-active v-error-modal__fade-enter-to">…</div> subtree intercepts pointer events
- retrying click action
- waiting 20ms
- waiting for element to be visible, enabled and stable
- element is visible, enabled and stable
- scrolling into view if needed
- done scrolling
- <a target="_self" class="yc-link yc-link_light" href="https://erp-testops-dev.infra.altegio.cloud/timetable/16365155/#mode=1">Reload this Page</a> from <div class="v-error-modal v-error-modal--unauthorized v-error-modal__fade-enter-active v-error-modal__fade-enter-to">…</div> subtree intercepts pointer events
2 × retrying click action
- waiting 100ms
- waiting for element to be visible, enabled and stable
- element is visible, enabled and stable
- scrolling into view if needed
- done scrolling
- <div class="v-error-modal v-error-modal--unauthorized">…</div> intercepts pointer events
13 × retrying click action
- waiting 500ms
- waiting for element to be visible, enabled and stable
- element is visible, enabled and stable
- scrolling into view if needed
- done scrolling
- <a target="_self" class="yc-link yc-link_light" href="https://erp-testops-dev.infra.altegio.cloud/timetable/16365155/#mode=1">Reload this Page</a> from <div class="v-error-modal v-error-modal--unauthorized">…</div> subtree intercepts pointer events
- retrying click action
- waiting 500ms
- waiting for element to be visible, enabled and stable
- element is visible, enabled and stable
- scrolling into view if needed
- done scrolling
- <a target="_self" class="yc-link yc-link_light" href="https://erp-testops-dev.infra.altegio.cloud/timetable/16365155/#mode=1">Reload this Page</a> from <div class="v-error-modal v-error-modal--unauthorized">…</div> subtree intercepts pointer events
- retrying click action
- waiting 500ms
- waiting for element to be visible, enabled and stable
- element is visible, enabled and stable
- scrolling into view if needed
- done scrolling
- <div class="v-error-modal v-error-modal--unauthorized">…</div> intercepts pointer events
- retrying click action
- waiting 500ms
- waiting for element to be visible, enabled and stable
- element is visible, enabled and stable
- scrolling into view if needed
- done scrolling
- <div class="v-error-modal v-error-modal--unauthorized">…</div> intercepts pointer events
2 × retrying click action
- waiting 500ms
- waiting for element to be visible, enabled and stable
- element is visible, enabled and stable
- scrolling into view if needed
- done scrolling
- <a target="_self" class="yc-link yc-link_light" href="https://erp-testops-dev.infra.altegio.cloud/timetable/16365155/#mode=1">Reload this Page</a> from <div class="v-error-modal v-error-modal--unauthorized">…</div> subtree intercepts pointer events
- retrying click action
- waiting 500ms
- waiting for element to be visible, enabled and st... [truncated]
Stacktrace:
suite/yclients/biz/erp/web/records/test_create_and_move_record_pw.py:527 in test_display_information_in_panel_record
lib/apps_pw/yclients/biz/erp/web/pages/__init__.py:77 in decorated
lib/apps_pw/yclients/biz/erp/web/pages/user.py:497 in open_timetable
lib/apps_pw/yclients/biz/erp/web/pages/user.py:635 in _set_calendar_date
lib/apps_pw/yclients/biz/erp/web/pages/user.py:621 in _navigate_and_click
Seen in: - altegio/biz.erp#227735 — shard 6 — launch 171549 (×1, last 2026-10-02 06:23 MSK)