#24815 Скрытые поля на форме ввода данных¶
test_hide_fields_on_select_data_form
Failures in last 30 days: 15
Generated at 2026-10-08 03:35 MSK
Last failure: 2026-10-02 11:50 MSK
Filter: pipelines with sandbox_biz_erp ∈ {master, testops-dev} AND autotests_branch ∈ {master, main} only (testops-dev — daytime ticks since 2026-08-05).
By exception class:
- TimeoutException — 12
- WebDriverException — 3
Failure signatures (grouped by exception + full message):
TimeoutException — 1 occurrence(s) across 1 pipeline(s)¶
selenium.common.exceptions.TimeoutException: Message: Ожидаем элемент в DOM: "[data-locator="timeslot"]", параметры метода ожидания: ([
"css selector",
"None",
"[data-locator=\"timeslot\"]",
"<autotests.lib.apps.yclients.client.booking.web.pages.select_time.SelectTimePage object at 0x7f421dd318e0>"
]), условия ожидания: ([
"timeout: 25s"
])
Stacktrace:
#0 0x55a65e54e5e3 <unknown>
#1 0x55a65e2110b7 <unknown>
#2 0x55a65e25ef53 <unknown>
#3 0x55a65e25f051 <unknown>
#4 0x55a65e2a49c4 <unknown>
#5 0x55a65e285f1d <unknown>
#6 0x55a65e2a1b3d <unknown>
#7 0x55a65e285cc3 <unknown>
#8 0x55a65e2510e4 <unknown>
#9 0x55a65e2520ae <unknown>
#10 0x55a65e514ce1 <unknown>
#11 0x55a65e518b7e <unknown>
#12 0x55a65e5024b5 <unknown>
#13 0x55a65e5197d6 <unknown>
#14 0x55a65e4e5dbf <unknown>
#15 0x55a65e53c748 <unknown>
#16 0x55a65e53c917 <unknown>
#17 0x55a65e54d773 <unknown>
#18 0x7f6abe257aa4 <unknown>
#19 0x7f6abe2e4a64 __clone
Exception: There are no available spots for this day
Stacktrace:
suite/yclients/client/booking/web/online_booking/test_create_booking.py:1850 in test_hide_fields_on_select_data_form
lib/common/ui/pages/web.py:61 in decorated
lib/apps/yclients/client/booking/web/pages/select_time.py:302 in select_date_and_time
lib/common/ui/pages/web.py:61 in decorated
lib/apps/yclients/client/booking/web/pages/select_time.py:351 in select_time
Seen in: - altegio/biz.erp#225772 — shard 8 — launch 167723 (×1, last 2026-09-25 03:39 MSK)
TimeoutException — 1 occurrence(s) across 1 pipeline(s)¶
selenium.common.exceptions.TimeoutException: Message: Ожидаем элемент в DOM: "[data-locator="booking_date"]", параметры метода ожидания: ([
"css selector",
"None",
"[data-locator=\"booking_date\"]",
"<autotests.lib.apps.yclients.client.booking.web.pages.created_booking.CreatedBookingPage object at 0x7f2cced46d20>"
]), условия ожидания: ([
"timeout: 25s"
])
Stacktrace:
#0 0x55a36cc1a5e3 <unknown>
#1 0x55a36c8dd0b7 <unknown>
#2 0x55a36c92af53 <unknown>
#3 0x55a36c92b051 <unknown>
#4 0x55a36c9709c4 <unknown>
#5 0x55a36c951f1d <unknown>
#6 0x55a36c96db3d <unknown>
#7 0x55a36c951cc3 <unknown>
#8 0x55a36c91d0e4 <unknown>
#9 0x55a36c91e0ae <unknown>
#10 0x55a36cbe0ce1 <unknown>
#11 0x55a36cbe4b7e <unknown>
#12 0x55a36cbce4b5 <unknown>
#13 0x55a36cbe57d6 <unknown>
#14 0x55a36cbb1dbf <unknown>
#15 0x55a36cc08748 <unknown>
#16 0x55a36cc08917 <unknown>
#17 0x55a36cc19773 <unknown>
#18 0x7f3c565f8aa4 <unknown>
#19 0x7f3c56685a64 __clone
Stacktrace:
lib/common/ui/pages/web.py:61 in decorated
lib/apps/yclients/client/booking/web/pages/created_booking.py:81 in get_booking_time
lib/common/ui/pages/web.py:61 in decorated
lib/common/ui/pages/web.py:148 in wait_for_element
lib/ui/selenium/webdriver/support/wait.py:28 in until
Seen in: - altegio/biz.erp#227722 — shard 8 — launch 171516 (×1, last 2026-10-02 04:26 MSK)
TimeoutException — 1 occurrence(s) across 1 pipeline(s)¶
selenium.common.exceptions.TimeoutException: Message: Ожидаем элемент в DOM: "[data-locator="timeslot"]", параметры метода ожидания: ([
"css selector",
"None",
"[data-locator=\"timeslot\"]",
"<autotests.lib.apps.yclients.client.booking.web.pages.select_time.SelectTimePage object at 0x7f6c9a9ab0b0>"
]), условия ожидания: ([
"timeout: 25s"
])
Stacktrace:
#0 0x563c541e05e3 <unknown>
#1 0x563c53ea30b7 <unknown>
#2 0x563c53ef0f53 <unknown>
#3 0x563c53ef1051 <unknown>
#4 0x563c53f369c4 <unknown>
#5 0x563c53f17f1d <unknown>
#6 0x563c53f33b3d <unknown>
#7 0x563c53f17cc3 <unknown>
#8 0x563c53ee30e4 <unknown>
#9 0x563c53ee40ae <unknown>
#10 0x563c541a6ce1 <unknown>
#11 0x563c541aab7e <unknown>
#12 0x563c541944b5 <unknown>
#13 0x563c541ab7d6 <unknown>
#14 0x563c54177dbf <unknown>
#15 0x563c541ce748 <unknown>
#16 0x563c541ce917 <unknown>
#17 0x563c541df773 <unknown>
#18 0x7fc2221f3aa4 <unknown>
#19 0x7fc222280a64 __clone
Exception: There are no available spots for this day
Stacktrace:
suite/yclients/client/booking/web/online_booking/test_create_booking.py:1850 in test_hide_fields_on_select_data_form
lib/common/ui/pages/web.py:61 in decorated
lib/apps/yclients/client/booking/web/pages/select_time.py:302 in select_date_and_time
lib/common/ui/pages/web.py:61 in decorated
lib/apps/yclients/client/booking/web/pages/select_time.py:351 in select_time
Seen in: - altegio/biz.erp#227722 — shard 8 — launch 171516 (×1, last 2026-10-02 04:26 MSK)
TimeoutException — 1 occurrence(s) across 1 pipeline(s)¶
selenium.common.exceptions.TimeoutException: Message: Ожидаем элемент в DOM: "[data-locator="timeslot"]", параметры метода ожидания: ([
"css selector",
"None",
"[data-locator=\"timeslot\"]",
"<autotests.lib.apps.yclients.client.booking.web.pages.select_time.SelectTimePage object at 0x7fabfd700950>"
]), условия ожидания: ([
"timeout: 25s"
])
Stacktrace:
#0 0x55ec3d4f95e3 <unknown>
#1 0x55ec3d1bc0b7 <unknown>
#2 0x55ec3d209f53 <unknown>
#3 0x55ec3d20a051 <unknown>
#4 0x55ec3d24f9c4 <unknown>
#5 0x55ec3d230f1d <unknown>
#6 0x55ec3d24cb3d <unknown>
#7 0x55ec3d230cc3 <unknown>
#8 0x55ec3d1fc0e4 <unknown>
#9 0x55ec3d1fd0ae <unknown>
#10 0x55ec3d4bfce1 <unknown>
#11 0x55ec3d4c3b7e <unknown>
#12 0x55ec3d4ad4b5 <unknown>
#13 0x55ec3d4c47d6 <unknown>
#14 0x55ec3d490dbf <unknown>
#15 0x55ec3d4e7748 <unknown>
#16 0x55ec3d4e7917 <unknown>
#17 0x55ec3d4f8773 <unknown>
#18 0x7fd8e55f6aa4 <unknown>
#19 0x7fd8e5683a64 __clone
Exception: There are no available spots for this day
Stacktrace:
suite/yclients/client/booking/web/online_booking/test_create_booking.py:1850 in test_hide_fields_on_select_data_form
lib/common/ui/pages/web.py:61 in decorated
lib/apps/yclients/client/booking/web/pages/select_time.py:302 in select_date_and_time
lib/common/ui/pages/web.py:61 in decorated
lib/apps/yclients/client/booking/web/pages/select_time.py:351 in select_time
Seen in: - altegio/biz.erp#227722 — shard 8 — launch 171516 (×1, last 2026-10-02 04:26 MSK)
TimeoutException — 1 occurrence(s) across 1 pipeline(s)¶
selenium.common.exceptions.TimeoutException: Message: Ожидаем элемент в DOM: "[data-locator="timeslot"]", параметры метода ожидания: ([
"css selector",
"None",
"[data-locator=\"timeslot\"]",
"<autotests.lib.apps.yclients.client.booking.web.pages.select_time.SelectTimePage object at 0x7f079978f950>"
]), условия ожидания: ([
"timeout: 25s"
])
Stacktrace:
#0 0x559d5760e5e3 <unknown>
#1 0x559d572d10b7 <unknown>
#2 0x559d5731ef53 <unknown>
#3 0x559d5731f051 <unknown>
#4 0x559d573649c4 <unknown>
#5 0x559d57345f1d <unknown>
#6 0x559d57361b3d <unknown>
#7 0x559d57345cc3 <unknown>
#8 0x559d573110e4 <unknown>
#9 0x559d573120ae <unknown>
#10 0x559d575d4ce1 <unknown>
#11 0x559d575d8b7e <unknown>
#12 0x559d575c24b5 <unknown>
#13 0x559d575d97d6 <unknown>
#14 0x559d575a5dbf <unknown>
#15 0x559d575fc748 <unknown>
#16 0x559d575fc917 <unknown>
#17 0x559d5760d773 <unknown>
#18 0x7ff8db58eaa4 <unknown>
#19 0x7ff8db61ba64 __clone
Exception: There are no available spots for this day
Stacktrace:
suite/yclients/client/booking/web/online_booking/test_create_booking.py:1850 in test_hide_fields_on_select_data_form
lib/common/ui/pages/web.py:61 in decorated
lib/apps/yclients/client/booking/web/pages/select_time.py:302 in select_date_and_time
lib/common/ui/pages/web.py:61 in decorated
lib/apps/yclients/client/booking/web/pages/select_time.py:351 in select_time
Seen in: - altegio/biz.erp#227735 — shard 1 — launch 171549 (×1, last 2026-10-02 06:23 MSK)
TimeoutException — 1 occurrence(s) across 1 pipeline(s)¶
selenium.common.exceptions.TimeoutException: Message: Ожидаем элемент в DOM: "[data-locator="timeslot"]", параметры метода ожидания: ([
"css selector",
"None",
"[data-locator=\"timeslot\"]",
"<autotests.lib.apps.yclients.client.booking.web.pages.select_time.SelectTimePage object at 0x7f529c1b0ef0>"
]), условия ожидания: ([
"timeout: 25s"
])
Stacktrace:
#0 0x55c66cb9b5e3 <unknown>
#1 0x55c66c85e0b7 <unknown>
#2 0x55c66c8abf53 <unknown>
#3 0x55c66c8ac051 <unknown>
#4 0x55c66c8f19c4 <unknown>
#5 0x55c66c8d2f1d <unknown>
#6 0x55c66c8eeb3d <unknown>
#7 0x55c66c8d2cc3 <unknown>
#8 0x55c66c89e0e4 <unknown>
#9 0x55c66c89f0ae <unknown>
#10 0x55c66cb61ce1 <unknown>
#11 0x55c66cb65b7e <unknown>
#12 0x55c66cb4f4b5 <unknown>
#13 0x55c66cb667d6 <unknown>
#14 0x55c66cb32dbf <unknown>
#15 0x55c66cb89748 <unknown>
#16 0x55c66cb89917 <unknown>
#17 0x55c66cb9a773 <unknown>
#18 0x7f3d84aaaaa4 <unknown>
#19 0x7f3d84b37a64 __clone
Exception: There are no available spots for this day
Stacktrace:
suite/yclients/client/booking/web/online_booking/test_create_booking.py:1850 in test_hide_fields_on_select_data_form
lib/common/ui/pages/web.py:61 in decorated
lib/apps/yclients/client/booking/web/pages/select_time.py:302 in select_date_and_time
lib/common/ui/pages/web.py:61 in decorated
lib/apps/yclients/client/booking/web/pages/select_time.py:351 in select_time
Seen in: - altegio/biz.erp#227735 — shard 1 — launch 171549 (×1, last 2026-10-02 06:23 MSK)
TimeoutException — 1 occurrence(s) across 1 pipeline(s)¶
selenium.common.exceptions.TimeoutException: Message: Ожидаем элемент в DOM: "[data-locator="timeslot"]", параметры метода ожидания: ([
"css selector",
"None",
"[data-locator=\"timeslot\"]",
"<autotests.lib.apps.yclients.client.booking.web.pages.select_time.SelectTimePage object at 0x7fcd2049a360>"
]), условия ожидания: ([
"timeout: 25s"
])
Stacktrace:
#0 0x55a3eab545e3 <unknown>
#1 0x55a3ea8170b7 <unknown>
#2 0x55a3ea864f53 <unknown>
#3 0x55a3ea865051 <unknown>
#4 0x55a3ea8aa9c4 <unknown>
#5 0x55a3ea88bf1d <unknown>
#6 0x55a3ea8a7b3d <unknown>
#7 0x55a3ea88bcc3 <unknown>
#8 0x55a3ea8570e4 <unknown>
#9 0x55a3ea8580ae <unknown>
#10 0x55a3eab1ace1 <unknown>
#11 0x55a3eab1eb7e <unknown>
#12 0x55a3eab084b5 <unknown>
#13 0x55a3eab1f7d6 <unknown>
#14 0x55a3eaaebdbf <unknown>
#15 0x55a3eab42748 <unknown>
#16 0x55a3eab42917 <unknown>
#17 0x55a3eab53773 <unknown>
#18 0x7fb65a33caa4 <unknown>
#19 0x7fb65a3c9a64 __clone
Exception: There are no available spots for this day
Stacktrace:
suite/yclients/client/booking/web/online_booking/test_create_booking.py:1850 in test_hide_fields_on_select_data_form
lib/common/ui/pages/web.py:61 in decorated
lib/apps/yclients/client/booking/web/pages/select_time.py:302 in select_date_and_time
lib/common/ui/pages/web.py:61 in decorated
lib/apps/yclients/client/booking/web/pages/select_time.py:351 in select_time
Seen in: - altegio/biz.erp#227735 — shard 1 — launch 171549 (×1, last 2026-10-02 06:23 MSK)
TimeoutException — 1 occurrence(s) across 1 pipeline(s)¶
selenium.common.exceptions.TimeoutException: Message: Ожидаем элемент в DOM: "[data-locator="booking_date"]", параметры метода ожидания: ([
"css selector",
"None",
"[data-locator=\"booking_date\"]",
"<autotests.lib.apps.yclients.client.booking.web.pages.created_booking.CreatedBookingPage object at 0x7f355c1eccb0>"
]), условия ожидания: ([
"timeout: 25s"
])
Stacktrace:
#0 0x556829c6c5e3 <unknown>
#1 0x55682992f0b7 <unknown>
#2 0x55682997cf53 <unknown>
#3 0x55682997d051 <unknown>
#4 0x5568299c29c4 <unknown>
#5 0x5568299a3f1d <unknown>
#6 0x5568299bfb3d <unknown>
#7 0x5568299a3cc3 <unknown>
#8 0x55682996f0e4 <unknown>
#9 0x5568299700ae <unknown>
#10 0x556829c32ce1 <unknown>
#11 0x556829c36b7e <unknown>
#12 0x556829c204b5 <unknown>
#13 0x556829c377d6 <unknown>
#14 0x556829c03dbf <unknown>
#15 0x556829c5a748 <unknown>
#16 0x556829c5a917 <unknown>
#17 0x556829c6b773 <unknown>
#18 0x7f009ebe5aa4 <unknown>
#19 0x7f009ec72a64 __clone
Stacktrace:
lib/common/ui/pages/web.py:61 in decorated
lib/apps/yclients/client/booking/web/pages/created_booking.py:81 in get_booking_time
lib/common/ui/pages/web.py:61 in decorated
lib/common/ui/pages/web.py:148 in wait_for_element
lib/ui/selenium/webdriver/support/wait.py:28 in until
Seen in: - altegio/biz.erp#227749 — shard 1 — launch 171616 (×1, last 2026-10-02 08:20 MSK)
TimeoutException — 1 occurrence(s) across 1 pipeline(s)¶
selenium.common.exceptions.TimeoutException: Message: Ожидаем элемент в DOM: "[data-locator="booking_date"]", параметры метода ожидания: ([
"css selector",
"None",
"[data-locator=\"booking_date\"]",
"<autotests.lib.apps.yclients.client.booking.web.pages.created_booking.CreatedBookingPage object at 0x7f15e8a48fb0>"
]), условия ожидания: ([
"timeout: 25s"
])
Stacktrace:
#0 0x55762004c5e3 <unknown>
#1 0x55761fd0f0b7 <unknown>
#2 0x55761fd5cf53 <unknown>
#3 0x55761fd5d051 <unknown>
#4 0x55761fda29c4 <unknown>
#5 0x55761fd83f1d <unknown>
#6 0x55761fd9fb3d <unknown>
#7 0x55761fd83cc3 <unknown>
#8 0x55761fd4f0e4 <unknown>
#9 0x55761fd500ae <unknown>
#10 0x557620012ce1 <unknown>
#11 0x557620016b7e <unknown>
#12 0x5576200004b5 <unknown>
#13 0x5576200177d6 <unknown>
#14 0x55761ffe3dbf <unknown>
#15 0x55762003a748 <unknown>
#16 0x55762003a917 <unknown>
#17 0x55762004b773 <unknown>
#18 0x7f3ed8ef3aa4 <unknown>
#19 0x7f3ed8f80a64 __clone
Stacktrace:
lib/common/ui/pages/web.py:61 in decorated
lib/apps/yclients/client/booking/web/pages/created_booking.py:81 in get_booking_time
lib/common/ui/pages/web.py:61 in decorated
lib/common/ui/pages/web.py:148 in wait_for_element
lib/ui/selenium/webdriver/support/wait.py:28 in until
Seen in: - altegio/biz.erp#227749 — shard 1 — launch 171616 (×1, last 2026-10-02 08:20 MSK)
TimeoutException — 1 occurrence(s) across 1 pipeline(s)¶
selenium.common.exceptions.TimeoutException: Message: Ожидаем элемент в DOM: "[data-locator="booking_date"]", параметры метода ожидания: ([
"css selector",
"None",
"[data-locator=\"booking_date\"]",
"<autotests.lib.apps.yclients.client.booking.web.pages.created_booking.CreatedBookingPage object at 0x7fb8916e3c50>"
]), условия ожидания: ([
"timeout: 25s"
])
Stacktrace:
#0 0x563f67e495e3 <unknown>
#1 0x563f67b0c0b7 <unknown>
#2 0x563f67b59f53 <unknown>
#3 0x563f67b5a051 <unknown>
#4 0x563f67b9f9c4 <unknown>
#5 0x563f67b80f1d <unknown>
#6 0x563f67b9cb3d <unknown>
#7 0x563f67b80cc3 <unknown>
#8 0x563f67b4c0e4 <unknown>
#9 0x563f67b4d0ae <unknown>
#10 0x563f67e0fce1 <unknown>
#11 0x563f67e13b7e <unknown>
#12 0x563f67dfd4b5 <unknown>
#13 0x563f67e147d6 <unknown>
#14 0x563f67de0dbf <unknown>
#15 0x563f67e37748 <unknown>
#16 0x563f67e37917 <unknown>
#17 0x563f67e48773 <unknown>
#18 0x7f4f52a40aa4 <unknown>
#19 0x7f4f52acda64 __clone
Stacktrace:
lib/common/ui/pages/web.py:61 in decorated
lib/apps/yclients/client/booking/web/pages/created_booking.py:81 in get_booking_time
lib/common/ui/pages/web.py:61 in decorated
lib/common/ui/pages/web.py:148 in wait_for_element
lib/ui/selenium/webdriver/support/wait.py:28 in until
Seen in: - altegio/biz.erp#227749 — shard 1 — launch 171616 (×1, last 2026-10-02 08:20 MSK)
TimeoutException — 1 occurrence(s) across 1 pipeline(s)¶
selenium.common.exceptions.TimeoutException: Message: Ожидаем элемент в DOM: "[data-locator="booking_date"]", параметры метода ожидания: ([
"css selector",
"None",
"[data-locator=\"booking_date\"]",
"<autotests.lib.apps.yclients.client.booking.web.pages.created_booking.CreatedBookingPage object at 0x7f1e44c629f0>"
]), условия ожидания: ([
"timeout: 25s"
])
Stacktrace:
#0 0x560ae470a5e3 <unknown>
#1 0x560ae43cd0b7 <unknown>
#2 0x560ae441af53 <unknown>
#3 0x560ae441b051 <unknown>
#4 0x560ae44609c4 <unknown>
#5 0x560ae4441f1d <unknown>
#6 0x560ae445db3d <unknown>
#7 0x560ae4441cc3 <unknown>
#8 0x560ae440d0e4 <unknown>
#9 0x560ae440e0ae <unknown>
#10 0x560ae46d0ce1 <unknown>
#11 0x560ae46d4b7e <unknown>
#12 0x560ae46be4b5 <unknown>
#13 0x560ae46d57d6 <unknown>
#14 0x560ae46a1dbf <unknown>
#15 0x560ae46f8748 <unknown>
#16 0x560ae46f8917 <unknown>
#17 0x560ae4709773 <unknown>
#18 0x7fa3809b9aa4 <unknown>
#19 0x7fa380a46a64 __clone
Stacktrace:
lib/common/ui/pages/web.py:61 in decorated
lib/apps/yclients/client/booking/web/pages/created_booking.py:81 in get_booking_time
lib/common/ui/pages/web.py:61 in decorated
lib/common/ui/pages/web.py:148 in wait_for_element
lib/ui/selenium/webdriver/support/wait.py:28 in until
Seen in: - altegio/biz.erp#227787 — shard 8 — launch 171752 (×1, last 2026-10-02 11:50 MSK)
TimeoutException — 1 occurrence(s) across 1 pipeline(s)¶
selenium.common.exceptions.TimeoutException: Message: Ожидаем элемент в DOM: "[data-locator="booking_date"]", параметры метода ожидания: ([
"css selector",
"None",
"[data-locator=\"booking_date\"]",
"<autotests.lib.apps.yclients.client.booking.web.pages.created_booking.CreatedBookingPage object at 0x7f93a0d0a630>"
]), условия ожидания: ([
"timeout: 25s"
])
Stacktrace:
#0 0x5638153115e3 <unknown>
#1 0x563814fd40b7 <unknown>
#2 0x563815021f53 <unknown>
#3 0x563815022051 <unknown>
#4 0x5638150679c4 <unknown>
#5 0x563815048f1d <unknown>
#6 0x563815064b3d <unknown>
#7 0x563815048cc3 <unknown>
#8 0x5638150140e4 <unknown>
#9 0x5638150150ae <unknown>
#10 0x5638152d7ce1 <unknown>
#11 0x5638152dbb7e <unknown>
#12 0x5638152c54b5 <unknown>
#13 0x5638152dc7d6 <unknown>
#14 0x5638152a8dbf <unknown>
#15 0x5638152ff748 <unknown>
#16 0x5638152ff917 <unknown>
#17 0x563815310773 <unknown>
#18 0x7f3c0f987aa4 <unknown>
#19 0x7f3c0fa14a64 __clone
Stacktrace:
lib/common/ui/pages/web.py:61 in decorated
lib/apps/yclients/client/booking/web/pages/created_booking.py:81 in get_booking_time
lib/common/ui/pages/web.py:61 in decorated
lib/common/ui/pages/web.py:148 in wait_for_element
lib/ui/selenium/webdriver/support/wait.py:28 in until
Seen in: - altegio/biz.erp#227787 — shard 8 — launch 171752 (×1, last 2026-10-02 11:50 MSK)
WebDriverException — 1 occurrence(s) across 1 pipeline(s)¶
selenium.common.exceptions.WebDriverException: Message: <unknown>: Failed to read the 'localStorage' property from 'Window': Access is denied for this document.
(Session info: headless chrome=119.0.6045.199)
Stacktrace:
#0 0x5617ae8e45e3 <unknown>
#1 0x5617ae5a70b7 <unknown>
#2 0x5617ae5ad2b5 <unknown>
#3 0x5617ae5af9b1 <unknown>
#4 0x5617ae63871f <unknown>
#5 0x5617ae61bef2 <unknown>
#6 0x5617ae637b3d <unknown>
#7 0x5617ae61bcc3 <unknown>
#8 0x5617ae5e70e4 <unknown>
#9 0x5617ae5e80ae <unknown>
#10 0x5617ae8aace1 <unknown>
#11 0x5617ae8aeb7e <unknown>
#12 0x5617ae8984b5 <unknown>
#13 0x5617ae8af7d6 <unknown>
#14 0x5617ae87bdbf <unknown>
#15 0x5617ae8d2748 <unknown>
#16 0x5617ae8d2917 <unknown>
#17 0x5617ae8e3773 <unknown>
#18 0x7ff166d6faa4 <unknown>
#19 0x7ff166dfca64 __clone
Stacktrace:
lib/common/ui/pages/web.py:61 in decorated
lib/apps/yclients/client/booking/web/pages/__init__.py:80 in open
lib/common/ui/pages/web.py:61 in decorated
lib/apps/yclients/client/booking/web/pages/__init__.py:41 in set_environment
lib/ui/selenium/webdriver/__init__.py:52 in execute_script
Seen in: - altegio/client.booking#224668 — shard 2 — launch 165208 (×1, last 2026-09-21 08:16 MSK)
WebDriverException — 1 occurrence(s) across 1 pipeline(s)¶
selenium.common.exceptions.WebDriverException: Message: <unknown>: Failed to read the 'localStorage' property from 'Window': Access is denied for this document.
(Session info: headless chrome=119.0.6045.199)
Stacktrace:
#0 0x5645f1ccd5e3 <unknown>
#1 0x5645f19900b7 <unknown>
#2 0x5645f19962b5 <unknown>
#3 0x5645f19989b1 <unknown>
#4 0x5645f1a2171f <unknown>
#5 0x5645f1a04ef2 <unknown>
#6 0x5645f1a20b3d <unknown>
#7 0x5645f1a04cc3 <unknown>
#8 0x5645f19d00e4 <unknown>
#9 0x5645f19d10ae <unknown>
#10 0x5645f1c93ce1 <unknown>
#11 0x5645f1c97b7e <unknown>
#12 0x5645f1c814b5 <unknown>
#13 0x5645f1c987d6 <unknown>
#14 0x5645f1c64dbf <unknown>
#15 0x5645f1cbb748 <unknown>
#16 0x5645f1cbb917 <unknown>
#17 0x5645f1ccc773 <unknown>
#18 0x7fd232e13aa4 <unknown>
#19 0x7fd232ea0a64 __clone
Stacktrace:
lib/common/ui/pages/web.py:61 in decorated
lib/apps/yclients/client/booking/web/pages/__init__.py:80 in open
lib/common/ui/pages/web.py:61 in decorated
lib/apps/yclients/client/booking/web/pages/__init__.py:41 in set_environment
lib/ui/selenium/webdriver/__init__.py:52 in execute_script
Seen in: - altegio/client.booking#224668 — shard 2 — launch 165208 (×1, last 2026-09-21 08:16 MSK)
WebDriverException — 1 occurrence(s) across 1 pipeline(s)¶
selenium.common.exceptions.WebDriverException: Message: <unknown>: Failed to read the 'localStorage' property from 'Window': Access is denied for this document.
(Session info: headless chrome=119.0.6045.199)
Stacktrace:
#0 0x560426ec55e3 <unknown>
#1 0x560426b880b7 <unknown>
#2 0x560426b8e2b5 <unknown>
#3 0x560426b909b1 <unknown>
#4 0x560426c1971f <unknown>
#5 0x560426bfcef2 <unknown>
#6 0x560426c18b3d <unknown>
#7 0x560426bfccc3 <unknown>
#8 0x560426bc80e4 <unknown>
#9 0x560426bc90ae <unknown>
#10 0x560426e8bce1 <unknown>
#11 0x560426e8fb7e <unknown>
#12 0x560426e794b5 <unknown>
#13 0x560426e907d6 <unknown>
#14 0x560426e5cdbf <unknown>
#15 0x560426eb3748 <unknown>
#16 0x560426eb3917 <unknown>
#17 0x560426ec4773 <unknown>
#18 0x7f995beafaa4 <unknown>
#19 0x7f995bf3ca64 __clone
Stacktrace:
lib/common/ui/pages/web.py:61 in decorated
lib/apps/yclients/client/booking/web/pages/__init__.py:80 in open
lib/common/ui/pages/web.py:61 in decorated
lib/apps/yclients/client/booking/web/pages/__init__.py:41 in set_environment
lib/ui/selenium/webdriver/__init__.py:52 in execute_script
Seen in: - altegio/client.booking#224668 — shard 2 — launch 165208 (×1, last 2026-09-21 08:16 MSK)