#22188 Продолжение ранее незавершенного онбординга через регистрацию¶
test_incomplete_onboarding_continue_via_registration_v2
Failures in last 30 days: 9
Generated at 2026-10-08 03:48 MSK
Last failure: 2026-10-03 03:37 MSK
Filter: pipelines with sandbox_biz_erp ∈ {master, testops-dev} AND autotests_branch ∈ {master, main} only (testops-dev — daytime ticks since 2026-08-05).
By exception class:
- TimeoutError — 7
- AssertionError — 2
Failure signatures (grouped by exception + full message):
AssertionError — 2 occurrence(s) across 2 pipeline(s)¶
AssertionError: Locator expected to be visible
Actual value: None
Error: element(s) not found
Call log:
- Expect "to_be_visible" with timeout 30000ms
- waiting for locator("[data-locator$=\"autocomplete_drop-menu_item_15\"] a").first
Stacktrace:
lib/apps_pw/yclients/biz/erp/web/pages/__init__.py:76 in decorated
lib/apps_pw/yclients/biz/erp/web/pages/guest/signup_v2.py:459 in fill_and_submit
lib/apps_pw/yclients/biz/erp/web/pages/__init__.py:76 in decorated
lib/apps_pw/yclients/biz/erp/web/pages/guest/signup_v2.py:426 in set_biz_type
lib/apps_pw/yclients/biz/erp/web/pages/guest/signup_v2.py:751 in _pick_autocomplete_v2_item
Seen in: - altegio/biz.erp#228023 — shard 5 — launch 172268 (×1, last 2026-10-03 03:37 MSK) - altegio/biz.erp#223860 — shard 6 — launch 163016 (×1, last 2026-09-16 05:40 MSK)
TimeoutError — 1 occurrence(s) across 1 pipeline(s)¶
playwright._impl._errors.TimeoutError: Timeout 30000ms exceeded.
=========================== logs ===========================
waiting for navigation to "<function ImplToApiMapping.wrap_handler.<locals>.wrapper_func at 0x7f99cb3e6840>" until 'domcontentloaded'
navigated to "https://erp-testops-dev.infra.altegio.cloud/onboarding/fifth/49551"
navigated to "https://erp-testops-dev.infra.altegio.cloud/onboarding/fifth/49551"
navigated to "https://erp-testops-dev.infra.altegio.cloud/signin/JTJGb25ib2FyZGluZyUyRmNvbXBsZXRlJTJGNDk1NTE="
navigated to "https://erp-testops-dev.infra.altegio.cloud/signin/JTJGb25ib2FyZGluZyUyRmNvbXBsZXRlJTJGNDk1NTE="
navigated to "https://erp-testops-dev.infra.altegio.cloud/signin/JTJGb25ib2FyZGluZyUyRmNvbXBsZXRlJTJGNDk1NTE="
============================================================
Stacktrace:
suite/yclients/biz/erp/web/filial/test_onboarding_v2_pw.py:1143 in test_incomplete_onboarding_continue_via_registration_v2
lib/apps_pw/yclients/biz/erp/web/pages/__init__.py:77 in decorated
lib/apps_pw/yclients/biz/erp/web/pages/guest/signup_v2.py:608 in fill_and_submit
Seen in: - altegio/biz.erp#227722 — shard 4 — launch 171516 (×1, last 2026-10-02 04:26 MSK)
TimeoutError — 1 occurrence(s) across 1 pipeline(s)¶
playwright._impl._errors.TimeoutError: Timeout 30000ms exceeded.
=========================== logs ===========================
waiting for navigation to "<function ImplToApiMapping.wrap_handler.<locals>.wrapper_func at 0x7fb551341e40>" until 'domcontentloaded'
navigated to "https://erp-testops-dev.infra.altegio.cloud/onboarding/fifth/49566"
navigated to "https://erp-testops-dev.infra.altegio.cloud/onboarding/fifth/49566"
navigated to "https://erp-testops-dev.infra.altegio.cloud/signin/JTJGb25ib2FyZGluZyUyRmNvbXBsZXRlJTJGNDk1NjY="
navigated to "https://erp-testops-dev.infra.altegio.cloud/signin/JTJGb25ib2FyZGluZyUyRmNvbXBsZXRlJTJGNDk1NjY="
navigated to "https://erp-testops-dev.infra.altegio.cloud/signin/JTJGb25ib2FyZGluZyUyRmNvbXBsZXRlJTJGNDk1NjY="
============================================================
Stacktrace:
suite/yclients/biz/erp/web/filial/test_onboarding_v2_pw.py:1143 in test_incomplete_onboarding_continue_via_registration_v2
lib/apps_pw/yclients/biz/erp/web/pages/__init__.py:77 in decorated
lib/apps_pw/yclients/biz/erp/web/pages/guest/signup_v2.py:608 in fill_and_submit
Seen in: - altegio/biz.erp#227722 — shard 4 — launch 171516 (×1, last 2026-10-02 04:26 MSK)
TimeoutError — 1 occurrence(s) across 1 pipeline(s)¶
playwright._impl._errors.TimeoutError: Timeout 30000ms exceeded.
=========================== logs ===========================
waiting for navigation to "<function ImplToApiMapping.wrap_handler.<locals>.wrapper_func at 0x7fbc43d94e00>" until 'domcontentloaded'
navigated to "https://erp-testops-dev.infra.altegio.cloud/onboarding/fifth/49574"
navigated to "https://erp-testops-dev.infra.altegio.cloud/onboarding/fifth/49574"
navigated to "https://erp-testops-dev.infra.altegio.cloud/signin/JTJGb25ib2FyZGluZyUyRmNvbXBsZXRlJTJGNDk1NzQ="
navigated to "https://erp-testops-dev.infra.altegio.cloud/signin/JTJGb25ib2FyZGluZyUyRmNvbXBsZXRlJTJGNDk1NzQ="
navigated to "https://erp-testops-dev.infra.altegio.cloud/signin/JTJGb25ib2FyZGluZyUyRmNvbXBsZXRlJTJGNDk1NzQ="
============================================================
Stacktrace:
suite/yclients/biz/erp/web/filial/test_onboarding_v2_pw.py:1143 in test_incomplete_onboarding_continue_via_registration_v2
lib/apps_pw/yclients/biz/erp/web/pages/__init__.py:77 in decorated
lib/apps_pw/yclients/biz/erp/web/pages/guest/signup_v2.py:608 in fill_and_submit
Seen in: - altegio/biz.erp#227722 — shard 4 — launch 171516 (×1, last 2026-10-02 04:26 MSK)
TimeoutError — 1 occurrence(s) across 1 pipeline(s)¶
playwright._impl._errors.TimeoutError: Timeout 30000ms exceeded.
=========================== logs ===========================
waiting for navigation to "<function ImplToApiMapping.wrap_handler.<locals>.wrapper_func at 0x7f4252ccfe20>" until 'domcontentloaded'
navigated to "https://erp-testops-dev.infra.altegio.cloud/onboarding/fifth/49612"
navigated to "https://erp-testops-dev.infra.altegio.cloud/onboarding/fifth/49612"
navigated to "https://erp-testops-dev.infra.altegio.cloud/signin/JTJGb25ib2FyZGluZyUyRmNvbXBsZXRlJTJGNDk2MTI="
navigated to "https://erp-testops-dev.infra.altegio.cloud/signin/JTJGb25ib2FyZGluZyUyRmNvbXBsZXRlJTJGNDk2MTI="
navigated to "https://erp-testops-dev.infra.altegio.cloud/signin/JTJGb25ib2FyZGluZyUyRmNvbXBsZXRlJTJGNDk2MTI="
============================================================
Stacktrace:
suite/yclients/biz/erp/web/filial/test_onboarding_v2_pw.py:1143 in test_incomplete_onboarding_continue_via_registration_v2
lib/apps_pw/yclients/biz/erp/web/pages/__init__.py:77 in decorated
lib/apps_pw/yclients/biz/erp/web/pages/guest/signup_v2.py:608 in fill_and_submit
Seen in: - altegio/biz.erp#227749 — shard 3 — launch 171616 (×1, last 2026-10-02 08:20 MSK)
TimeoutError — 1 occurrence(s) across 1 pipeline(s)¶
playwright._impl._errors.TimeoutError: Timeout 30000ms exceeded.
=========================== logs ===========================
waiting for navigation to "<function ImplToApiMapping.wrap_handler.<locals>.wrapper_func at 0x7fa2c7df9da0>" until 'domcontentloaded'
navigated to "https://erp-testops-dev.infra.altegio.cloud/onboarding/fifth/49623"
navigated to "https://erp-testops-dev.infra.altegio.cloud/onboarding/fifth/49623"
navigated to "https://erp-testops-dev.infra.altegio.cloud/signin/JTJGb25ib2FyZGluZyUyRmNvbXBsZXRlJTJGNDk2MjM="
navigated to "https://erp-testops-dev.infra.altegio.cloud/signin/JTJGb25ib2FyZGluZyUyRmNvbXBsZXRlJTJGNDk2MjM="
navigated to "https://erp-testops-dev.infra.altegio.cloud/signin/JTJGb25ib2FyZGluZyUyRmNvbXBsZXRlJTJGNDk2MjM="
============================================================
Stacktrace:
suite/yclients/biz/erp/web/filial/test_onboarding_v2_pw.py:1143 in test_incomplete_onboarding_continue_via_registration_v2
lib/apps_pw/yclients/biz/erp/web/pages/__init__.py:77 in decorated
lib/apps_pw/yclients/biz/erp/web/pages/guest/signup_v2.py:608 in fill_and_submit
Seen in: - altegio/biz.erp#227749 — shard 3 — launch 171616 (×1, last 2026-10-02 08:20 MSK)
TimeoutError — 1 occurrence(s) across 1 pipeline(s)¶
playwright._impl._errors.TimeoutError: Timeout 30000ms exceeded.
=========================== logs ===========================
waiting for navigation to "<function ImplToApiMapping.wrap_handler.<locals>.wrapper_func at 0x7fc06478cf40>" until 'domcontentloaded'
navigated to "https://erp-testops-dev.infra.altegio.cloud/onboarding/fifth/49632"
navigated to "https://erp-testops-dev.infra.altegio.cloud/onboarding/fifth/49632"
navigated to "https://erp-testops-dev.infra.altegio.cloud/signin/JTJGb25ib2FyZGluZyUyRmNvbXBsZXRlJTJGNDk2MzI="
navigated to "https://erp-testops-dev.infra.altegio.cloud/signin/JTJGb25ib2FyZGluZyUyRmNvbXBsZXRlJTJGNDk2MzI="
navigated to "https://erp-testops-dev.infra.altegio.cloud/signin/JTJGb25ib2FyZGluZyUyRmNvbXBsZXRlJTJGNDk2MzI="
============================================================
Stacktrace:
suite/yclients/biz/erp/web/filial/test_onboarding_v2_pw.py:1143 in test_incomplete_onboarding_continue_via_registration_v2
lib/apps_pw/yclients/biz/erp/web/pages/__init__.py:77 in decorated
lib/apps_pw/yclients/biz/erp/web/pages/guest/signup_v2.py:608 in fill_and_submit
Seen in: - altegio/biz.erp#227749 — shard 3 — launch 171616 (×1, last 2026-10-02 08:20 MSK)
TimeoutError — 1 occurrence(s) across 1 pipeline(s)¶
playwright._impl._errors.TimeoutError: Timeout 30000ms exceeded.
=========================== logs ===========================
waiting for navigation to "<function ImplToApiMapping.wrap_handler.<locals>.wrapper_func at 0x7f9aa43d4900>" until 'domcontentloaded'
navigated to "https://erp-testops-dev.infra.altegio.cloud/onboarding/fifth/49647"
navigated to "https://erp-testops-dev.infra.altegio.cloud/onboarding/fifth/49647"
navigated to "https://erp-testops-dev.infra.altegio.cloud/signin/JTJGb25ib2FyZGluZyUyRmNvbXBsZXRlJTJGNDk2NDc="
navigated to "https://erp-testops-dev.infra.altegio.cloud/signin/JTJGb25ib2FyZGluZyUyRmNvbXBsZXRlJTJGNDk2NDc="
navigated to "https://erp-testops-dev.infra.altegio.cloud/signin/JTJGb25ib2FyZGluZyUyRmNvbXBsZXRlJTJGNDk2NDc="
============================================================
Stacktrace:
suite/yclients/biz/erp/web/filial/test_onboarding_v2_pw.py:1143 in test_incomplete_onboarding_continue_via_registration_v2
lib/apps_pw/yclients/biz/erp/web/pages/__init__.py:77 in decorated
lib/apps_pw/yclients/biz/erp/web/pages/guest/signup_v2.py:608 in fill_and_submit
Seen in: - altegio/biz.erp#227787 — shard 3 — launch 171752 (×1, last 2026-10-02 11:50 MSK)