Отображение описания о сотруднике.¶
test_master_page_check_master_info
Failures in last 30 days: 8
Generated at 2026-10-08 03:48 MSK
Last failure: 2026-10-07 17:54 MSK
Filter: pipelines with sandbox_biz_erp ∈ {master, testops-dev} AND autotests_branch ∈ {master, main} only (testops-dev — daytime ticks since 2026-08-05).
By exception class:
- AssertionError — 6
- Unknown — 1
- TimeoutError — 1
Failure signatures (grouped by exception + full message):
AssertionError — 6 occurrence(s) across 1 pipeline(s)¶
AssertionError: На страницах во время теста обнаружены javascript-ошибки:
------------------------------------------------------------
Исходная страница: chrome-error://chromewebdata/
------------------------------------------------------------
Источник: , строка: 3, столбец: 7
------------------------------------------------------------
Детали: Uncaught SecurityError: Failed to read the 'localStorage' property from 'Window': Access is denied for this document.
------------------------------------------------------------
Трейс: SecurityError: Failed to read the 'localStorage' property from 'Window': Access is denied for this document.
at <anonymous>:3:7
Stacktrace:
plugins/allure/playwright/plugin.py:109 in pytest_runtest_teardown
Seen in: - altegio/client.booking#224668 — shard 3 — launch 165208 (×6, last 2026-09-21 08:16 MSK)
TimeoutError — 1 occurrence(s) across 1 pipeline(s)¶
playwright._impl._errors.TimeoutError: Locator.click: Timeout 30000ms exceeded.
Call log:
- waiting for locator("[data-locator=\"master_select_btn\"]")
Stacktrace:
suite/yclients/client/booking/web/online_booking/test_master_page_pw.py:148 in test_master_page_check_master_info
lib/apps_pw/yclients/client/booking/web/pages/order.py:33 in click_select_employee
Seen in: - altegio/biz.erp#229261 — shard 4 — launch 174180 (×1, last 2026-10-07 17:54 MSK)
Unknown — 1 occurrence(s) across 1 pipeline(s)¶
AssertionError
Seen in: - altegio/biz.erp#227722 — shard 7 — launch 171516 (×1, last 2026-10-02 04:26 MSK)