Skip to content

Создание записи со страницы успешной записи

со скрытым шагом сотрудника. ("Записаться ещё")

test_master_step_hidden_create_booking_book_more_btn

Failures in last 30 days: 13

Generated at 2026-10-08 03:48 MSK

Last failure: 2026-10-02 11:50 MSK

Filter: pipelines with sandbox_biz_erp ∈ {master, testops-dev} AND autotests_branch ∈ {master, main} only (testops-dev — daytime ticks since 2026-08-05).

By exception class: - Exception — 6 - TimeoutException — 4 - WebDriverException — 3

Failure signatures (grouped by exception + full message):

Exception — 6 occurrence(s) across 3 pipeline(s)

Exception: Нет заполненного расписания

Stacktrace:

suite/yclients/client/booking/web/online_booking/test_master_default.py:2766 in test_master_step_hidden_create_booking_book_more_btn
lib/apps/yclients/client/booking/web/pages/select_time.py:152 in select_date_and_time
lib/apps/yclients/client/booking/web/pages/select_time.py:169 in select_date

Seen in: - altegio/biz.erp#227749 — shard 2 — launch 171616 (×1, last 2026-10-02 08:20 MSK) - altegio/biz.erp#227735 — shard 8 — launch 171549 (×2, last 2026-10-02 06:23 MSK) - altegio/biz.erp#227722 — shard 6 — launch 171516 (×3, last 2026-10-02 04:26 MSK)

TimeoutException — 1 occurrence(s) across 1 pipeline(s)

selenium.common.exceptions.TimeoutException: Message: Ожидаем элемент в DOM: "[data-locator="book_again_btn"]", параметры метода ожидания: ([
    "css selector",
    "None",
    "[data-locator=\"book_again_btn\"]",
    "<autotests.lib.apps.yclients.client.booking.web.pages.created_booking.CreatedBookingPage object at 0x7fb70d793200>"
]), условия ожидания: ([
    "timeout: 25s"
])
Stacktrace:
#0 0x55a1786115e3 <unknown>
#1 0x55a1782d40b7 <unknown>
#2 0x55a178321f53 <unknown>
#3 0x55a178322051 <unknown>
#4 0x55a1783679c4 <unknown>
#5 0x55a178348f1d <unknown>
#6 0x55a178364b3d <unknown>
#7 0x55a178348cc3 <unknown>
#8 0x55a1783140e4 <unknown>
#9 0x55a1783150ae <unknown>
#10 0x55a1785d7ce1 <unknown>
#11 0x55a1785dbb7e <unknown>
#12 0x55a1785c54b5 <unknown>
#13 0x55a1785dc7d6 <unknown>
#14 0x55a1785a8dbf <unknown>
#15 0x55a1785ff748 <unknown>
#16 0x55a1785ff917 <unknown>
#17 0x55a178610773 <unknown>
#18 0x7fe006f05aa4 <unknown>
#19 0x7fe006f92a64 __clone

Stacktrace:

suite/yclients/client/booking/web/online_booking/test_master_default.py:2796 in test_master_step_hidden_create_booking_book_more_btn
lib/apps/yclients/client/booking/web/pages/created_booking.py:65 in button_book_again_text
lib/common/ui/pages/web.py:61 in decorated
lib/common/ui/pages/web.py:148 in wait_for_element
lib/ui/selenium/webdriver/support/wait.py:28 in until

Seen in: - altegio/biz.erp#227735 — shard 8 — launch 171549 (×1, last 2026-10-02 06:23 MSK)

TimeoutException — 1 occurrence(s) across 1 pipeline(s)

selenium.common.exceptions.TimeoutException: Message: Ожидаем элемент в DOM: "[data-locator="book_again_btn"]", параметры метода ожидания: ([
    "css selector",
    "None",
    "[data-locator=\"book_again_btn\"]",
    "<autotests.lib.apps.yclients.client.booking.web.pages.created_booking.CreatedBookingPage object at 0x7fe6fd76cfb0>"
]), условия ожидания: ([
    "timeout: 25s"
])
Stacktrace:
#0 0x56455e4515e3 <unknown>
#1 0x56455e1140b7 <unknown>
#2 0x56455e161f53 <unknown>
#3 0x56455e162051 <unknown>
#4 0x56455e1a79c4 <unknown>
#5 0x56455e188f1d <unknown>
#6 0x56455e1a4b3d <unknown>
#7 0x56455e188cc3 <unknown>
#8 0x56455e1540e4 <unknown>
#9 0x56455e1550ae <unknown>
#10 0x56455e417ce1 <unknown>
#11 0x56455e41bb7e <unknown>
#12 0x56455e4054b5 <unknown>
#13 0x56455e41c7d6 <unknown>
#14 0x56455e3e8dbf <unknown>
#15 0x56455e43f748 <unknown>
#16 0x56455e43f917 <unknown>
#17 0x56455e450773 <unknown>
#18 0x7f59d8babaa4 <unknown>
#19 0x7f59d8c38a64 __clone

Stacktrace:

suite/yclients/client/booking/web/online_booking/test_master_default.py:2796 in test_master_step_hidden_create_booking_book_more_btn
lib/apps/yclients/client/booking/web/pages/created_booking.py:65 in button_book_again_text
lib/common/ui/pages/web.py:61 in decorated
lib/common/ui/pages/web.py:148 in wait_for_element
lib/ui/selenium/webdriver/support/wait.py:28 in until

Seen in: - altegio/biz.erp#227749 — shard 2 — launch 171616 (×1, last 2026-10-02 08:20 MSK)

TimeoutException — 1 occurrence(s) across 1 pipeline(s)

selenium.common.exceptions.TimeoutException: Message: Ожидаем элемент в DOM: "[data-locator="book_again_btn"]", параметры метода ожидания: ([
    "css selector",
    "None",
    "[data-locator=\"book_again_btn\"]",
    "<autotests.lib.apps.yclients.client.booking.web.pages.created_booking.CreatedBookingPage object at 0x7f0e31bc6e70>"
]), условия ожидания: ([
    "timeout: 25s"
])
Stacktrace:
#0 0x5631ee4665e3 <unknown>
#1 0x5631ee1290b7 <unknown>
#2 0x5631ee176f53 <unknown>
#3 0x5631ee177051 <unknown>
#4 0x5631ee1bc9c4 <unknown>
#5 0x5631ee19df1d <unknown>
#6 0x5631ee1b9b3d <unknown>
#7 0x5631ee19dcc3 <unknown>
#8 0x5631ee1690e4 <unknown>
#9 0x5631ee16a0ae <unknown>
#10 0x5631ee42cce1 <unknown>
#11 0x5631ee430b7e <unknown>
#12 0x5631ee41a4b5 <unknown>
#13 0x5631ee4317d6 <unknown>
#14 0x5631ee3fddbf <unknown>
#15 0x5631ee454748 <unknown>
#16 0x5631ee454917 <unknown>
#17 0x5631ee465773 <unknown>
#18 0x7fcc25c38aa4 <unknown>
#19 0x7fcc25cc5a64 __clone

Stacktrace:

suite/yclients/client/booking/web/online_booking/test_master_default.py:2796 in test_master_step_hidden_create_booking_book_more_btn
lib/apps/yclients/client/booking/web/pages/created_booking.py:65 in button_book_again_text
lib/common/ui/pages/web.py:61 in decorated
lib/common/ui/pages/web.py:148 in wait_for_element
lib/ui/selenium/webdriver/support/wait.py:28 in until

Seen in: - altegio/biz.erp#227749 — shard 2 — launch 171616 (×1, last 2026-10-02 08:20 MSK)

TimeoutException — 1 occurrence(s) across 1 pipeline(s)

selenium.common.exceptions.TimeoutException: Message: Ожидаем элемент в DOM: "[data-locator="book_again_btn"]", параметры метода ожидания: ([
    "css selector",
    "None",
    "[data-locator=\"book_again_btn\"]",
    "<autotests.lib.apps.yclients.client.booking.web.pages.created_booking.CreatedBookingPage object at 0x7ffadc1b3680>"
]), условия ожидания: ([
    "timeout: 25s"
])
Stacktrace:
#0 0x564c838985e3 <unknown>
#1 0x564c8355b0b7 <unknown>
#2 0x564c835a8f53 <unknown>
#3 0x564c835a9051 <unknown>
#4 0x564c835ee9c4 <unknown>
#5 0x564c835cff1d <unknown>
#6 0x564c835ebb3d <unknown>
#7 0x564c835cfcc3 <unknown>
#8 0x564c8359b0e4 <unknown>
#9 0x564c8359c0ae <unknown>
#10 0x564c8385ece1 <unknown>
#11 0x564c83862b7e <unknown>
#12 0x564c8384c4b5 <unknown>
#13 0x564c838637d6 <unknown>
#14 0x564c8382fdbf <unknown>
#15 0x564c83886748 <unknown>
#16 0x564c83886917 <unknown>
#17 0x564c83897773 <unknown>
#18 0x7fa6a0363aa4 <unknown>
#19 0x7fa6a03f0a64 __clone

Stacktrace:

suite/yclients/client/booking/web/online_booking/test_master_default.py:2796 in test_master_step_hidden_create_booking_book_more_btn
lib/apps/yclients/client/booking/web/pages/created_booking.py:65 in button_book_again_text
lib/common/ui/pages/web.py:61 in decorated
lib/common/ui/pages/web.py:148 in wait_for_element
lib/ui/selenium/webdriver/support/wait.py:28 in until

Seen in: - altegio/biz.erp#227787 — shard 1 — launch 171752 (×1, last 2026-10-02 11:50 MSK)

WebDriverException — 1 occurrence(s) across 1 pipeline(s)

selenium.common.exceptions.WebDriverException: Message: <unknown>: Failed to read the 'localStorage' property from 'Window': Access is denied for this document.
  (Session info: headless chrome=119.0.6045.199)
Stacktrace:
#0 0x56197366d5e3 <unknown>
#1 0x5619733300b7 <unknown>
#2 0x5619733362b5 <unknown>
#3 0x5619733389b1 <unknown>
#4 0x5619733c171f <unknown>
#5 0x5619733a4ef2 <unknown>
#6 0x5619733c0b3d <unknown>
#7 0x5619733a4cc3 <unknown>
#8 0x5619733700e4 <unknown>
#9 0x5619733710ae <unknown>
#10 0x561973633ce1 <unknown>
#11 0x561973637b7e <unknown>
#12 0x5619736214b5 <unknown>
#13 0x5619736387d6 <unknown>
#14 0x561973604dbf <unknown>
#15 0x56197365b748 <unknown>
#16 0x56197365b917 <unknown>
#17 0x56197366c773 <unknown>
#18 0x7f0c505a8aa4 <unknown>
#19 0x7f0c50635a64 __clone

Stacktrace:

lib/common/ui/pages/web.py:61 in decorated
lib/apps/yclients/client/booking/web/pages/__init__.py:80 in open
lib/common/ui/pages/web.py:61 in decorated
lib/apps/yclients/client/booking/web/pages/__init__.py:41 in set_environment
lib/ui/selenium/webdriver/__init__.py:52 in execute_script

Seen in: - altegio/client.booking#224668 — shard 8 — launch 165208 (×1, last 2026-09-21 08:16 MSK)

WebDriverException — 1 occurrence(s) across 1 pipeline(s)

selenium.common.exceptions.WebDriverException: Message: <unknown>: Failed to read the 'localStorage' property from 'Window': Access is denied for this document.
  (Session info: headless chrome=119.0.6045.199)
Stacktrace:
#0 0x563aaf2645e3 <unknown>
#1 0x563aaef270b7 <unknown>
#2 0x563aaef2d2b5 <unknown>
#3 0x563aaef2f9b1 <unknown>
#4 0x563aaefb871f <unknown>
#5 0x563aaef9bef2 <unknown>
#6 0x563aaefb7b3d <unknown>
#7 0x563aaef9bcc3 <unknown>
#8 0x563aaef670e4 <unknown>
#9 0x563aaef680ae <unknown>
#10 0x563aaf22ace1 <unknown>
#11 0x563aaf22eb7e <unknown>
#12 0x563aaf2184b5 <unknown>
#13 0x563aaf22f7d6 <unknown>
#14 0x563aaf1fbdbf <unknown>
#15 0x563aaf252748 <unknown>
#16 0x563aaf252917 <unknown>
#17 0x563aaf263773 <unknown>
#18 0x7f0543969aa4 <unknown>
#19 0x7f05439f6a64 __clone

Stacktrace:

lib/common/ui/pages/web.py:61 in decorated
lib/apps/yclients/client/booking/web/pages/__init__.py:80 in open
lib/common/ui/pages/web.py:61 in decorated
lib/apps/yclients/client/booking/web/pages/__init__.py:41 in set_environment
lib/ui/selenium/webdriver/__init__.py:52 in execute_script

Seen in: - altegio/client.booking#224668 — shard 8 — launch 165208 (×1, last 2026-09-21 08:16 MSK)

WebDriverException — 1 occurrence(s) across 1 pipeline(s)

selenium.common.exceptions.WebDriverException: Message: <unknown>: Failed to read the 'localStorage' property from 'Window': Access is denied for this document.
  (Session info: headless chrome=119.0.6045.199)
Stacktrace:
#0 0x55a16ddf65e3 <unknown>
#1 0x55a16dab90b7 <unknown>
#2 0x55a16dabf2b5 <unknown>
#3 0x55a16dac19b1 <unknown>
#4 0x55a16db4a71f <unknown>
#5 0x55a16db2def2 <unknown>
#6 0x55a16db49b3d <unknown>
#7 0x55a16db2dcc3 <unknown>
#8 0x55a16daf90e4 <unknown>
#9 0x55a16dafa0ae <unknown>
#10 0x55a16ddbcce1 <unknown>
#11 0x55a16ddc0b7e <unknown>
#12 0x55a16ddaa4b5 <unknown>
#13 0x55a16ddc17d6 <unknown>
#14 0x55a16dd8ddbf <unknown>
#15 0x55a16dde4748 <unknown>
#16 0x55a16dde4917 <unknown>
#17 0x55a16ddf5773 <unknown>
#18 0x7fbe21ef5aa4 <unknown>
#19 0x7fbe21f82a64 __clone

Stacktrace:

lib/common/ui/pages/web.py:61 in decorated
lib/apps/yclients/client/booking/web/pages/__init__.py:80 in open
lib/common/ui/pages/web.py:61 in decorated
lib/apps/yclients/client/booking/web/pages/__init__.py:41 in set_environment
lib/ui/selenium/webdriver/__init__.py:52 in execute_script

Seen in: - altegio/client.booking#224668 — shard 8 — launch 165208 (×1, last 2026-09-21 08:16 MSK)