Создание записи со страницы успешной записи¶
со скрытыми шагами услуги и сотрудника ("Записаться ещё") (меню)
test_menu_service_and_master_step_hidden_create_booking_book_more
Failures in last 30 days: 14
Generated at 2026-10-08 03:48 MSK
Last failure: 2026-10-02 11:50 MSK
Filter: pipelines with sandbox_biz_erp ∈ {master, testops-dev} AND autotests_branch ∈ {master, main} only (testops-dev — daytime ticks since 2026-08-05).
By exception class:
- TimeoutException — 11
- WebDriverException — 3
Failure signatures (grouped by exception + full message):
TimeoutException — 1 occurrence(s) across 1 pipeline(s)¶
selenium.common.exceptions.TimeoutException: Message: Ожидаем элемент в DOM: "[data-locator="timeslot"]", параметры метода ожидания: ([
"css selector",
"None",
"[data-locator=\"timeslot\"]",
"<autotests.lib.apps.yclients.client.booking.web.pages.select_time.SelectTimePage object at 0x7fde026ab950>"
]), условия ожидания: ([
"timeout: 25s"
])
Stacktrace:
#0 0x561c4d53e5e3 <unknown>
#1 0x561c4d2010b7 <unknown>
#2 0x561c4d24ef53 <unknown>
#3 0x561c4d24f051 <unknown>
#4 0x561c4d2949c4 <unknown>
#5 0x561c4d275f1d <unknown>
#6 0x561c4d291b3d <unknown>
#7 0x561c4d275cc3 <unknown>
#8 0x561c4d2410e4 <unknown>
#9 0x561c4d2420ae <unknown>
#10 0x561c4d504ce1 <unknown>
#11 0x561c4d508b7e <unknown>
#12 0x561c4d4f24b5 <unknown>
#13 0x561c4d5097d6 <unknown>
#14 0x561c4d4d5dbf <unknown>
#15 0x561c4d52c748 <unknown>
#16 0x561c4d52c917 <unknown>
#17 0x561c4d53d773 <unknown>
#18 0x7ff88f53daa4 <unknown>
#19 0x7ff88f5caa64 __clone
Exception: There are no available spots for this day
Stacktrace:
suite/yclients/client/booking/web/online_booking/menu_scenario/test_create_booking.py:521 in test_menu_service_and_master_step_hidden_create_booking_book_more
lib/common/ui/pages/web.py:61 in decorated
lib/apps/yclients/client/booking/web/pages/select_time.py:302 in select_date_and_time
lib/common/ui/pages/web.py:61 in decorated
lib/apps/yclients/client/booking/web/pages/select_time.py:351 in select_time
Seen in: - altegio/biz.erp#227722 — shard 3 — launch 171516 (×1, last 2026-10-02 04:26 MSK)
TimeoutException — 1 occurrence(s) across 1 pipeline(s)¶
selenium.common.exceptions.TimeoutException: Message: Ожидаем элемент в DOM: "[data-locator="timeslot"]", параметры метода ожидания: ([
"css selector",
"None",
"[data-locator=\"timeslot\"]",
"<autotests.lib.apps.yclients.client.booking.web.pages.select_time.SelectTimePage object at 0x7fdcf4483770>"
]), условия ожидания: ([
"timeout: 25s"
])
Stacktrace:
#0 0x55ed717cc5e3 <unknown>
#1 0x55ed7148f0b7 <unknown>
#2 0x55ed714dcf53 <unknown>
#3 0x55ed714dd051 <unknown>
#4 0x55ed715229c4 <unknown>
#5 0x55ed71503f1d <unknown>
#6 0x55ed7151fb3d <unknown>
#7 0x55ed71503cc3 <unknown>
#8 0x55ed714cf0e4 <unknown>
#9 0x55ed714d00ae <unknown>
#10 0x55ed71792ce1 <unknown>
#11 0x55ed71796b7e <unknown>
#12 0x55ed717804b5 <unknown>
#13 0x55ed717977d6 <unknown>
#14 0x55ed71763dbf <unknown>
#15 0x55ed717ba748 <unknown>
#16 0x55ed717ba917 <unknown>
#17 0x55ed717cb773 <unknown>
#18 0x7f3a14b1daa4 <unknown>
#19 0x7f3a14baaa64 __clone
Exception: There are no available spots for this day
Stacktrace:
suite/yclients/client/booking/web/online_booking/menu_scenario/test_create_booking.py:521 in test_menu_service_and_master_step_hidden_create_booking_book_more
lib/common/ui/pages/web.py:61 in decorated
lib/apps/yclients/client/booking/web/pages/select_time.py:302 in select_date_and_time
lib/common/ui/pages/web.py:61 in decorated
lib/apps/yclients/client/booking/web/pages/select_time.py:351 in select_time
Seen in: - altegio/biz.erp#227722 — shard 3 — launch 171516 (×1, last 2026-10-02 04:26 MSK)
TimeoutException — 1 occurrence(s) across 1 pipeline(s)¶
selenium.common.exceptions.TimeoutException: Message: Ожидаем элемент в DOM: "[data-locator="timeslot"]", параметры метода ожидания: ([
"css selector",
"None",
"[data-locator=\"timeslot\"]",
"<autotests.lib.apps.yclients.client.booking.web.pages.select_time.SelectTimePage object at 0x7feb21e9d370>"
]), условия ожидания: ([
"timeout: 25s"
])
Stacktrace:
#0 0x55ff2bf9e5e3 <unknown>
#1 0x55ff2bc610b7 <unknown>
#2 0x55ff2bcaef53 <unknown>
#3 0x55ff2bcaf051 <unknown>
#4 0x55ff2bcf49c4 <unknown>
#5 0x55ff2bcd5f1d <unknown>
#6 0x55ff2bcf1b3d <unknown>
#7 0x55ff2bcd5cc3 <unknown>
#8 0x55ff2bca10e4 <unknown>
#9 0x55ff2bca20ae <unknown>
#10 0x55ff2bf64ce1 <unknown>
#11 0x55ff2bf68b7e <unknown>
#12 0x55ff2bf524b5 <unknown>
#13 0x55ff2bf697d6 <unknown>
#14 0x55ff2bf35dbf <unknown>
#15 0x55ff2bf8c748 <unknown>
#16 0x55ff2bf8c917 <unknown>
#17 0x55ff2bf9d773 <unknown>
#18 0x7f49b1a0baa4 <unknown>
#19 0x7f49b1a98a64 __clone
Exception: There are no available spots for this day
Stacktrace:
suite/yclients/client/booking/web/online_booking/menu_scenario/test_create_booking.py:521 in test_menu_service_and_master_step_hidden_create_booking_book_more
lib/common/ui/pages/web.py:61 in decorated
lib/apps/yclients/client/booking/web/pages/select_time.py:302 in select_date_and_time
lib/common/ui/pages/web.py:61 in decorated
lib/apps/yclients/client/booking/web/pages/select_time.py:351 in select_time
Seen in: - altegio/biz.erp#227722 — shard 3 — launch 171516 (×1, last 2026-10-02 04:26 MSK)
TimeoutException — 1 occurrence(s) across 1 pipeline(s)¶
selenium.common.exceptions.TimeoutException: Message: Ожидаем элемент в DOM: "[data-locator="timeslot"]", параметры метода ожидания: ([
"css selector",
"None",
"[data-locator=\"timeslot\"]",
"<autotests.lib.apps.yclients.client.booking.web.pages.select_time.SelectTimePage object at 0x7f902c734860>"
]), условия ожидания: ([
"timeout: 25s"
])
Stacktrace:
#0 0x55907ce285e3 <unknown>
#1 0x55907caeb0b7 <unknown>
#2 0x55907cb38f53 <unknown>
#3 0x55907cb39051 <unknown>
#4 0x55907cb7e9c4 <unknown>
#5 0x55907cb5ff1d <unknown>
#6 0x55907cb7bb3d <unknown>
#7 0x55907cb5fcc3 <unknown>
#8 0x55907cb2b0e4 <unknown>
#9 0x55907cb2c0ae <unknown>
#10 0x55907cdeece1 <unknown>
#11 0x55907cdf2b7e <unknown>
#12 0x55907cddc4b5 <unknown>
#13 0x55907cdf37d6 <unknown>
#14 0x55907cdbfdbf <unknown>
#15 0x55907ce16748 <unknown>
#16 0x55907ce16917 <unknown>
#17 0x55907ce27773 <unknown>
#18 0x7f80b622aaa4 <unknown>
#19 0x7f80b62b7a64 __clone
Exception: There are no available spots for this day
Stacktrace:
suite/yclients/client/booking/web/online_booking/menu_scenario/test_create_booking.py:521 in test_menu_service_and_master_step_hidden_create_booking_book_more
lib/common/ui/pages/web.py:61 in decorated
lib/apps/yclients/client/booking/web/pages/select_time.py:302 in select_date_and_time
lib/common/ui/pages/web.py:61 in decorated
lib/apps/yclients/client/booking/web/pages/select_time.py:351 in select_time
Seen in: - altegio/biz.erp#227735 — shard 4 — launch 171549 (×1, last 2026-10-02 06:23 MSK)
TimeoutException — 1 occurrence(s) across 1 pipeline(s)¶
selenium.common.exceptions.TimeoutException: Message: Ожидаем элемент в DOM: "[data-locator="timeslot"]", параметры метода ожидания: ([
"css selector",
"None",
"[data-locator=\"timeslot\"]",
"<autotests.lib.apps.yclients.client.booking.web.pages.select_time.SelectTimePage object at 0x7fb73841d220>"
]), условия ожидания: ([
"timeout: 25s"
])
Stacktrace:
#0 0x55da44b095e3 <unknown>
#1 0x55da447cc0b7 <unknown>
#2 0x55da44819f53 <unknown>
#3 0x55da4481a051 <unknown>
#4 0x55da4485f9c4 <unknown>
#5 0x55da44840f1d <unknown>
#6 0x55da4485cb3d <unknown>
#7 0x55da44840cc3 <unknown>
#8 0x55da4480c0e4 <unknown>
#9 0x55da4480d0ae <unknown>
#10 0x55da44acfce1 <unknown>
#11 0x55da44ad3b7e <unknown>
#12 0x55da44abd4b5 <unknown>
#13 0x55da44ad47d6 <unknown>
#14 0x55da44aa0dbf <unknown>
#15 0x55da44af7748 <unknown>
#16 0x55da44af7917 <unknown>
#17 0x55da44b08773 <unknown>
#18 0x7f0b4062caa4 <unknown>
#19 0x7f0b406b9a64 __clone
Exception: There are no available spots for this day
Stacktrace:
suite/yclients/client/booking/web/online_booking/menu_scenario/test_create_booking.py:521 in test_menu_service_and_master_step_hidden_create_booking_book_more
lib/common/ui/pages/web.py:61 in decorated
lib/apps/yclients/client/booking/web/pages/select_time.py:302 in select_date_and_time
lib/common/ui/pages/web.py:61 in decorated
lib/apps/yclients/client/booking/web/pages/select_time.py:351 in select_time
Seen in: - altegio/biz.erp#227735 — shard 4 — launch 171549 (×1, last 2026-10-02 06:23 MSK)
TimeoutException — 1 occurrence(s) across 1 pipeline(s)¶
selenium.common.exceptions.TimeoutException: Message: Ожидаем элемент в DOM: "[data-locator="timeslot"]", параметры метода ожидания: ([
"css selector",
"None",
"[data-locator=\"timeslot\"]",
"<autotests.lib.apps.yclients.client.booking.web.pages.select_time.SelectTimePage object at 0x7f6689f1c0b0>"
]), условия ожидания: ([
"timeout: 25s"
])
Stacktrace:
#0 0x5592c383c5e3 <unknown>
#1 0x5592c34ff0b7 <unknown>
#2 0x5592c354cf53 <unknown>
#3 0x5592c354d051 <unknown>
#4 0x5592c35929c4 <unknown>
#5 0x5592c3573f1d <unknown>
#6 0x5592c358fb3d <unknown>
#7 0x5592c3573cc3 <unknown>
#8 0x5592c353f0e4 <unknown>
#9 0x5592c35400ae <unknown>
#10 0x5592c3802ce1 <unknown>
#11 0x5592c3806b7e <unknown>
#12 0x5592c37f04b5 <unknown>
#13 0x5592c38077d6 <unknown>
#14 0x5592c37d3dbf <unknown>
#15 0x5592c382a748 <unknown>
#16 0x5592c382a917 <unknown>
#17 0x5592c383b773 <unknown>
#18 0x7f18e7f85aa4 <unknown>
#19 0x7f18e8012a64 __clone
Exception: There are no available spots for this day
Stacktrace:
suite/yclients/client/booking/web/online_booking/menu_scenario/test_create_booking.py:521 in test_menu_service_and_master_step_hidden_create_booking_book_more
lib/common/ui/pages/web.py:61 in decorated
lib/apps/yclients/client/booking/web/pages/select_time.py:302 in select_date_and_time
lib/common/ui/pages/web.py:61 in decorated
lib/apps/yclients/client/booking/web/pages/select_time.py:351 in select_time
Seen in: - altegio/biz.erp#227735 — shard 4 — launch 171549 (×1, last 2026-10-02 06:23 MSK)
TimeoutException — 1 occurrence(s) across 1 pipeline(s)¶
selenium.common.exceptions.TimeoutException: Message: Ожидаем элемент в DOM: "[data-locator="book_again_btn"]", параметры метода ожидания: ([
"css selector",
"None",
"[data-locator=\"book_again_btn\"]",
"<autotests.lib.apps.yclients.client.booking.web.pages.created_booking.CreatedBookingPage object at 0x7ff945da9400>"
]), условия ожидания: ([
"timeout: 25s"
])
Stacktrace:
#0 0x5611d5fd15e3 <unknown>
#1 0x5611d5c940b7 <unknown>
#2 0x5611d5ce1f53 <unknown>
#3 0x5611d5ce2051 <unknown>
#4 0x5611d5d279c4 <unknown>
#5 0x5611d5d08f1d <unknown>
#6 0x5611d5d24b3d <unknown>
#7 0x5611d5d08cc3 <unknown>
#8 0x5611d5cd40e4 <unknown>
#9 0x5611d5cd50ae <unknown>
#10 0x5611d5f97ce1 <unknown>
#11 0x5611d5f9bb7e <unknown>
#12 0x5611d5f854b5 <unknown>
#13 0x5611d5f9c7d6 <unknown>
#14 0x5611d5f68dbf <unknown>
#15 0x5611d5fbf748 <unknown>
#16 0x5611d5fbf917 <unknown>
#17 0x5611d5fd0773 <unknown>
#18 0x7f133df85aa4 <unknown>
#19 0x7f133e012a64 __clone
Stacktrace:
lib/common/ui/pages/web.py:61 in decorated
lib/apps/yclients/client/booking/web/pages/created_booking.py:315 in click_book_more
lib/common/ui/pages/web.py:61 in decorated
lib/common/ui/pages/web.py:148 in wait_for_element
lib/ui/selenium/webdriver/support/wait.py:28 in until
Seen in: - altegio/biz.erp#227749 — shard 2 — launch 171616 (×1, last 2026-10-02 08:20 MSK)
TimeoutException — 1 occurrence(s) across 1 pipeline(s)¶
selenium.common.exceptions.TimeoutException: Message: Ожидаем элемент в DOM: "[data-locator="book_again_btn"]", параметры метода ожидания: ([
"css selector",
"None",
"[data-locator=\"book_again_btn\"]",
"<autotests.lib.apps.yclients.client.booking.web.pages.created_booking.CreatedBookingPage object at 0x7f8b1457fad0>"
]), условия ожидания: ([
"timeout: 25s"
])
Stacktrace:
#0 0x563a49db25e3 <unknown>
#1 0x563a49a750b7 <unknown>
#2 0x563a49ac2f53 <unknown>
#3 0x563a49ac3051 <unknown>
#4 0x563a49b089c4 <unknown>
#5 0x563a49ae9f1d <unknown>
#6 0x563a49b05b3d <unknown>
#7 0x563a49ae9cc3 <unknown>
#8 0x563a49ab50e4 <unknown>
#9 0x563a49ab60ae <unknown>
#10 0x563a49d78ce1 <unknown>
#11 0x563a49d7cb7e <unknown>
#12 0x563a49d664b5 <unknown>
#13 0x563a49d7d7d6 <unknown>
#14 0x563a49d49dbf <unknown>
#15 0x563a49da0748 <unknown>
#16 0x563a49da0917 <unknown>
#17 0x563a49db1773 <unknown>
#18 0x7fce55c55aa4 <unknown>
#19 0x7fce55ce2a64 __clone
Stacktrace:
lib/common/ui/pages/web.py:61 in decorated
lib/apps/yclients/client/booking/web/pages/created_booking.py:315 in click_book_more
lib/common/ui/pages/web.py:61 in decorated
lib/common/ui/pages/web.py:148 in wait_for_element
lib/ui/selenium/webdriver/support/wait.py:28 in until
Seen in: - altegio/biz.erp#227749 — shard 2 — launch 171616 (×1, last 2026-10-02 08:20 MSK)
TimeoutException — 1 occurrence(s) across 1 pipeline(s)¶
selenium.common.exceptions.TimeoutException: Message: Ожидаем элемент в DOM: "[data-locator="book_again_btn"]", параметры метода ожидания: ([
"css selector",
"None",
"[data-locator=\"book_again_btn\"]",
"<autotests.lib.apps.yclients.client.booking.web.pages.created_booking.CreatedBookingPage object at 0x7fe6f8b43bf0>"
]), условия ожидания: ([
"timeout: 25s"
])
Stacktrace:
#0 0x5599064255e3 <unknown>
#1 0x5599060e80b7 <unknown>
#2 0x559906135f53 <unknown>
#3 0x559906136051 <unknown>
#4 0x55990617b9c4 <unknown>
#5 0x55990615cf1d <unknown>
#6 0x559906178b3d <unknown>
#7 0x55990615ccc3 <unknown>
#8 0x5599061280e4 <unknown>
#9 0x5599061290ae <unknown>
#10 0x5599063ebce1 <unknown>
#11 0x5599063efb7e <unknown>
#12 0x5599063d94b5 <unknown>
#13 0x5599063f07d6 <unknown>
#14 0x5599063bcdbf <unknown>
#15 0x559906413748 <unknown>
#16 0x559906413917 <unknown>
#17 0x559906424773 <unknown>
#18 0x7f762af72aa4 <unknown>
#19 0x7f762afffa64 __clone
Stacktrace:
lib/common/ui/pages/web.py:61 in decorated
lib/apps/yclients/client/booking/web/pages/created_booking.py:315 in click_book_more
lib/common/ui/pages/web.py:61 in decorated
lib/common/ui/pages/web.py:148 in wait_for_element
lib/ui/selenium/webdriver/support/wait.py:28 in until
Seen in: - altegio/biz.erp#227749 — shard 2 — launch 171616 (×1, last 2026-10-02 08:20 MSK)
TimeoutException — 1 occurrence(s) across 1 pipeline(s)¶
selenium.common.exceptions.TimeoutException: Message: Ожидаем элемент в DOM: "[data-locator="book_again_btn"]", параметры метода ожидания: ([
"css selector",
"None",
"[data-locator=\"book_again_btn\"]",
"<autotests.lib.apps.yclients.client.booking.web.pages.created_booking.CreatedBookingPage object at 0x7f0448250e00>"
]), условия ожидания: ([
"timeout: 25s"
])
Stacktrace:
#0 0x55c7eeece5e3 <unknown>
#1 0x55c7eeb910b7 <unknown>
#2 0x55c7eebdef53 <unknown>
#3 0x55c7eebdf051 <unknown>
#4 0x55c7eec249c4 <unknown>
#5 0x55c7eec05f1d <unknown>
#6 0x55c7eec21b3d <unknown>
#7 0x55c7eec05cc3 <unknown>
#8 0x55c7eebd10e4 <unknown>
#9 0x55c7eebd20ae <unknown>
#10 0x55c7eee94ce1 <unknown>
#11 0x55c7eee98b7e <unknown>
#12 0x55c7eee824b5 <unknown>
#13 0x55c7eee997d6 <unknown>
#14 0x55c7eee65dbf <unknown>
#15 0x55c7eeebc748 <unknown>
#16 0x55c7eeebc917 <unknown>
#17 0x55c7eeecd773 <unknown>
#18 0x7f57bd247aa4 <unknown>
#19 0x7f57bd2d4a64 __clone
Stacktrace:
lib/common/ui/pages/web.py:61 in decorated
lib/apps/yclients/client/booking/web/pages/created_booking.py:315 in click_book_more
lib/common/ui/pages/web.py:61 in decorated
lib/common/ui/pages/web.py:148 in wait_for_element
lib/ui/selenium/webdriver/support/wait.py:28 in until
Seen in: - altegio/biz.erp#227787 — shard 2 — launch 171752 (×1, last 2026-10-02 11:50 MSK)
TimeoutException — 1 occurrence(s) across 1 pipeline(s)¶
selenium.common.exceptions.TimeoutException: Message: Ожидаем элемент в DOM: "[data-locator="book_again_btn"]", параметры метода ожидания: ([
"css selector",
"None",
"[data-locator=\"book_again_btn\"]",
"<autotests.lib.apps.yclients.client.booking.web.pages.created_booking.CreatedBookingPage object at 0x7f64acd42960>"
]), условия ожидания: ([
"timeout: 25s"
])
Stacktrace:
#0 0x55bb08d145e3 <unknown>
#1 0x55bb089d70b7 <unknown>
#2 0x55bb08a24f53 <unknown>
#3 0x55bb08a25051 <unknown>
#4 0x55bb08a6a9c4 <unknown>
#5 0x55bb08a4bf1d <unknown>
#6 0x55bb08a67b3d <unknown>
#7 0x55bb08a4bcc3 <unknown>
#8 0x55bb08a170e4 <unknown>
#9 0x55bb08a180ae <unknown>
#10 0x55bb08cdace1 <unknown>
#11 0x55bb08cdeb7e <unknown>
#12 0x55bb08cc84b5 <unknown>
#13 0x55bb08cdf7d6 <unknown>
#14 0x55bb08cabdbf <unknown>
#15 0x55bb08d02748 <unknown>
#16 0x55bb08d02917 <unknown>
#17 0x55bb08d13773 <unknown>
#18 0x7fb02375daa4 <unknown>
#19 0x7fb0237eaa64 __clone
Stacktrace:
lib/common/ui/pages/web.py:61 in decorated
lib/apps/yclients/client/booking/web/pages/created_booking.py:315 in click_book_more
lib/common/ui/pages/web.py:61 in decorated
lib/common/ui/pages/web.py:148 in wait_for_element
lib/ui/selenium/webdriver/support/wait.py:28 in until
Seen in: - altegio/biz.erp#227787 — shard 2 — launch 171752 (×1, last 2026-10-02 11:50 MSK)
WebDriverException — 1 occurrence(s) across 1 pipeline(s)¶
selenium.common.exceptions.WebDriverException: Message: <unknown>: Failed to read the 'localStorage' property from 'Window': Access is denied for this document.
(Session info: headless chrome=119.0.6045.199)
Stacktrace:
#0 0x55c5d63a55e3 <unknown>
#1 0x55c5d60680b7 <unknown>
#2 0x55c5d606e2b5 <unknown>
#3 0x55c5d60709b1 <unknown>
#4 0x55c5d60f971f <unknown>
#5 0x55c5d60dcef2 <unknown>
#6 0x55c5d60f8b3d <unknown>
#7 0x55c5d60dccc3 <unknown>
#8 0x55c5d60a80e4 <unknown>
#9 0x55c5d60a90ae <unknown>
#10 0x55c5d636bce1 <unknown>
#11 0x55c5d636fb7e <unknown>
#12 0x55c5d63594b5 <unknown>
#13 0x55c5d63707d6 <unknown>
#14 0x55c5d633cdbf <unknown>
#15 0x55c5d6393748 <unknown>
#16 0x55c5d6393917 <unknown>
#17 0x55c5d63a4773 <unknown>
#18 0x7f03ad28caa4 <unknown>
#19 0x7f03ad319a64 __clone
Stacktrace:
lib/common/ui/pages/web.py:61 in decorated
lib/apps/yclients/client/booking/web/pages/__init__.py:80 in open
lib/common/ui/pages/web.py:61 in decorated
lib/apps/yclients/client/booking/web/pages/__init__.py:41 in set_environment
lib/ui/selenium/webdriver/__init__.py:52 in execute_script
Seen in: - altegio/client.booking#224668 — shard 2 — launch 165208 (×1, last 2026-09-21 08:16 MSK)
WebDriverException — 1 occurrence(s) across 1 pipeline(s)¶
selenium.common.exceptions.WebDriverException: Message: <unknown>: Failed to read the 'localStorage' property from 'Window': Access is denied for this document.
(Session info: headless chrome=119.0.6045.199)
Stacktrace:
#0 0x564b443cd5e3 <unknown>
#1 0x564b440900b7 <unknown>
#2 0x564b440962b5 <unknown>
#3 0x564b440989b1 <unknown>
#4 0x564b4412171f <unknown>
#5 0x564b44104ef2 <unknown>
#6 0x564b44120b3d <unknown>
#7 0x564b44104cc3 <unknown>
#8 0x564b440d00e4 <unknown>
#9 0x564b440d10ae <unknown>
#10 0x564b44393ce1 <unknown>
#11 0x564b44397b7e <unknown>
#12 0x564b443814b5 <unknown>
#13 0x564b443987d6 <unknown>
#14 0x564b44364dbf <unknown>
#15 0x564b443bb748 <unknown>
#16 0x564b443bb917 <unknown>
#17 0x564b443cc773 <unknown>
#18 0x7fd518349aa4 <unknown>
#19 0x7fd5183d6a64 __clone
Stacktrace:
lib/common/ui/pages/web.py:61 in decorated
lib/apps/yclients/client/booking/web/pages/__init__.py:80 in open
lib/common/ui/pages/web.py:61 in decorated
lib/apps/yclients/client/booking/web/pages/__init__.py:41 in set_environment
lib/ui/selenium/webdriver/__init__.py:52 in execute_script
Seen in: - altegio/client.booking#224668 — shard 2 — launch 165208 (×1, last 2026-09-21 08:16 MSK)
WebDriverException — 1 occurrence(s) across 1 pipeline(s)¶
selenium.common.exceptions.WebDriverException: Message: <unknown>: Failed to read the 'localStorage' property from 'Window': Access is denied for this document.
(Session info: headless chrome=119.0.6045.199)
Stacktrace:
#0 0x5620bd7ae5e3 <unknown>
#1 0x5620bd4710b7 <unknown>
#2 0x5620bd4772b5 <unknown>
#3 0x5620bd4799b1 <unknown>
#4 0x5620bd50271f <unknown>
#5 0x5620bd4e5ef2 <unknown>
#6 0x5620bd501b3d <unknown>
#7 0x5620bd4e5cc3 <unknown>
#8 0x5620bd4b10e4 <unknown>
#9 0x5620bd4b20ae <unknown>
#10 0x5620bd774ce1 <unknown>
#11 0x5620bd778b7e <unknown>
#12 0x5620bd7624b5 <unknown>
#13 0x5620bd7797d6 <unknown>
#14 0x5620bd745dbf <unknown>
#15 0x5620bd79c748 <unknown>
#16 0x5620bd79c917 <unknown>
#17 0x5620bd7ad773 <unknown>
#18 0x7f78b095aaa4 <unknown>
#19 0x7f78b09e7a64 __clone
Stacktrace:
lib/common/ui/pages/web.py:61 in decorated
lib/apps/yclients/client/booking/web/pages/__init__.py:80 in open
lib/common/ui/pages/web.py:61 in decorated
lib/apps/yclients/client/booking/web/pages/__init__.py:41 in set_environment
lib/ui/selenium/webdriver/__init__.py:52 in execute_script
Seen in: - altegio/client.booking#224668 — shard 2 — launch 165208 (×1, last 2026-09-21 08:16 MSK)