Создание записи со страницы¶
успешной записи со скрытым шагом услуги ("Записаться ещё") (меню)
test_menu_service_step_hidden_create_booking_book_more
Failures in last 30 days: 14
Generated at 2026-10-08 03:48 MSK
Last failure: 2026-10-02 11:50 MSK
Filter: pipelines with sandbox_biz_erp ∈ {master, testops-dev} AND autotests_branch ∈ {master, main} only (testops-dev — daytime ticks since 2026-08-05).
By exception class:
- TimeoutException — 11
- WebDriverException — 3
Failure signatures (grouped by exception + full message):
TimeoutException — 1 occurrence(s) across 1 pipeline(s)¶
selenium.common.exceptions.TimeoutException: Message: Ожидаем элемент в DOM: "[data-locator="timeslot"]", параметры метода ожидания: ([
"css selector",
"None",
"[data-locator=\"timeslot\"]",
"<autotests.lib.apps.yclients.client.booking.web.pages.select_time.SelectTimePage object at 0x7fd1681f95e0>"
]), условия ожидания: ([
"timeout: 25s"
])
Stacktrace:
#0 0x563109ee35e3 <unknown>
#1 0x563109ba60b7 <unknown>
#2 0x563109bf3f53 <unknown>
#3 0x563109bf4051 <unknown>
#4 0x563109c399c4 <unknown>
#5 0x563109c1af1d <unknown>
#6 0x563109c36b3d <unknown>
#7 0x563109c1acc3 <unknown>
#8 0x563109be60e4 <unknown>
#9 0x563109be70ae <unknown>
#10 0x563109ea9ce1 <unknown>
#11 0x563109eadb7e <unknown>
#12 0x563109e974b5 <unknown>
#13 0x563109eae7d6 <unknown>
#14 0x563109e7adbf <unknown>
#15 0x563109ed1748 <unknown>
#16 0x563109ed1917 <unknown>
#17 0x563109ee2773 <unknown>
#18 0x7f21e5965aa4 <unknown>
#19 0x7f21e59f2a64 __clone
Exception: There are no available spots for this day
Stacktrace:
suite/yclients/client/booking/web/online_booking/menu_scenario/test_create_booking.py:889 in test_menu_service_step_hidden_create_booking_book_more
lib/common/ui/pages/web.py:61 in decorated
lib/apps/yclients/client/booking/web/pages/select_time.py:302 in select_date_and_time
lib/common/ui/pages/web.py:61 in decorated
lib/apps/yclients/client/booking/web/pages/select_time.py:351 in select_time
Seen in: - altegio/biz.erp#227722 — shard 3 — launch 171516 (×1, last 2026-10-02 04:26 MSK)
TimeoutException — 1 occurrence(s) across 1 pipeline(s)¶
selenium.common.exceptions.TimeoutException: Message: Ожидаем элемент в DOM: "[data-locator="timeslot"]", параметры метода ожидания: ([
"css selector",
"None",
"[data-locator=\"timeslot\"]",
"<autotests.lib.apps.yclients.client.booking.web.pages.select_time.SelectTimePage object at 0x7f067c216570>"
]), условия ожидания: ([
"timeout: 25s"
])
Stacktrace:
#0 0x559389b4b5e3 <unknown>
#1 0x55938980e0b7 <unknown>
#2 0x55938985bf53 <unknown>
#3 0x55938985c051 <unknown>
#4 0x5593898a19c4 <unknown>
#5 0x559389882f1d <unknown>
#6 0x55938989eb3d <unknown>
#7 0x559389882cc3 <unknown>
#8 0x55938984e0e4 <unknown>
#9 0x55938984f0ae <unknown>
#10 0x559389b11ce1 <unknown>
#11 0x559389b15b7e <unknown>
#12 0x559389aff4b5 <unknown>
#13 0x559389b167d6 <unknown>
#14 0x559389ae2dbf <unknown>
#15 0x559389b39748 <unknown>
#16 0x559389b39917 <unknown>
#17 0x559389b4a773 <unknown>
#18 0x7f658573faa4 <unknown>
#19 0x7f65857cca64 __clone
Exception: There are no available spots for this day
Stacktrace:
suite/yclients/client/booking/web/online_booking/menu_scenario/test_create_booking.py:889 in test_menu_service_step_hidden_create_booking_book_more
lib/common/ui/pages/web.py:61 in decorated
lib/apps/yclients/client/booking/web/pages/select_time.py:302 in select_date_and_time
lib/common/ui/pages/web.py:61 in decorated
lib/apps/yclients/client/booking/web/pages/select_time.py:351 in select_time
Seen in: - altegio/biz.erp#227722 — shard 3 — launch 171516 (×1, last 2026-10-02 04:26 MSK)
TimeoutException — 1 occurrence(s) across 1 pipeline(s)¶
selenium.common.exceptions.TimeoutException: Message: Ожидаем элемент в DOM: "[data-locator="timeslot"]", параметры метода ожидания: ([
"css selector",
"None",
"[data-locator=\"timeslot\"]",
"<autotests.lib.apps.yclients.client.booking.web.pages.select_time.SelectTimePage object at 0x7f8c28f49610>"
]), условия ожидания: ([
"timeout: 25s"
])
Stacktrace:
#0 0x56163fc8e5e3 <unknown>
#1 0x56163f9510b7 <unknown>
#2 0x56163f99ef53 <unknown>
#3 0x56163f99f051 <unknown>
#4 0x56163f9e49c4 <unknown>
#5 0x56163f9c5f1d <unknown>
#6 0x56163f9e1b3d <unknown>
#7 0x56163f9c5cc3 <unknown>
#8 0x56163f9910e4 <unknown>
#9 0x56163f9920ae <unknown>
#10 0x56163fc54ce1 <unknown>
#11 0x56163fc58b7e <unknown>
#12 0x56163fc424b5 <unknown>
#13 0x56163fc597d6 <unknown>
#14 0x56163fc25dbf <unknown>
#15 0x56163fc7c748 <unknown>
#16 0x56163fc7c917 <unknown>
#17 0x56163fc8d773 <unknown>
#18 0x7fe491684aa4 <unknown>
#19 0x7fe491711a64 __clone
Exception: There are no available spots for this day
Stacktrace:
suite/yclients/client/booking/web/online_booking/menu_scenario/test_create_booking.py:889 in test_menu_service_step_hidden_create_booking_book_more
lib/common/ui/pages/web.py:61 in decorated
lib/apps/yclients/client/booking/web/pages/select_time.py:302 in select_date_and_time
lib/common/ui/pages/web.py:61 in decorated
lib/apps/yclients/client/booking/web/pages/select_time.py:351 in select_time
Seen in: - altegio/biz.erp#227722 — shard 3 — launch 171516 (×1, last 2026-10-02 04:26 MSK)
TimeoutException — 1 occurrence(s) across 1 pipeline(s)¶
selenium.common.exceptions.TimeoutException: Message: Ожидаем элемент в DOM: "[data-locator="book_again_btn"]", параметры метода ожидания: ([
"css selector",
"None",
"[data-locator=\"book_again_btn\"]",
"<autotests.lib.apps.yclients.client.booking.web.pages.created_booking.CreatedBookingPage object at 0x7fa6e4f1fb90>"
]), условия ожидания: ([
"timeout: 25s"
])
Stacktrace:
#0 0x5604068af5e3 <unknown>
#1 0x5604065720b7 <unknown>
#2 0x5604065bff53 <unknown>
#3 0x5604065c0051 <unknown>
#4 0x5604066059c4 <unknown>
#5 0x5604065e6f1d <unknown>
#6 0x560406602b3d <unknown>
#7 0x5604065e6cc3 <unknown>
#8 0x5604065b20e4 <unknown>
#9 0x5604065b30ae <unknown>
#10 0x560406875ce1 <unknown>
#11 0x560406879b7e <unknown>
#12 0x5604068634b5 <unknown>
#13 0x56040687a7d6 <unknown>
#14 0x560406846dbf <unknown>
#15 0x56040689d748 <unknown>
#16 0x56040689d917 <unknown>
#17 0x5604068ae773 <unknown>
#18 0x7f389715aaa4 <unknown>
#19 0x7f38971e7a64 __clone
Stacktrace:
lib/common/ui/pages/web.py:61 in decorated
lib/apps/yclients/client/booking/web/pages/created_booking.py:315 in click_book_more
lib/common/ui/pages/web.py:61 in decorated
lib/common/ui/pages/web.py:148 in wait_for_element
lib/ui/selenium/webdriver/support/wait.py:28 in until
Seen in: - altegio/biz.erp#227735 — shard 8 — launch 171549 (×1, last 2026-10-02 06:23 MSK)
TimeoutException — 1 occurrence(s) across 1 pipeline(s)¶
selenium.common.exceptions.TimeoutException: Message: Ожидаем элемент в DOM: "[data-locator="timeslot"]", параметры метода ожидания: ([
"css selector",
"None",
"[data-locator=\"timeslot\"]",
"<autotests.lib.apps.yclients.client.booking.web.pages.select_time.SelectTimePage object at 0x7f7ecc29f200>"
]), условия ожидания: ([
"timeout: 25s"
])
Stacktrace:
#0 0x5638fb7275e3 <unknown>
#1 0x5638fb3ea0b7 <unknown>
#2 0x5638fb437f53 <unknown>
#3 0x5638fb438051 <unknown>
#4 0x5638fb47d9c4 <unknown>
#5 0x5638fb45ef1d <unknown>
#6 0x5638fb47ab3d <unknown>
#7 0x5638fb45ecc3 <unknown>
#8 0x5638fb42a0e4 <unknown>
#9 0x5638fb42b0ae <unknown>
#10 0x5638fb6edce1 <unknown>
#11 0x5638fb6f1b7e <unknown>
#12 0x5638fb6db4b5 <unknown>
#13 0x5638fb6f27d6 <unknown>
#14 0x5638fb6bedbf <unknown>
#15 0x5638fb715748 <unknown>
#16 0x5638fb715917 <unknown>
#17 0x5638fb726773 <unknown>
#18 0x7f7ea0232aa4 <unknown>
#19 0x7f7ea02bfa64 __clone
Exception: There are no available spots for this day
Stacktrace:
suite/yclients/client/booking/web/online_booking/menu_scenario/test_create_booking.py:889 in test_menu_service_step_hidden_create_booking_book_more
lib/common/ui/pages/web.py:61 in decorated
lib/apps/yclients/client/booking/web/pages/select_time.py:302 in select_date_and_time
lib/common/ui/pages/web.py:61 in decorated
lib/apps/yclients/client/booking/web/pages/select_time.py:351 in select_time
Seen in: - altegio/biz.erp#227735 — shard 8 — launch 171549 (×1, last 2026-10-02 06:23 MSK)
TimeoutException — 1 occurrence(s) across 1 pipeline(s)¶
selenium.common.exceptions.TimeoutException: Message: Ожидаем элемент в DOM: "[data-locator="book_again_btn"]", параметры метода ожидания: ([
"css selector",
"None",
"[data-locator=\"book_again_btn\"]",
"<autotests.lib.apps.yclients.client.booking.web.pages.created_booking.CreatedBookingPage object at 0x7fc34bef3e30>"
]), условия ожидания: ([
"timeout: 25s"
])
Stacktrace:
#0 0x557710bf35e3 <unknown>
#1 0x5577108b60b7 <unknown>
#2 0x557710903f53 <unknown>
#3 0x557710904051 <unknown>
#4 0x5577109499c4 <unknown>
#5 0x55771092af1d <unknown>
#6 0x557710946b3d <unknown>
#7 0x55771092acc3 <unknown>
#8 0x5577108f60e4 <unknown>
#9 0x5577108f70ae <unknown>
#10 0x557710bb9ce1 <unknown>
#11 0x557710bbdb7e <unknown>
#12 0x557710ba74b5 <unknown>
#13 0x557710bbe7d6 <unknown>
#14 0x557710b8adbf <unknown>
#15 0x557710be1748 <unknown>
#16 0x557710be1917 <unknown>
#17 0x557710bf2773 <unknown>
#18 0x7fa289d9faa4 <unknown>
#19 0x7fa289e2ca64 __clone
Stacktrace:
lib/common/ui/pages/web.py:61 in decorated
lib/apps/yclients/client/booking/web/pages/created_booking.py:315 in click_book_more
lib/common/ui/pages/web.py:61 in decorated
lib/common/ui/pages/web.py:148 in wait_for_element
lib/ui/selenium/webdriver/support/wait.py:28 in until
Seen in: - altegio/biz.erp#227735 — shard 8 — launch 171549 (×1, last 2026-10-02 06:23 MSK)
TimeoutException — 1 occurrence(s) across 1 pipeline(s)¶
selenium.common.exceptions.TimeoutException: Message: Ожидаем элемент в DOM: "[data-locator="book_again_btn"]", параметры метода ожидания: ([
"css selector",
"None",
"[data-locator=\"book_again_btn\"]",
"<autotests.lib.apps.yclients.client.booking.web.pages.created_booking.CreatedBookingPage object at 0x7f7abc277d70>"
]), условия ожидания: ([
"timeout: 25s"
])
Stacktrace:
#0 0x55ef94a3f5e3 <unknown>
#1 0x55ef947020b7 <unknown>
#2 0x55ef9474ff53 <unknown>
#3 0x55ef94750051 <unknown>
#4 0x55ef947959c4 <unknown>
#5 0x55ef94776f1d <unknown>
#6 0x55ef94792b3d <unknown>
#7 0x55ef94776cc3 <unknown>
#8 0x55ef947420e4 <unknown>
#9 0x55ef947430ae <unknown>
#10 0x55ef94a05ce1 <unknown>
#11 0x55ef94a09b7e <unknown>
#12 0x55ef949f34b5 <unknown>
#13 0x55ef94a0a7d6 <unknown>
#14 0x55ef949d6dbf <unknown>
#15 0x55ef94a2d748 <unknown>
#16 0x55ef94a2d917 <unknown>
#17 0x55ef94a3e773 <unknown>
#18 0x7f44c3a0faa4 <unknown>
#19 0x7f44c3a9ca64 __clone
Stacktrace:
lib/common/ui/pages/web.py:61 in decorated
lib/apps/yclients/client/booking/web/pages/created_booking.py:315 in click_book_more
lib/common/ui/pages/web.py:61 in decorated
lib/common/ui/pages/web.py:148 in wait_for_element
lib/ui/selenium/webdriver/support/wait.py:28 in until
Seen in: - altegio/biz.erp#227749 — shard 8 — launch 171616 (×1, last 2026-10-02 08:20 MSK)
TimeoutException — 1 occurrence(s) across 1 pipeline(s)¶
selenium.common.exceptions.TimeoutException: Message: Ожидаем элемент в DOM: "[data-locator="book_again_btn"]", параметры метода ожидания: ([
"css selector",
"None",
"[data-locator=\"book_again_btn\"]",
"<autotests.lib.apps.yclients.client.booking.web.pages.created_booking.CreatedBookingPage object at 0x7fb938712750>"
]), условия ожидания: ([
"timeout: 25s"
])
Stacktrace:
#0 0x5630ddcd35e3 <unknown>
#1 0x5630dd9960b7 <unknown>
#2 0x5630dd9e3f53 <unknown>
#3 0x5630dd9e4051 <unknown>
#4 0x5630dda299c4 <unknown>
#5 0x5630dda0af1d <unknown>
#6 0x5630dda26b3d <unknown>
#7 0x5630dda0acc3 <unknown>
#8 0x5630dd9d60e4 <unknown>
#9 0x5630dd9d70ae <unknown>
#10 0x5630ddc99ce1 <unknown>
#11 0x5630ddc9db7e <unknown>
#12 0x5630ddc874b5 <unknown>
#13 0x5630ddc9e7d6 <unknown>
#14 0x5630ddc6adbf <unknown>
#15 0x5630ddcc1748 <unknown>
#16 0x5630ddcc1917 <unknown>
#17 0x5630ddcd2773 <unknown>
#18 0x7f3416c2eaa4 <unknown>
#19 0x7f3416cbba64 __clone
Stacktrace:
lib/common/ui/pages/web.py:61 in decorated
lib/apps/yclients/client/booking/web/pages/created_booking.py:315 in click_book_more
lib/common/ui/pages/web.py:61 in decorated
lib/common/ui/pages/web.py:148 in wait_for_element
lib/ui/selenium/webdriver/support/wait.py:28 in until
Seen in: - altegio/biz.erp#227749 — shard 8 — launch 171616 (×1, last 2026-10-02 08:20 MSK)
TimeoutException — 1 occurrence(s) across 1 pipeline(s)¶
selenium.common.exceptions.TimeoutException: Message: Ожидаем элемент в DOM: "[data-locator="book_again_btn"]", параметры метода ожидания: ([
"css selector",
"None",
"[data-locator=\"book_again_btn\"]",
"<autotests.lib.apps.yclients.client.booking.web.pages.created_booking.CreatedBookingPage object at 0x7f4bd05a2f30>"
]), условия ожидания: ([
"timeout: 25s"
])
Stacktrace:
#0 0x561fcceda5e3 <unknown>
#1 0x561fccb9d0b7 <unknown>
#2 0x561fccbeaf53 <unknown>
#3 0x561fccbeb051 <unknown>
#4 0x561fccc309c4 <unknown>
#5 0x561fccc11f1d <unknown>
#6 0x561fccc2db3d <unknown>
#7 0x561fccc11cc3 <unknown>
#8 0x561fccbdd0e4 <unknown>
#9 0x561fccbde0ae <unknown>
#10 0x561fccea0ce1 <unknown>
#11 0x561fccea4b7e <unknown>
#12 0x561fcce8e4b5 <unknown>
#13 0x561fccea57d6 <unknown>
#14 0x561fcce71dbf <unknown>
#15 0x561fccec8748 <unknown>
#16 0x561fccec8917 <unknown>
#17 0x561fcced9773 <unknown>
#18 0x7f04a8d81aa4 <unknown>
#19 0x7f04a8e0ea64 __clone
Stacktrace:
lib/common/ui/pages/web.py:61 in decorated
lib/apps/yclients/client/booking/web/pages/created_booking.py:315 in click_book_more
lib/common/ui/pages/web.py:61 in decorated
lib/common/ui/pages/web.py:148 in wait_for_element
lib/ui/selenium/webdriver/support/wait.py:28 in until
Seen in: - altegio/biz.erp#227749 — shard 8 — launch 171616 (×1, last 2026-10-02 08:20 MSK)
TimeoutException — 1 occurrence(s) across 1 pipeline(s)¶
selenium.common.exceptions.TimeoutException: Message: Ожидаем элемент в DOM: "[data-locator="book_again_btn"]", параметры метода ожидания: ([
"css selector",
"None",
"[data-locator=\"book_again_btn\"]",
"<autotests.lib.apps.yclients.client.booking.web.pages.created_booking.CreatedBookingPage object at 0x7f88b871a060>"
]), условия ожидания: ([
"timeout: 25s"
])
Stacktrace:
#0 0x562bb8c005e3 <unknown>
#1 0x562bb88c30b7 <unknown>
#2 0x562bb8910f53 <unknown>
#3 0x562bb8911051 <unknown>
#4 0x562bb89569c4 <unknown>
#5 0x562bb8937f1d <unknown>
#6 0x562bb8953b3d <unknown>
#7 0x562bb8937cc3 <unknown>
#8 0x562bb89030e4 <unknown>
#9 0x562bb89040ae <unknown>
#10 0x562bb8bc6ce1 <unknown>
#11 0x562bb8bcab7e <unknown>
#12 0x562bb8bb44b5 <unknown>
#13 0x562bb8bcb7d6 <unknown>
#14 0x562bb8b97dbf <unknown>
#15 0x562bb8bee748 <unknown>
#16 0x562bb8bee917 <unknown>
#17 0x562bb8bff773 <unknown>
#18 0x7f7b54274aa4 <unknown>
#19 0x7f7b54301a64 __clone
Stacktrace:
lib/common/ui/pages/web.py:61 in decorated
lib/apps/yclients/client/booking/web/pages/created_booking.py:315 in click_book_more
lib/common/ui/pages/web.py:61 in decorated
lib/common/ui/pages/web.py:148 in wait_for_element
lib/ui/selenium/webdriver/support/wait.py:28 in until
Seen in: - altegio/biz.erp#227787 — shard 2 — launch 171752 (×1, last 2026-10-02 11:50 MSK)
TimeoutException — 1 occurrence(s) across 1 pipeline(s)¶
selenium.common.exceptions.TimeoutException: Message: Ожидаем элемент в DOM: "[data-locator="book_again_btn"]", параметры метода ожидания: ([
"css selector",
"None",
"[data-locator=\"book_again_btn\"]",
"<autotests.lib.apps.yclients.client.booking.web.pages.created_booking.CreatedBookingPage object at 0x7f3709052e70>"
]), условия ожидания: ([
"timeout: 25s"
])
Stacktrace:
#0 0x55d8b4f455e3 <unknown>
#1 0x55d8b4c080b7 <unknown>
#2 0x55d8b4c55f53 <unknown>
#3 0x55d8b4c56051 <unknown>
#4 0x55d8b4c9b9c4 <unknown>
#5 0x55d8b4c7cf1d <unknown>
#6 0x55d8b4c98b3d <unknown>
#7 0x55d8b4c7ccc3 <unknown>
#8 0x55d8b4c480e4 <unknown>
#9 0x55d8b4c490ae <unknown>
#10 0x55d8b4f0bce1 <unknown>
#11 0x55d8b4f0fb7e <unknown>
#12 0x55d8b4ef94b5 <unknown>
#13 0x55d8b4f107d6 <unknown>
#14 0x55d8b4edcdbf <unknown>
#15 0x55d8b4f33748 <unknown>
#16 0x55d8b4f33917 <unknown>
#17 0x55d8b4f44773 <unknown>
#18 0x7f16581baaa4 <unknown>
#19 0x7f1658247a64 __clone
Stacktrace:
lib/common/ui/pages/web.py:61 in decorated
lib/apps/yclients/client/booking/web/pages/created_booking.py:315 in click_book_more
lib/common/ui/pages/web.py:61 in decorated
lib/common/ui/pages/web.py:148 in wait_for_element
lib/ui/selenium/webdriver/support/wait.py:28 in until
Seen in: - altegio/biz.erp#227787 — shard 2 — launch 171752 (×1, last 2026-10-02 11:50 MSK)
WebDriverException — 1 occurrence(s) across 1 pipeline(s)¶
selenium.common.exceptions.WebDriverException: Message: <unknown>: Failed to read the 'localStorage' property from 'Window': Access is denied for this document.
(Session info: headless chrome=119.0.6045.199)
Stacktrace:
#0 0x5583bc1055e3 <unknown>
#1 0x5583bbdc80b7 <unknown>
#2 0x5583bbdce2b5 <unknown>
#3 0x5583bbdd09b1 <unknown>
#4 0x5583bbe5971f <unknown>
#5 0x5583bbe3cef2 <unknown>
#6 0x5583bbe58b3d <unknown>
#7 0x5583bbe3ccc3 <unknown>
#8 0x5583bbe080e4 <unknown>
#9 0x5583bbe090ae <unknown>
#10 0x5583bc0cbce1 <unknown>
#11 0x5583bc0cfb7e <unknown>
#12 0x5583bc0b94b5 <unknown>
#13 0x5583bc0d07d6 <unknown>
#14 0x5583bc09cdbf <unknown>
#15 0x5583bc0f3748 <unknown>
#16 0x5583bc0f3917 <unknown>
#17 0x5583bc104773 <unknown>
#18 0x7f9b4568baa4 <unknown>
#19 0x7f9b45718a64 __clone
Stacktrace:
lib/common/ui/pages/web.py:61 in decorated
lib/apps/yclients/client/booking/web/pages/__init__.py:80 in open
lib/common/ui/pages/web.py:61 in decorated
lib/apps/yclients/client/booking/web/pages/__init__.py:41 in set_environment
lib/ui/selenium/webdriver/__init__.py:52 in execute_script
Seen in: - altegio/client.booking#224668 — shard 1 — launch 165208 (×1, last 2026-09-21 08:16 MSK)
WebDriverException — 1 occurrence(s) across 1 pipeline(s)¶
selenium.common.exceptions.WebDriverException: Message: <unknown>: Failed to read the 'localStorage' property from 'Window': Access is denied for this document.
(Session info: headless chrome=119.0.6045.199)
Stacktrace:
#0 0x5630a60fa5e3 <unknown>
#1 0x5630a5dbd0b7 <unknown>
#2 0x5630a5dc32b5 <unknown>
#3 0x5630a5dc59b1 <unknown>
#4 0x5630a5e4e71f <unknown>
#5 0x5630a5e31ef2 <unknown>
#6 0x5630a5e4db3d <unknown>
#7 0x5630a5e31cc3 <unknown>
#8 0x5630a5dfd0e4 <unknown>
#9 0x5630a5dfe0ae <unknown>
#10 0x5630a60c0ce1 <unknown>
#11 0x5630a60c4b7e <unknown>
#12 0x5630a60ae4b5 <unknown>
#13 0x5630a60c57d6 <unknown>
#14 0x5630a6091dbf <unknown>
#15 0x5630a60e8748 <unknown>
#16 0x5630a60e8917 <unknown>
#17 0x5630a60f9773 <unknown>
#18 0x7fa97914daa4 <unknown>
#19 0x7fa9791daa64 __clone
Stacktrace:
lib/common/ui/pages/web.py:61 in decorated
lib/apps/yclients/client/booking/web/pages/__init__.py:80 in open
lib/common/ui/pages/web.py:61 in decorated
lib/apps/yclients/client/booking/web/pages/__init__.py:41 in set_environment
lib/ui/selenium/webdriver/__init__.py:52 in execute_script
Seen in: - altegio/client.booking#224668 — shard 1 — launch 165208 (×1, last 2026-09-21 08:16 MSK)
WebDriverException — 1 occurrence(s) across 1 pipeline(s)¶
selenium.common.exceptions.WebDriverException: Message: <unknown>: Failed to read the 'localStorage' property from 'Window': Access is denied for this document.
(Session info: headless chrome=119.0.6045.199)
Stacktrace:
#0 0x55b8d1be85e3 <unknown>
#1 0x55b8d18ab0b7 <unknown>
#2 0x55b8d18b12b5 <unknown>
#3 0x55b8d18b39b1 <unknown>
#4 0x55b8d193c71f <unknown>
#5 0x55b8d191fef2 <unknown>
#6 0x55b8d193bb3d <unknown>
#7 0x55b8d191fcc3 <unknown>
#8 0x55b8d18eb0e4 <unknown>
#9 0x55b8d18ec0ae <unknown>
#10 0x55b8d1baece1 <unknown>
#11 0x55b8d1bb2b7e <unknown>
#12 0x55b8d1b9c4b5 <unknown>
#13 0x55b8d1bb37d6 <unknown>
#14 0x55b8d1b7fdbf <unknown>
#15 0x55b8d1bd6748 <unknown>
#16 0x55b8d1bd6917 <unknown>
#17 0x55b8d1be7773 <unknown>
#18 0x7f79d6fb0aa4 <unknown>
#19 0x7f79d703da64 __clone
Stacktrace:
lib/common/ui/pages/web.py:61 in decorated
lib/apps/yclients/client/booking/web/pages/__init__.py:80 in open
lib/common/ui/pages/web.py:61 in decorated
lib/apps/yclients/client/booking/web/pages/__init__.py:41 in set_environment
lib/ui/selenium/webdriver/__init__.py:52 in execute_script
Seen in: - altegio/client.booking#224668 — shard 1 — launch 165208 (×1, last 2026-09-21 08:16 MSK)