#19941 Редактирование времени события с двумя ресурсами в журнале ресурсов¶
test_move_activity_in_the_same_day_on_the_same_resource
Failures in last 30 days: 14
Generated at 2026-10-08 03:48 MSK
Last failure: 2026-10-07 15:27 MSK
Filter: pipelines with sandbox_biz_erp ∈ {master, testops-dev} AND autotests_branch ∈ {master, main} only (testops-dev — daytime ticks since 2026-08-05).
By exception class:
- SigninRedirectMissingError — 7
- AssertionError — 4
- TimeoutError — 3
Failure signatures (grouped by exception + full message):
AssertionError — 1 occurrence(s) across 1 pipeline(s)¶
AssertionError: Drag не стартовал за 3 попытки: не дождались seam: record_id=None ts=1789731900 length=None resource=+None/-None master=None; попытки: ['#1: drop не отправил сохранение', '#2: drop не отправил сохранение', '#3: drop не отправил сохранение']; боксы: [{'timestamp': '1789731900', 'length': '3600', 'resource-instances': '998974,998975', 'master-id': '16176972'}, {'timestamp': '1789731900', 'length': '3600', 'resource-instances': '998974,998975', 'master-id': '16176972'}]; seam-состояние: None
Stacktrace:
suite/yclients/biz/erp/web/timetable/test_dnd_timetable_pw.py:516 in test_move_activity_in_the_same_day_on_the_same_resource
lib/apps_pw/yclients/biz/erp/web/pages/__init__.py:77 in decorated
lib/apps_pw/yclients/biz/erp/web/pages/timetable.py:1851 in move_activity
lib/apps_pw/yclients/biz/erp/web/pages/timetable.py:2278 in _drag_box_to_slot
Seen in: - altegio/biz.erp#224142 — shard 6 — launch 164030 (×1, last 2026-09-17 15:38 MSK)
AssertionError — 1 occurrence(s) across 1 pipeline(s)¶
AssertionError: Drag не стартовал за 3 попытки: не дождались seam: record_id=None ts=1789804800 length=None resource=+None/-None master=None; попытки: ['#1: drop не отправил сохранение', '#2: drop не отправил сохранение', '#3: drop не отправил сохранение']; боксы: [{'timestamp': '1789804800', 'length': '3600', 'resource-instances': '983006,983007', 'master-id': '15990093'}, {'timestamp': '1789804800', 'length': '3600', 'resource-instances': '983006,983007', 'master-id': '15990093'}]; seam-состояние: None
Stacktrace:
suite/yclients/biz/erp/web/timetable/test_dnd_timetable_pw.py:516 in test_move_activity_in_the_same_day_on_the_same_resource
lib/apps_pw/yclients/biz/erp/web/pages/__init__.py:77 in decorated
lib/apps_pw/yclients/biz/erp/web/pages/timetable.py:1851 in move_activity
lib/apps_pw/yclients/biz/erp/web/pages/timetable.py:2278 in _drag_box_to_slot
Seen in: - altegio/biz.erp#224448 — shard 2 — launch 164867 (×1, last 2026-09-18 20:08 MSK)
AssertionError — 1 occurrence(s) across 1 pipeline(s)¶
AssertionError: Drag не стартовал за 3 попытки: не дождались seam: record_id=None ts=1790230500 length=None resource=+None/-None master=None; попытки: ['#1: drop не отправил сохранение', '#2: drop не отправил сохранение', '#3: drop не отправил сохранение']; боксы: [{'timestamp': '1790230500', 'length': '3600', 'resource-instances': '986067,986068', 'master-id': '16015409'}, {'timestamp': '1790230500', 'length': '3600', 'resource-instances': '986067,986068', 'master-id': '16015409'}]; seam-состояние: None
Stacktrace:
suite/yclients/biz/erp/web/timetable/test_dnd_timetable_pw.py:516 in test_move_activity_in_the_same_day_on_the_same_resource
lib/apps_pw/yclients/biz/erp/web/pages/__init__.py:77 in decorated
lib/apps_pw/yclients/biz/erp/web/pages/timetable.py:1947 in move_activity
lib/apps_pw/yclients/biz/erp/web/pages/timetable.py:2374 in _drag_box_to_slot
Seen in: - altegio/biz.erp#225436 — shard 5 — launch 167031 (×1, last 2026-09-23 18:17 MSK)
AssertionError — 1 occurrence(s) across 1 pipeline(s)¶
AssertionError: Drag не стартовал за 3 попытки: не дождались seam: record_id=None ts=1791450900 length=None resource=+None/-None master=None; попытки: ['#1: drop не отправил сохранение', '#2: drop не отправил сохранение', '#3: drop не отправил сохранение']; боксы: [{'timestamp': '1791450900', 'length': '3600', 'resource-instances': '1020834,1020835', 'master-id': '16402484'}, {'timestamp': '1791450900', 'length': '3600', 'resource-instances': '1020834,1020835', 'master-id': '16402484'}]; seam-состояние: None
Stacktrace:
suite/yclients/biz/erp/web/timetable/test_dnd_timetable_pw.py:516 in test_move_activity_in_the_same_day_on_the_same_resource
lib/apps_pw/yclients/biz/erp/web/pages/__init__.py:77 in decorated
lib/apps_pw/yclients/biz/erp/web/pages/timetable.py:1947 in move_activity
lib/apps_pw/yclients/biz/erp/web/pages/timetable.py:2374 in _drag_box_to_slot
Seen in: - altegio/biz.erp#229212 — shard 5 — launch 174057 (×1, last 2026-10-07 15:27 MSK)
SigninRedirectMissingError — 1 occurrence(s) across 1 pipeline(s)¶
autotests.lib.exception.SigninRedirectMissingError: login-XHR завершился со статусом 200, но редиректа со /signin/ не случилось за 30 с — подозрение на фронт biz.erp
--- причина (playwright) ---
Timeout 30000ms exceeded.
=========================== logs ===========================
waiting for navigation to "<function ImplToApiMapping.wrap_handler.<locals>.wrapper_func at 0x7fe4c4109e40>" until 'commit'
navigated to "https://erp-testops-dev.infra.altegio.cloud/signin/"
navigated to "https://erp-testops-dev.infra.altegio.cloud/signin/"
navigated to "https://erp-testops-dev.infra.altegio.cloud/signin/JTJGdGltZXRhYmxlJTJGMTYzNTk1MTclMkY="
navigated to "https://erp-testops-dev.infra.altegio.cloud/signin/JTJGdGltZXRhYmxlJTJGMTYzNTk1MTclMkY="
navigated to "https://erp-testops-dev.infra.altegio.cloud/signin/JTJGdGltZXRhYmxlJTJGMTYzNTk1MTclMkY="
============================================================
Stacktrace:
suite/yclients/biz/erp/web/timetable/test_dnd_timetable_pw.py:491 in test_move_activity_in_the_same_day_on_the_same_resource
lib/apps_pw/yclients/biz/erp/web/pages/guest/signin.py:115 in sign_in
Seen in: - altegio/biz.erp#227722 — shard 6 — launch 171516 (×1, last 2026-10-02 04:26 MSK)
SigninRedirectMissingError — 1 occurrence(s) across 1 pipeline(s)¶
autotests.lib.exception.SigninRedirectMissingError: login-XHR завершился со статусом 200, но редиректа со /signin/ не случилось за 30 с — подозрение на фронт biz.erp
--- причина (playwright) ---
Timeout 30000ms exceeded.
=========================== logs ===========================
waiting for navigation to "<function ImplToApiMapping.wrap_handler.<locals>.wrapper_func at 0x7f88eb27afc0>" until 'commit'
navigated to "https://erp-testops-dev.infra.altegio.cloud/signin/"
navigated to "https://erp-testops-dev.infra.altegio.cloud/signin/"
navigated to "https://erp-testops-dev.infra.altegio.cloud/signin/JTJGdGltZXRhYmxlJTJGMTYzNjE0NTUlMkY="
navigated to "https://erp-testops-dev.infra.altegio.cloud/signin/JTJGdGltZXRhYmxlJTJGMTYzNjE0NTUlMkY="
navigated to "https://erp-testops-dev.infra.altegio.cloud/signin/JTJGdGltZXRhYmxlJTJGMTYzNjE0NTUlMkY="
============================================================
Stacktrace:
suite/yclients/biz/erp/web/timetable/test_dnd_timetable_pw.py:491 in test_move_activity_in_the_same_day_on_the_same_resource
lib/apps_pw/yclients/biz/erp/web/pages/guest/signin.py:115 in sign_in
Seen in: - altegio/biz.erp#227735 — shard 6 — launch 171549 (×1, last 2026-10-02 06:23 MSK)
SigninRedirectMissingError — 1 occurrence(s) across 1 pipeline(s)¶
autotests.lib.exception.SigninRedirectMissingError: login-XHR завершился со статусом 200, но редиректа со /signin/ не случилось за 30 с — подозрение на фронт biz.erp
--- причина (playwright) ---
Timeout 30000ms exceeded.
=========================== logs ===========================
waiting for navigation to "<function ImplToApiMapping.wrap_handler.<locals>.wrapper_func at 0x7f246c43e520>" until 'commit'
navigated to "https://erp-testops-dev.infra.altegio.cloud/signin/"
navigated to "https://erp-testops-dev.infra.altegio.cloud/signin/"
navigated to "https://erp-testops-dev.infra.altegio.cloud/signin/JTJGdGltZXRhYmxlJTJGMTYzNjMxMzQlMkY="
navigated to "https://erp-testops-dev.infra.altegio.cloud/signin/JTJGdGltZXRhYmxlJTJGMTYzNjMxMzQlMkY="
navigated to "https://erp-testops-dev.infra.altegio.cloud/signin/JTJGdGltZXRhYmxlJTJGMTYzNjMxMzQlMkY="
============================================================
Stacktrace:
suite/yclients/biz/erp/web/timetable/test_dnd_timetable_pw.py:491 in test_move_activity_in_the_same_day_on_the_same_resource
lib/apps_pw/yclients/biz/erp/web/pages/guest/signin.py:115 in sign_in
Seen in: - altegio/biz.erp#227735 — shard 6 — launch 171549 (×1, last 2026-10-02 06:23 MSK)
SigninRedirectMissingError — 1 occurrence(s) across 1 pipeline(s)¶
autotests.lib.exception.SigninRedirectMissingError: login-XHR завершился со статусом 200, но редиректа со /signin/ не случилось за 30 с — подозрение на фронт biz.erp
--- причина (playwright) ---
Timeout 30000ms exceeded.
=========================== logs ===========================
waiting for navigation to "<function ImplToApiMapping.wrap_handler.<locals>.wrapper_func at 0x7f0e0c2d3880>" until 'commit'
navigated to "https://erp-testops-dev.infra.altegio.cloud/signin/"
navigated to "https://erp-testops-dev.infra.altegio.cloud/signin/"
navigated to "https://erp-testops-dev.infra.altegio.cloud/signin/JTJGdGltZXRhYmxlJTJGMTYzNjQzNTclMkY="
navigated to "https://erp-testops-dev.infra.altegio.cloud/signin/JTJGdGltZXRhYmxlJTJGMTYzNjQzNTclMkY="
navigated to "https://erp-testops-dev.infra.altegio.cloud/signin/JTJGdGltZXRhYmxlJTJGMTYzNjQzNTclMkY="
============================================================
Stacktrace:
suite/yclients/biz/erp/web/timetable/test_dnd_timetable_pw.py:491 in test_move_activity_in_the_same_day_on_the_same_resource
lib/apps_pw/yclients/biz/erp/web/pages/guest/signin.py:115 in sign_in
Seen in: - altegio/biz.erp#227735 — shard 6 — launch 171549 (×1, last 2026-10-02 06:23 MSK)
SigninRedirectMissingError — 1 occurrence(s) across 1 pipeline(s)¶
autotests.lib.exception.SigninRedirectMissingError: login-XHR завершился со статусом 200, но редиректа со /signin/ не случилось за 30 с — подозрение на фронт biz.erp
--- причина (playwright) ---
Timeout 30000ms exceeded.
=========================== logs ===========================
waiting for navigation to "<function ImplToApiMapping.wrap_handler.<locals>.wrapper_func at 0x7f3573235da0>" until 'commit'
navigated to "https://erp-testops-dev.infra.altegio.cloud/signin/"
navigated to "https://erp-testops-dev.infra.altegio.cloud/signin/"
navigated to "https://erp-testops-dev.infra.altegio.cloud/signin/JTJGdGltZXRhYmxlJTJGMTYzNjY1OTUlMkY="
navigated to "https://erp-testops-dev.infra.altegio.cloud/signin/JTJGdGltZXRhYmxlJTJGMTYzNjY1OTUlMkY="
navigated to "https://erp-testops-dev.infra.altegio.cloud/signin/JTJGdGltZXRhYmxlJTJGMTYzNjY1OTUlMkY="
============================================================
Stacktrace:
suite/yclients/biz/erp/web/timetable/test_dnd_timetable_pw.py:491 in test_move_activity_in_the_same_day_on_the_same_resource
lib/apps_pw/yclients/biz/erp/web/pages/guest/signin.py:115 in sign_in
Seen in: - altegio/biz.erp#227749 — shard 1 — launch 171616 (×1, last 2026-10-02 08:20 MSK)
SigninRedirectMissingError — 1 occurrence(s) across 1 pipeline(s)¶
autotests.lib.exception.SigninRedirectMissingError: login-XHR завершился со статусом 200, но редиректа со /signin/ не случилось за 30 с — подозрение на фронт biz.erp
--- причина (playwright) ---
Timeout 30000ms exceeded.
=========================== logs ===========================
waiting for navigation to "<function ImplToApiMapping.wrap_handler.<locals>.wrapper_func at 0x7f0b65293a60>" until 'commit'
navigated to "https://erp-testops-dev.infra.altegio.cloud/signin/"
navigated to "https://erp-testops-dev.infra.altegio.cloud/signin/"
navigated to "https://erp-testops-dev.infra.altegio.cloud/signin/JTJGdGltZXRhYmxlJTJGMTYzNjc5NTMlMkY="
navigated to "https://erp-testops-dev.infra.altegio.cloud/signin/JTJGdGltZXRhYmxlJTJGMTYzNjc5NTMlMkY="
navigated to "https://erp-testops-dev.infra.altegio.cloud/signin/JTJGdGltZXRhYmxlJTJGMTYzNjc5NTMlMkY="
============================================================
Stacktrace:
suite/yclients/biz/erp/web/timetable/test_dnd_timetable_pw.py:491 in test_move_activity_in_the_same_day_on_the_same_resource
lib/apps_pw/yclients/biz/erp/web/pages/guest/signin.py:115 in sign_in
Seen in: - altegio/biz.erp#227749 — shard 1 — launch 171616 (×1, last 2026-10-02 08:20 MSK)
SigninRedirectMissingError — 1 occurrence(s) across 1 pipeline(s)¶
autotests.lib.exception.SigninRedirectMissingError: login-XHR завершился со статусом 200, но редиректа со /signin/ не случилось за 30 с — подозрение на фронт biz.erp
--- причина (playwright) ---
Timeout 30000ms exceeded.
=========================== logs ===========================
waiting for navigation to "<function ImplToApiMapping.wrap_handler.<locals>.wrapper_func at 0x7fbae0750a40>" until 'commit'
navigated to "https://erp-testops-dev.infra.altegio.cloud/signin/"
navigated to "https://erp-testops-dev.infra.altegio.cloud/signin/"
navigated to "https://erp-testops-dev.infra.altegio.cloud/signin/JTJGdGltZXRhYmxlJTJGMTYzNzA1NTklMkY="
navigated to "https://erp-testops-dev.infra.altegio.cloud/signin/JTJGdGltZXRhYmxlJTJGMTYzNzA1NTklMkY="
navigated to "https://erp-testops-dev.infra.altegio.cloud/signin/JTJGdGltZXRhYmxlJTJGMTYzNzA1NTklMkY="
============================================================
Stacktrace:
suite/yclients/biz/erp/web/timetable/test_dnd_timetable_pw.py:491 in test_move_activity_in_the_same_day_on_the_same_resource
lib/apps_pw/yclients/biz/erp/web/pages/guest/signin.py:115 in sign_in
Seen in: - altegio/biz.erp#227787 — shard 5 — launch 171752 (×1, last 2026-10-02 11:50 MSK)
TimeoutError — 1 occurrence(s) across 1 pipeline(s)¶
playwright._impl._errors.TimeoutError: Locator.click: Timeout 30000ms exceeded.
Call log:
- waiting for locator("div#calendar-block").locator("td[data-handler=\"selectDay\"]:not([class*=\"ui-datepicker-other-month\"])").filter(has=locator("[class*=\"ui-datepicker-day-text\"]").filter(has_text=re.compile(r"^\s*3\s*$"))).first.locator("a")
- locator resolved to <a href="#" class="ui-state-default">…</a>
- attempting click action
2 × waiting for element to be visible, enabled and stable
- element is visible, enabled and stable
- scrolling into view if needed
- done scrolling
- <a target="_self" class="yc-link yc-link_light" href="https://erp-testops-dev.infra.altegio.cloud/timetable/16358140/#mode=1">Reload this Page</a> from <div class="v-error-modal v-error-modal--unauthorized v-error-modal__fade-enter-active v-error-modal__fade-enter-to">…</div> subtree intercepts pointer events
- retrying click action
- waiting 20ms
- waiting for element to be visible, enabled and stable
- element is visible, enabled and stable
- scrolling into view if needed
- done scrolling
- <a target="_self" class="yc-link yc-link_light" href="https://erp-testops-dev.infra.altegio.cloud/timetable/16358140/#mode=1">Reload this Page</a> from <div class="v-error-modal v-error-modal--unauthorized v-error-modal__fade-enter-active v-error-modal__fade-enter-to">…</div> subtree intercepts pointer events
2 × retrying click action
- waiting 100ms
- waiting for element to be visible, enabled and stable
- element is visible, enabled and stable
- scrolling into view if needed
- done scrolling
- <div class="v-error-modal v-error-modal--unauthorized">…</div> intercepts pointer events
13 × retrying click action
- waiting 500ms
- waiting for element to be visible, enabled and stable
- element is visible, enabled and stable
- scrolling into view if needed
- done scrolling
- <a target="_self" class="yc-link yc-link_light" href="https://erp-testops-dev.infra.altegio.cloud/timetable/16358140/#mode=1">Reload this Page</a> from <div class="v-error-modal v-error-modal--unauthorized">…</div> subtree intercepts pointer events
- retrying click action
- waiting 500ms
- waiting for element to be visible, enabled and stable
- element is visible, enabled and stable
- scrolling into view if needed
- done scrolling
- <a target="_self" class="yc-link yc-link_light" href="https://erp-testops-dev.infra.altegio.cloud/timetable/16358140/#mode=1">Reload this Page</a> from <div class="v-error-modal v-error-modal--unauthorized">…</div> subtree intercepts pointer events
- retrying click action
- waiting 500ms
- waiting for element to be visible, enabled and stable
- element is visible, enabled and stable
- scrolling into view if needed
- done scrolling
- <div class="v-error-modal v-error-modal--unauthorized">…</div> intercepts pointer events
- retrying click action
- waiting 500ms
- waiting for element to be visible, enabled and stable
- element is visible, enabled and stable
- scrolling into view if needed
- done scrolling
- <div class="v-error-modal v-error-modal--unauthorized">…</div> intercepts pointer events
2 × retrying click action
- waiting 500ms
- waiting for element to be visible, enabled and stable
- element is visible, enabled and stable
- scrolling into view if needed
- done scrolling
- <a target="_self" class="yc-link yc-link_light" href="https://erp-testops-dev.infra.altegio.cloud/timetable/16358140/#mode=1">Reload this Page</a> from <div class="v-error-modal v-error-modal--unauthorized">…</div> subtree intercepts pointer events
- retrying click action
- waiting 500ms
- waiting for element to be visible, enabled and stable
- element is visible, enab... [truncated]
Stacktrace:
suite/yclients/biz/erp/web/timetable/test_dnd_timetable_pw.py:497 in test_move_activity_in_the_same_day_on_the_same_resource
lib/apps_pw/yclients/biz/erp/web/pages/__init__.py:77 in decorated
lib/apps_pw/yclients/biz/erp/web/pages/user.py:497 in open_timetable
lib/apps_pw/yclients/biz/erp/web/pages/user.py:635 in _set_calendar_date
lib/apps_pw/yclients/biz/erp/web/pages/user.py:621 in _navigate_and_click
Seen in: - altegio/biz.erp#227722 — shard 6 — launch 171516 (×1, last 2026-10-02 04:26 MSK)
TimeoutError — 1 occurrence(s) across 1 pipeline(s)¶
playwright._impl._errors.TimeoutError: Locator.click: Timeout 30000ms exceeded.
Call log:
- waiting for locator("div#calendar-block").locator("td[data-handler=\"selectDay\"]:not([class*=\"ui-datepicker-other-month\"])").filter(has=locator("[class*=\"ui-datepicker-day-text\"]").filter(has_text=re.compile(r"^\s*3\s*$"))).first.locator("a")
- locator resolved to <a href="#" class="ui-state-default">…</a>
- attempting click action
2 × waiting for element to be visible, enabled and stable
- element is visible, enabled and stable
- scrolling into view if needed
- done scrolling
- <a target="_self" class="yc-link yc-link_light" href="https://erp-testops-dev.infra.altegio.cloud/timetable/16360629/#mode=1">Reload this Page</a> from <div class="v-error-modal v-error-modal--unauthorized v-error-modal__fade-enter-active v-error-modal__fade-enter-to">…</div> subtree intercepts pointer events
- retrying click action
- waiting 20ms
- waiting for element to be visible, enabled and stable
- element is visible, enabled and stable
- scrolling into view if needed
- done scrolling
- <a target="_self" class="yc-link yc-link_light" href="https://erp-testops-dev.infra.altegio.cloud/timetable/16360629/#mode=1">Reload this Page</a> from <div class="v-error-modal v-error-modal--unauthorized v-error-modal__fade-enter-active v-error-modal__fade-enter-to">…</div> subtree intercepts pointer events
2 × retrying click action
- waiting 100ms
- waiting for element to be visible, enabled and stable
- element is visible, enabled and stable
- scrolling into view if needed
- done scrolling
- <div class="v-error-modal v-error-modal--unauthorized">…</div> intercepts pointer events
13 × retrying click action
- waiting 500ms
- waiting for element to be visible, enabled and stable
- element is visible, enabled and stable
- scrolling into view if needed
- done scrolling
- <a target="_self" class="yc-link yc-link_light" href="https://erp-testops-dev.infra.altegio.cloud/timetable/16360629/#mode=1">Reload this Page</a> from <div class="v-error-modal v-error-modal--unauthorized">…</div> subtree intercepts pointer events
- retrying click action
- waiting 500ms
- waiting for element to be visible, enabled and stable
- element is visible, enabled and stable
- scrolling into view if needed
- done scrolling
- <a target="_self" class="yc-link yc-link_light" href="https://erp-testops-dev.infra.altegio.cloud/timetable/16360629/#mode=1">Reload this Page</a> from <div class="v-error-modal v-error-modal--unauthorized">…</div> subtree intercepts pointer events
- retrying click action
- waiting 500ms
- waiting for element to be visible, enabled and stable
- element is visible, enabled and stable
- scrolling into view if needed
- done scrolling
- <div class="v-error-modal v-error-modal--unauthorized">…</div> intercepts pointer events
- retrying click action
- waiting 500ms
- waiting for element to be visible, enabled and stable
- element is visible, enabled and stable
- scrolling into view if needed
- done scrolling
- <div class="v-error-modal v-error-modal--unauthorized">…</div> intercepts pointer events
2 × retrying click action
- waiting 500ms
- waiting for element to be visible, enabled and stable
- element is visible, enabled and stable
- scrolling into view if needed
- done scrolling
- <a target="_self" class="yc-link yc-link_light" href="https://erp-testops-dev.infra.altegio.cloud/timetable/16360629/#mode=1">Reload this Page</a> from <div class="v-error-modal v-error-modal--unauthorized">…</div> subtree intercepts pointer events
- retrying click action
- waiting 500ms
- waiting for element to be visible, enabled and stable
- element is visible, enab... [truncated]
Stacktrace:
suite/yclients/biz/erp/web/timetable/test_dnd_timetable_pw.py:497 in test_move_activity_in_the_same_day_on_the_same_resource
lib/apps_pw/yclients/biz/erp/web/pages/__init__.py:77 in decorated
lib/apps_pw/yclients/biz/erp/web/pages/user.py:497 in open_timetable
lib/apps_pw/yclients/biz/erp/web/pages/user.py:635 in _set_calendar_date
lib/apps_pw/yclients/biz/erp/web/pages/user.py:621 in _navigate_and_click
Seen in: - altegio/biz.erp#227722 — shard 6 — launch 171516 (×1, last 2026-10-02 04:26 MSK)
TimeoutError — 1 occurrence(s) across 1 pipeline(s)¶
playwright._impl._errors.TimeoutError: Locator.click: Timeout 30000ms exceeded.
Call log:
- waiting for locator("div#calendar-block").locator("td[data-handler=\"selectDay\"]:not([class*=\"ui-datepicker-other-month\"])").filter(has=locator("[class*=\"ui-datepicker-day-text\"]").filter(has_text=re.compile(r"^\s*3\s*$"))).first.locator("a")
- locator resolved to <a href="#" class="ui-state-default">…</a>
- attempting click action
2 × waiting for element to be visible, enabled and stable
- element is visible, enabled and stable
- scrolling into view if needed
- done scrolling
- <a target="_self" class="yc-link yc-link_light" href="https://erp-testops-dev.infra.altegio.cloud/timetable/16369087/#mode=1">Reload this Page</a> from <div class="v-error-modal v-error-modal--unauthorized v-error-modal__fade-enter-active v-error-modal__fade-enter-to">…</div> subtree intercepts pointer events
- retrying click action
- waiting 20ms
- waiting for element to be visible, enabled and stable
- element is visible, enabled and stable
- scrolling into view if needed
- done scrolling
- <a target="_self" class="yc-link yc-link_light" href="https://erp-testops-dev.infra.altegio.cloud/timetable/16369087/#mode=1">Reload this Page</a> from <div class="v-error-modal v-error-modal--unauthorized v-error-modal__fade-enter-active v-error-modal__fade-enter-to">…</div> subtree intercepts pointer events
2 × retrying click action
- waiting 100ms
- waiting for element to be visible, enabled and stable
- element is visible, enabled and stable
- scrolling into view if needed
- done scrolling
- <div class="v-error-modal v-error-modal--unauthorized">…</div> intercepts pointer events
13 × retrying click action
- waiting 500ms
- waiting for element to be visible, enabled and stable
- element is visible, enabled and stable
- scrolling into view if needed
- done scrolling
- <a target="_self" class="yc-link yc-link_light" href="https://erp-testops-dev.infra.altegio.cloud/timetable/16369087/#mode=1">Reload this Page</a> from <div class="v-error-modal v-error-modal--unauthorized">…</div> subtree intercepts pointer events
- retrying click action
- waiting 500ms
- waiting for element to be visible, enabled and stable
- element is visible, enabled and stable
- scrolling into view if needed
- done scrolling
- <a target="_self" class="yc-link yc-link_light" href="https://erp-testops-dev.infra.altegio.cloud/timetable/16369087/#mode=1">Reload this Page</a> from <div class="v-error-modal v-error-modal--unauthorized">…</div> subtree intercepts pointer events
- retrying click action
- waiting 500ms
- waiting for element to be visible, enabled and stable
- element is visible, enabled and stable
- scrolling into view if needed
- done scrolling
- <div class="v-error-modal v-error-modal--unauthorized">…</div> intercepts pointer events
- retrying click action
- waiting 500ms
- waiting for element to be visible, enabled and stable
- element is visible, enabled and stable
- scrolling into view if needed
- done scrolling
- <div class="v-error-modal v-error-modal--unauthorized">…</div> intercepts pointer events
2 × retrying click action
- waiting 500ms
- waiting for element to be visible, enabled and stable
- element is visible, enabled and stable
- scrolling into view if needed
- done scrolling
- <a target="_self" class="yc-link yc-link_light" href="https://erp-testops-dev.infra.altegio.cloud/timetable/16369087/#mode=1">Reload this Page</a> from <div class="v-error-modal v-error-modal--unauthorized">…</div> subtree intercepts pointer events
- retrying click action
- waiting 500ms
- waiting for element to be visible, enabled and stable
- element is visible, enab... [truncated]
Stacktrace:
suite/yclients/biz/erp/web/timetable/test_dnd_timetable_pw.py:497 in test_move_activity_in_the_same_day_on_the_same_resource
lib/apps_pw/yclients/biz/erp/web/pages/__init__.py:77 in decorated
lib/apps_pw/yclients/biz/erp/web/pages/user.py:497 in open_timetable
lib/apps_pw/yclients/biz/erp/web/pages/user.py:635 in _set_calendar_date
lib/apps_pw/yclients/biz/erp/web/pages/user.py:621 in _navigate_and_click
Seen in: - altegio/biz.erp#227749 — shard 1 — launch 171616 (×1, last 2026-10-02 08:20 MSK)