Перенос индивидуальной записи на того же сотрудника - этот же день - свободное время¶
test_move_record_on_the_same_master_on_free_time
Failures in last 30 days: 16
Generated at 2026-10-08 03:48 MSK
Last failure: 2026-10-07 15:27 MSK
Filter: pipelines with sandbox_biz_erp ∈ {master, testops-dev} AND autotests_branch ∈ {master, main} only (testops-dev — daytime ticks since 2026-08-05).
By exception class:
- SigninRedirectMissingError — 8
- AssertionError — 4
- TimeoutError — 4
Failure signatures (grouped by exception + full message):
AssertionError — 1 occurrence(s) across 1 pipeline(s)¶
AssertionError: Drag не стартовал за 3 попытки: не дождались seam: record_id=20304467 ts=1790424000 length=None resource=+None/-None master=None; попытки: ['#1: drop не отправил сохранение', '#2: drop не отправил сохранение', '#3: drop не отправил сохранение']; боксы: [{'timestamp': '1790424000', 'length': '3600', 'resource-instances': '', 'master-id': '16029729'}]; seam-состояние: None
Stacktrace:
suite/yclients/biz/erp/web/timetable/test_dnd_timetable_pw.py:270 in test_move_record_on_the_same_master_on_free_time
lib/apps_pw/yclients/biz/erp/web/pages/__init__.py:77 in decorated
lib/apps_pw/yclients/biz/erp/web/pages/timetable.py:2057 in move_record
lib/apps_pw/yclients/biz/erp/web/pages/timetable.py:2374 in _drag_box_to_slot
Seen in: - altegio/biz.erp#226107 — shard 6 — launch 168268 (×1, last 2026-09-26 16:22 MSK)
AssertionError — 1 occurrence(s) across 1 pipeline(s)¶
AssertionError: Drag не стартовал за 3 попытки: не дождались seam: record_id=20313526 ts=1790691300 length=None resource=+None/-None master=None; попытки: ['#1: drop не отправил сохранение', '#2: drop не отправил сохранение', '#3: drop не отправил сохранение']; боксы: [{'timestamp': '1790691300', 'length': '3600', 'resource-instances': '', 'master-id': '16039721'}]; seam-состояние: None
Stacktrace:
suite/yclients/biz/erp/web/timetable/test_dnd_timetable_pw.py:270 in test_move_record_on_the_same_master_on_free_time
lib/apps_pw/yclients/biz/erp/web/pages/__init__.py:77 in decorated
lib/apps_pw/yclients/biz/erp/web/pages/timetable.py:2057 in move_record
lib/apps_pw/yclients/biz/erp/web/pages/timetable.py:2374 in _drag_box_to_slot
Seen in: - altegio/biz.erp#226816 — shard 7 — launch 169602 (×1, last 2026-09-29 11:47 MSK)
AssertionError — 1 occurrence(s) across 1 pipeline(s)¶
AssertionError: Drag не стартовал за 3 попытки: не дождались seam: record_id=20445715 ts=1790766900 length=None resource=+None/-None master=None; попытки: ['#1: drop не отправил сохранение', '#2: drop не отправил сохранение', '#3: drop не отправил сохранение']; боксы: [{'timestamp': '1790766900', 'length': '3600', 'resource-instances': '', 'master-id': '16306172'}]; seam-состояние: None
Stacktrace:
suite/yclients/biz/erp/web/timetable/test_dnd_timetable_pw.py:270 in test_move_record_on_the_same_master_on_free_time
lib/apps_pw/yclients/biz/erp/web/pages/__init__.py:77 in decorated
lib/apps_pw/yclients/biz/erp/web/pages/timetable.py:2057 in move_record
lib/apps_pw/yclients/biz/erp/web/pages/timetable.py:2374 in _drag_box_to_slot
Seen in: - altegio/biz.erp#227055 — shard 8 — launch 170139 (×1, last 2026-09-30 03:39 MSK)
AssertionError — 1 occurrence(s) across 1 pipeline(s)¶
AssertionError: Drag не стартовал за 3 попытки: не дождались seam: record_id=20499575 ts=1791361800 length=None resource=+None/-None master=None; попытки: ['#1: drop не отправил сохранение', '#2: drop не отправил сохранение', '#3: drop не отправил сохранение']; боксы: [{'timestamp': '1791361800', 'length': '3600', 'resource-instances': '', 'master-id': '16400556'}]; seam-состояние: None
Stacktrace:
suite/yclients/biz/erp/web/timetable/test_dnd_timetable_pw.py:270 in test_move_record_on_the_same_master_on_free_time
lib/apps_pw/yclients/biz/erp/web/pages/__init__.py:77 in decorated
lib/apps_pw/yclients/biz/erp/web/pages/timetable.py:2057 in move_record
lib/apps_pw/yclients/biz/erp/web/pages/timetable.py:2374 in _drag_box_to_slot
Seen in: - altegio/biz.erp#229212 — shard 6 — launch 174057 (×1, last 2026-10-07 15:27 MSK)
SigninRedirectMissingError — 1 occurrence(s) across 1 pipeline(s)¶
autotests.lib.exception.SigninRedirectMissingError: login-XHR завершился со статусом 200, но редиректа со /signin/ не случилось за 30 с — подозрение на фронт biz.erp
--- причина (playwright) ---
Timeout 30000ms exceeded.
=========================== logs ===========================
waiting for navigation to "<function ImplToApiMapping.wrap_handler.<locals>.wrapper_func at 0x7f2564371940>" until 'commit'
navigated to "https://erp-testops-dev.infra.altegio.cloud/signin/"
navigated to "https://erp-testops-dev.infra.altegio.cloud/signin/"
navigated to "https://erp-testops-dev.infra.altegio.cloud/signin/JTJGdGltZXRhYmxlJTJGMTYzNTY0NDMlMkY="
navigated to "https://erp-testops-dev.infra.altegio.cloud/signin/JTJGdGltZXRhYmxlJTJGMTYzNTY0NDMlMkY="
navigated to "https://erp-testops-dev.infra.altegio.cloud/signin/JTJGdGltZXRhYmxlJTJGMTYzNTY0NDMlMkY="
============================================================
Stacktrace:
suite/yclients/biz/erp/web/timetable/test_dnd_timetable_pw.py:261 in test_move_record_on_the_same_master_on_free_time
lib/apps_pw/yclients/biz/erp/web/pages/guest/signin.py:115 in sign_in
Seen in: - altegio/biz.erp#227596 — shard 4 — launch 171280 (×1, last 2026-10-01 17:40 MSK)
SigninRedirectMissingError — 1 occurrence(s) across 1 pipeline(s)¶
autotests.lib.exception.SigninRedirectMissingError: login-XHR завершился со статусом 200, но редиректа со /signin/ не случилось за 30 с — подозрение на фронт biz.erp
--- причина (playwright) ---
Timeout 30000ms exceeded.
=========================== logs ===========================
waiting for navigation to "<function ImplToApiMapping.wrap_handler.<locals>.wrapper_func at 0x7f77a8316c00>" until 'commit'
navigated to "https://erp-testops-dev.infra.altegio.cloud/signin/"
navigated to "https://erp-testops-dev.infra.altegio.cloud/signin/"
navigated to "https://erp-testops-dev.infra.altegio.cloud/signin/JTJGdGltZXRhYmxlJTJGMTYzNTgzNDclMkY="
navigated to "https://erp-testops-dev.infra.altegio.cloud/signin/JTJGdGltZXRhYmxlJTJGMTYzNTgzNDclMkY="
navigated to "https://erp-testops-dev.infra.altegio.cloud/signin/JTJGdGltZXRhYmxlJTJGMTYzNTgzNDclMkY="
============================================================
Stacktrace:
suite/yclients/biz/erp/web/timetable/test_dnd_timetable_pw.py:261 in test_move_record_on_the_same_master_on_free_time
lib/apps_pw/yclients/biz/erp/web/pages/guest/signin.py:115 in sign_in
Seen in: - altegio/biz.erp#227722 — shard 5 — launch 171516 (×1, last 2026-10-02 04:26 MSK)
SigninRedirectMissingError — 1 occurrence(s) across 1 pipeline(s)¶
autotests.lib.exception.SigninRedirectMissingError: login-XHR завершился со статусом 200, но редиректа со /signin/ не случилось за 30 с — подозрение на фронт biz.erp
--- причина (playwright) ---
Timeout 30000ms exceeded.
=========================== logs ===========================
waiting for navigation to "<function ImplToApiMapping.wrap_handler.<locals>.wrapper_func at 0x7f0fec4abf60>" until 'commit'
navigated to "https://erp-testops-dev.infra.altegio.cloud/signin/"
navigated to "https://erp-testops-dev.infra.altegio.cloud/signin/"
navigated to "https://erp-testops-dev.infra.altegio.cloud/signin/JTJGdGltZXRhYmxlJTJGMTYzNTk2NjQlMkY="
navigated to "https://erp-testops-dev.infra.altegio.cloud/signin/JTJGdGltZXRhYmxlJTJGMTYzNTk2NjQlMkY="
navigated to "https://erp-testops-dev.infra.altegio.cloud/signin/JTJGdGltZXRhYmxlJTJGMTYzNTk2NjQlMkY="
============================================================
Stacktrace:
suite/yclients/biz/erp/web/timetable/test_dnd_timetable_pw.py:261 in test_move_record_on_the_same_master_on_free_time
lib/apps_pw/yclients/biz/erp/web/pages/guest/signin.py:115 in sign_in
Seen in: - altegio/biz.erp#227722 — shard 5 — launch 171516 (×1, last 2026-10-02 04:26 MSK)
SigninRedirectMissingError — 1 occurrence(s) across 1 pipeline(s)¶
autotests.lib.exception.SigninRedirectMissingError: login-XHR завершился со статусом 200, но редиректа со /signin/ не случилось за 30 с — подозрение на фронт biz.erp
--- причина (playwright) ---
Timeout 30000ms exceeded.
=========================== logs ===========================
waiting for navigation to "<function ImplToApiMapping.wrap_handler.<locals>.wrapper_func at 0x7faa67159ee0>" until 'commit'
navigated to "https://erp-testops-dev.infra.altegio.cloud/signin/"
navigated to "https://erp-testops-dev.infra.altegio.cloud/signin/"
navigated to "https://erp-testops-dev.infra.altegio.cloud/signin/JTJGdGltZXRhYmxlJTJGMTYzNjU4MjAlMkY="
navigated to "https://erp-testops-dev.infra.altegio.cloud/signin/JTJGdGltZXRhYmxlJTJGMTYzNjU4MjAlMkY="
navigated to "https://erp-testops-dev.infra.altegio.cloud/signin/JTJGdGltZXRhYmxlJTJGMTYzNjU4MjAlMkY="
============================================================
Stacktrace:
suite/yclients/biz/erp/web/timetable/test_dnd_timetable_pw.py:261 in test_move_record_on_the_same_master_on_free_time
lib/apps_pw/yclients/biz/erp/web/pages/guest/signin.py:115 in sign_in
Seen in: - altegio/biz.erp#227749 — shard 5 — launch 171616 (×1, last 2026-10-02 08:20 MSK)
SigninRedirectMissingError — 1 occurrence(s) across 1 pipeline(s)¶
autotests.lib.exception.SigninRedirectMissingError: login-XHR завершился со статусом 200, но редиректа со /signin/ не случилось за 30 с — подозрение на фронт biz.erp
--- причина (playwright) ---
Timeout 30000ms exceeded.
=========================== logs ===========================
waiting for navigation to "<function ImplToApiMapping.wrap_handler.<locals>.wrapper_func at 0x7f24fc375080>" until 'commit'
navigated to "https://erp-testops-dev.infra.altegio.cloud/signin/"
navigated to "https://erp-testops-dev.infra.altegio.cloud/signin/"
navigated to "https://erp-testops-dev.infra.altegio.cloud/signin/JTJGdGltZXRhYmxlJTJGMTYzNjc0NTIlMkY="
navigated to "https://erp-testops-dev.infra.altegio.cloud/signin/JTJGdGltZXRhYmxlJTJGMTYzNjc0NTIlMkY="
navigated to "https://erp-testops-dev.infra.altegio.cloud/signin/JTJGdGltZXRhYmxlJTJGMTYzNjc0NTIlMkY="
============================================================
Stacktrace:
suite/yclients/biz/erp/web/timetable/test_dnd_timetable_pw.py:261 in test_move_record_on_the_same_master_on_free_time
lib/apps_pw/yclients/biz/erp/web/pages/guest/signin.py:115 in sign_in
Seen in: - altegio/biz.erp#227749 — shard 5 — launch 171616 (×1, last 2026-10-02 08:20 MSK)
SigninRedirectMissingError — 1 occurrence(s) across 1 pipeline(s)¶
autotests.lib.exception.SigninRedirectMissingError: login-XHR завершился со статусом 200, но редиректа со /signin/ не случилось за 30 с — подозрение на фронт biz.erp
--- причина (playwright) ---
Timeout 30000ms exceeded.
=========================== logs ===========================
waiting for navigation to "<function ImplToApiMapping.wrap_handler.<locals>.wrapper_func at 0x7fc66029d300>" until 'commit'
navigated to "https://erp-testops-dev.infra.altegio.cloud/signin/"
navigated to "https://erp-testops-dev.infra.altegio.cloud/signin/"
navigated to "https://erp-testops-dev.infra.altegio.cloud/signin/JTJGdGltZXRhYmxlJTJGMTYzNjg0NDklMkY="
navigated to "https://erp-testops-dev.infra.altegio.cloud/signin/JTJGdGltZXRhYmxlJTJGMTYzNjg0NDklMkY="
navigated to "https://erp-testops-dev.infra.altegio.cloud/signin/JTJGdGltZXRhYmxlJTJGMTYzNjg0NDklMkY="
============================================================
Stacktrace:
suite/yclients/biz/erp/web/timetable/test_dnd_timetable_pw.py:261 in test_move_record_on_the_same_master_on_free_time
lib/apps_pw/yclients/biz/erp/web/pages/guest/signin.py:115 in sign_in
Seen in: - altegio/biz.erp#227749 — shard 5 — launch 171616 (×1, last 2026-10-02 08:20 MSK)
SigninRedirectMissingError — 1 occurrence(s) across 1 pipeline(s)¶
autotests.lib.exception.SigninRedirectMissingError: login-XHR завершился со статусом 200, но редиректа со /signin/ не случилось за 30 с — подозрение на фронт biz.erp
--- причина (playwright) ---
Timeout 30000ms exceeded.
=========================== logs ===========================
waiting for navigation to "<function ImplToApiMapping.wrap_handler.<locals>.wrapper_func at 0x7f4828dfe3e0>" until 'commit'
navigated to "https://erp-testops-dev.infra.altegio.cloud/signin/"
navigated to "https://erp-testops-dev.infra.altegio.cloud/signin/"
navigated to "https://erp-testops-dev.infra.altegio.cloud/signin/JTJGdGltZXRhYmxlJTJGMTYzNjk2NDMlMkY="
navigated to "https://erp-testops-dev.infra.altegio.cloud/signin/JTJGdGltZXRhYmxlJTJGMTYzNjk2NDMlMkY="
navigated to "https://erp-testops-dev.infra.altegio.cloud/signin/JTJGdGltZXRhYmxlJTJGMTYzNjk2NDMlMkY="
============================================================
Stacktrace:
suite/yclients/biz/erp/web/timetable/test_dnd_timetable_pw.py:261 in test_move_record_on_the_same_master_on_free_time
lib/apps_pw/yclients/biz/erp/web/pages/guest/signin.py:115 in sign_in
Seen in: - altegio/biz.erp#227787 — shard 4 — launch 171752 (×1, last 2026-10-02 11:50 MSK)
SigninRedirectMissingError — 1 occurrence(s) across 1 pipeline(s)¶
autotests.lib.exception.SigninRedirectMissingError: login-XHR завершился со статусом 200, но редиректа со /signin/ не случилось за 30 с — подозрение на фронт biz.erp
--- причина (playwright) ---
Timeout 30000ms exceeded.
=========================== logs ===========================
waiting for navigation to "<function ImplToApiMapping.wrap_handler.<locals>.wrapper_func at 0x7fead1f637e0>" until 'commit'
navigated to "https://erp-testops-dev.infra.altegio.cloud/signin/"
navigated to "https://erp-testops-dev.infra.altegio.cloud/signin/"
navigated to "https://erp-testops-dev.infra.altegio.cloud/signin/JTJGdGltZXRhYmxlJTJGMTYzNzE0NzElMkY="
navigated to "https://erp-testops-dev.infra.altegio.cloud/signin/JTJGdGltZXRhYmxlJTJGMTYzNzE0NzElMkY="
navigated to "https://erp-testops-dev.infra.altegio.cloud/signin/JTJGdGltZXRhYmxlJTJGMTYzNzE0NzElMkY="
============================================================
Stacktrace:
suite/yclients/biz/erp/web/timetable/test_dnd_timetable_pw.py:261 in test_move_record_on_the_same_master_on_free_time
lib/apps_pw/yclients/biz/erp/web/pages/guest/signin.py:115 in sign_in
Seen in: - altegio/biz.erp#227787 — shard 4 — launch 171752 (×1, last 2026-10-02 11:50 MSK)
TimeoutError — 1 occurrence(s) across 1 pipeline(s)¶
TimeoutError: timed out
pymysql.err.OperationalError: (2013, 'Lost connection to MySQL server during query (timed out)')
sqlalchemy.exc.OperationalError: (pymysql.err.OperationalError) (2013, 'Lost connection to MySQL server during query (timed out)')
[SQL: INSERT INTO documents (user_id, salon_id, storage_id, category_id, visit_id, record_id, type, comment, date_create, date, number, services_count) VALUES (%(user_id)s, %(salon_id)s, %(storage_id)s, %(category_id)s, %(visit_id)s, %(record_id)s, %(type)s, %(comment)s, %(date_create)s, %(date)s, %(number)s, %(services_count)s)]
[parameters: {'user_id': 20305306, 'salon_id': 16118321, 'storage_id': 0, 'category_id': 0, 'visit_id': 15083080, 'record_id': 20309530, 'type': 7, 'comment': '', 'date_create': datetime.datetime(2026, 9, 28, 22, 30, 19, 475381), 'date': '0000-00-00 00:00:00', 'number': 1, 'services_count': 1}]
(Background on this error at: http://sqlalche.me/e/e3q8)
Stacktrace:
lib/fixture/salon/__init__.py:196 in salon_with_entities
lib/preconditions/__init__.py:86 in create
data/db/orm/__init__.py:365 in add_entities
data/db/orm/__init__.py:74 in call_with_session
Seen in: - altegio/biz.erp#226698 — shard 4 — launch 169315 (×1, last 2026-09-28 22:50 MSK)
TimeoutError — 1 occurrence(s) across 1 pipeline(s)¶
TimeoutError: timed out
pymysql.err.OperationalError: (2013, 'Lost connection to MySQL server during query (timed out)')
sqlalchemy.exc.OperationalError: (pymysql.err.OperationalError) (2013, 'Lost connection to MySQL server during query (timed out)')
[SQL: INSERT INTO documents (user_id, salon_id, storage_id, category_id, visit_id, record_id, type, comment, date_create, date, number, services_count) VALUES (%(user_id)s, %(salon_id)s, %(storage_id)s, %(category_id)s, %(visit_id)s, %(record_id)s, %(type)s, %(comment)s, %(date_create)s, %(date)s, %(number)s, %(services_count)s)]
[parameters: {'user_id': 20306263, 'salon_id': 16119282, 'storage_id': 0, 'category_id': 0, 'visit_id': 15083947, 'record_id': 20310531, 'type': 7, 'comment': '', 'date_create': datetime.datetime(2026, 9, 28, 22, 39, 30, 106223), 'date': '0000-00-00 00:00:00', 'number': 1, 'services_count': 1}]
(Background on this error at: http://sqlalche.me/e/e3q8)
Stacktrace:
lib/fixture/salon/__init__.py:196 in salon_with_entities
lib/preconditions/__init__.py:86 in create
data/db/orm/__init__.py:365 in add_entities
data/db/orm/__init__.py:74 in call_with_session
Seen in: - altegio/biz.erp#226698 — shard 4 — launch 169315 (×1, last 2026-09-28 22:50 MSK)
TimeoutError — 1 occurrence(s) across 1 pipeline(s)¶
playwright._impl._errors.TimeoutError: Locator.click: Timeout 30000ms exceeded.
Call log:
- waiting for locator("div#calendar-block").locator("td[data-handler=\"selectDay\"]:not([class*=\"ui-datepicker-other-month\"])").filter(has=locator("[class*=\"ui-datepicker-day-text\"]").filter(has_text=re.compile(r"^\s*1\s*$"))).first.locator("a")
- locator resolved to <a href="#" class="ui-state-default ui-state-highlight ui-state-active ui-state-hover">…</a>
- attempting click action
2 × waiting for element to be visible, enabled and stable
- element is visible, enabled and stable
- scrolling into view if needed
- done scrolling
- <a target="_self" class="yc-link yc-link_light" href="https://erp-testops-dev.infra.altegio.cloud/timetable/16356199/#mode=1&main_date=2026-10-01">Reload this Page</a> from <div class="v-error-modal v-error-modal--unauthorized v-error-modal__fade-enter-active v-error-modal__fade-enter-to">…</div> subtree intercepts pointer events
- retrying click action
- waiting 20ms
- waiting for element to be visible, enabled and stable
- element is visible, enabled and stable
- scrolling into view if needed
- done scrolling
- <a target="_self" class="yc-link yc-link_light" href="https://erp-testops-dev.infra.altegio.cloud/timetable/16356199/#mode=1&main_date=2026-10-01">Reload this Page</a> from <div class="v-error-modal v-error-modal--unauthorized v-error-modal__fade-enter-active v-error-modal__fade-enter-to">…</div> subtree intercepts pointer events
2 × retrying click action
- waiting 100ms
- waiting for element to be visible, enabled and stable
- element is visible, enabled and stable
- scrolling into view if needed
- done scrolling
- <div class="v-error-modal v-error-modal--unauthorized">…</div> intercepts pointer events
14 × retrying click action
- waiting 500ms
- waiting for element to be visible, enabled and stable
- element is visible, enabled and stable
- scrolling into view if needed
- done scrolling
- <a target="_self" class="yc-link yc-link_light" href="https://erp-testops-dev.infra.altegio.cloud/timetable/16356199/#mode=1&main_date=2026-10-01">Reload this Page</a> from <div class="v-error-modal v-error-modal--unauthorized">…</div> subtree intercepts pointer events
- retrying click action
- waiting 500ms
- waiting for element to be visible, enabled and stable
- element is visible, enabled and stable
- scrolling into view if needed
- done scrolling
- <a target="_self" class="yc-link yc-link_light" href="https://erp-testops-dev.infra.altegio.cloud/timetable/16356199/#mode=1&main_date=2026-10-01">Reload this Page</a> from <div class="v-error-modal v-error-modal--unauthorized">…</div> subtree intercepts pointer events
- retrying click action
- waiting 500ms
- waiting for element to be visible, enabled and stable
- element is visible, enabled and stable
- scrolling into view if needed
- done scrolling
- <div class="v-error-modal v-error-modal--unauthorized">…</div> intercepts pointer events
- retrying click action
- waiting 500ms
- waiting for element to be visible, enabled and stable
- element is visible, enabled and stable
- scrolling into view if needed
- done scrolling
- <div class="v-error-modal v-error-modal--unauthorized">…</div> intercepts pointer events
- retrying click action
- waiting 500ms
- waiting for element to be visible, enabled and stable
- element is visible, enabled and stable
- scrolling into view if needed
- done scrolling
- <a target="_self" class="yc-link yc-link_light" href="https://erp-testops-dev.infra.altegio.cloud/timetable/16356199/#mode=1&main_date=2026-10-01">Reload this Page</a> from <div class="v-error-modal v-error-modal--unauthorized">…</div> subtree intercepts pointer ev... [truncated]
Stacktrace:
suite/yclients/biz/erp/web/timetable/test_dnd_timetable_pw.py:268 in test_move_record_on_the_same_master_on_free_time
lib/apps_pw/yclients/biz/erp/web/pages/__init__.py:77 in decorated
lib/apps_pw/yclients/biz/erp/web/pages/user.py:497 in open_timetable
lib/apps_pw/yclients/biz/erp/web/pages/user.py:635 in _set_calendar_date
lib/apps_pw/yclients/biz/erp/web/pages/user.py:621 in _navigate_and_click
Seen in: - altegio/biz.erp#227596 — shard 4 — launch 171280 (×1, last 2026-10-01 17:40 MSK)
TimeoutError — 1 occurrence(s) across 1 pipeline(s)¶
playwright._impl._errors.TimeoutError: Locator.click: Timeout 30000ms exceeded.
Call log:
- waiting for locator("div#calendar-block").locator("td[data-handler=\"selectDay\"]:not([class*=\"ui-datepicker-other-month\"])").filter(has=locator("[class*=\"ui-datepicker-day-text\"]").filter(has_text=re.compile(r"^\s*2\s*$"))).first.locator("a")
- locator resolved to <a href="#" class="ui-state-default ui-state-highlight ui-state-active">…</a>
- attempting click action
2 × waiting for element to be visible, enabled and stable
- element is visible, enabled and stable
- scrolling into view if needed
- done scrolling
- <a target="_self" class="yc-link yc-link_light" href="https://erp-testops-dev.infra.altegio.cloud/timetable/16360782/#mode=1">Reload this Page</a> from <div class="v-error-modal v-error-modal--unauthorized v-error-modal__fade-enter-active v-error-modal__fade-enter-to">…</div> subtree intercepts pointer events
- retrying click action
- waiting 20ms
- waiting for element to be visible, enabled and stable
- element is visible, enabled and stable
- scrolling into view if needed
- done scrolling
- <a target="_self" class="yc-link yc-link_light" href="https://erp-testops-dev.infra.altegio.cloud/timetable/16360782/#mode=1">Reload this Page</a> from <div class="v-error-modal v-error-modal--unauthorized v-error-modal__fade-enter-active v-error-modal__fade-enter-to">…</div> subtree intercepts pointer events
2 × retrying click action
- waiting 100ms
- waiting for element to be visible, enabled and stable
- element is visible, enabled and stable
- scrolling into view if needed
- done scrolling
- <div class="v-error-modal v-error-modal--unauthorized">…</div> intercepts pointer events
13 × retrying click action
- waiting 500ms
- waiting for element to be visible, enabled and stable
- element is visible, enabled and stable
- scrolling into view if needed
- done scrolling
- <a target="_self" class="yc-link yc-link_light" href="https://erp-testops-dev.infra.altegio.cloud/timetable/16360782/#mode=1">Reload this Page</a> from <div class="v-error-modal v-error-modal--unauthorized">…</div> subtree intercepts pointer events
- retrying click action
- waiting 500ms
- waiting for element to be visible, enabled and stable
- element is visible, enabled and stable
- scrolling into view if needed
- done scrolling
- <a target="_self" class="yc-link yc-link_light" href="https://erp-testops-dev.infra.altegio.cloud/timetable/16360782/#mode=1">Reload this Page</a> from <div class="v-error-modal v-error-modal--unauthorized">…</div> subtree intercepts pointer events
- retrying click action
- waiting 500ms
- waiting for element to be visible, enabled and stable
- element is visible, enabled and stable
- scrolling into view if needed
- done scrolling
- <div class="v-error-modal v-error-modal--unauthorized">…</div> intercepts pointer events
- retrying click action
- waiting 500ms
- waiting for element to be visible, enabled and stable
- element is visible, enabled and stable
- scrolling into view if needed
- done scrolling
- <div class="v-error-modal v-error-modal--unauthorized">…</div> intercepts pointer events
2 × retrying click action
- waiting 500ms
- waiting for element to be visible, enabled and stable
- element is visible, enabled and stable
- scrolling into view if needed
- done scrolling
- <a target="_self" class="yc-link yc-link_light" href="https://erp-testops-dev.infra.altegio.cloud/timetable/16360782/#mode=1">Reload this Page</a> from <div class="v-error-modal v-error-modal--unauthorized">…</div> subtree intercepts pointer events
- retrying click action
- waiting 500ms
- waiting for element to be visible, enabled and st... [truncated]
Stacktrace:
suite/yclients/biz/erp/web/timetable/test_dnd_timetable_pw.py:268 in test_move_record_on_the_same_master_on_free_time
lib/apps_pw/yclients/biz/erp/web/pages/__init__.py:77 in decorated
lib/apps_pw/yclients/biz/erp/web/pages/user.py:497 in open_timetable
lib/apps_pw/yclients/biz/erp/web/pages/user.py:635 in _set_calendar_date
lib/apps_pw/yclients/biz/erp/web/pages/user.py:621 in _navigate_and_click
Seen in: - altegio/biz.erp#227722 — shard 5 — launch 171516 (×1, last 2026-10-02 04:26 MSK)