Skip to content

Повтор записи со страницы успешной записи

со скрытыми шагами сотрудника и услуги. ("Записаться снова")

test_mst_scenario_master_and_service_step_hidden_book_again

Failures in last 30 days: 17

Generated at 2026-10-08 03:48 MSK

Last failure: 2026-10-02 11:50 MSK

Filter: pipelines with sandbox_biz_erp ∈ {master, testops-dev} AND autotests_branch ∈ {master, main} only (testops-dev — daytime ticks since 2026-08-05).

By exception class: - TimeoutException — 14 - WebDriverException — 3

Failure signatures (grouped by exception + full message):

TimeoutException — 1 occurrence(s) across 1 pipeline(s)

selenium.common.exceptions.TimeoutException: Message: Ожидаем элемент в DOM: "[data-locator="timeslot"]", параметры метода ожидания: ([
    "css selector",
    "None",
    "[data-locator=\"timeslot\"]",
    "<autotests.lib.apps.yclients.client.booking.web.pages.select_time.SelectTimePage object at 0x7ff25c14dee0>"
]), условия ожидания: ([
    "timeout: 25s"
])
Stacktrace:
#0 0x55876a68a5e3 <unknown>
#1 0x55876a34d0b7 <unknown>
#2 0x55876a39af53 <unknown>
#3 0x55876a39b051 <unknown>
#4 0x55876a3e09c4 <unknown>
#5 0x55876a3c1f1d <unknown>
#6 0x55876a3ddb3d <unknown>
#7 0x55876a3c1cc3 <unknown>
#8 0x55876a38d0e4 <unknown>
#9 0x55876a38e0ae <unknown>
#10 0x55876a650ce1 <unknown>
#11 0x55876a654b7e <unknown>
#12 0x55876a63e4b5 <unknown>
#13 0x55876a6557d6 <unknown>
#14 0x55876a621dbf <unknown>
#15 0x55876a678748 <unknown>
#16 0x55876a678917 <unknown>
#17 0x55876a689773 <unknown>
#18 0x7fb4011a5aa4 <unknown>
#19 0x7fb401232a64 __clone
Exception: There are no available spots for this day

Stacktrace:

suite/yclients/client/booking/web/online_booking/master_service_time_scenario/test_service_step_hidden.py:561 in test_mst_scenario_master_and_service_step_hidden_book_again
lib/common/ui/pages/web.py:61 in decorated
lib/apps/yclients/client/booking/web/pages/select_time.py:302 in select_date_and_time
lib/common/ui/pages/web.py:61 in decorated
lib/apps/yclients/client/booking/web/pages/select_time.py:351 in select_time

Seen in: - altegio/biz.erp#226015 — shard 7 — launch 168200 (×1, last 2026-09-26 05:38 MSK)

TimeoutException — 1 occurrence(s) across 1 pipeline(s)

selenium.common.exceptions.TimeoutException: Message: Ожидаем элемент в DOM: "[data-locator="timeslot"]", параметры метода ожидания: ([
    "css selector",
    "None",
    "[data-locator=\"timeslot\"]",
    "<autotests.lib.apps.yclients.client.booking.web.pages.select_time.SelectTimePage object at 0x7f69d2dece60>"
]), условия ожидания: ([
    "timeout: 25s"
])
Stacktrace:
#0 0x56043506e5e3 <unknown>
#1 0x560434d310b7 <unknown>
#2 0x560434d7ef53 <unknown>
#3 0x560434d7f051 <unknown>
#4 0x560434dc49c4 <unknown>
#5 0x560434da5f1d <unknown>
#6 0x560434dc1b3d <unknown>
#7 0x560434da5cc3 <unknown>
#8 0x560434d710e4 <unknown>
#9 0x560434d720ae <unknown>
#10 0x560435034ce1 <unknown>
#11 0x560435038b7e <unknown>
#12 0x5604350224b5 <unknown>
#13 0x5604350397d6 <unknown>
#14 0x560435005dbf <unknown>
#15 0x56043505c748 <unknown>
#16 0x56043505c917 <unknown>
#17 0x56043506d773 <unknown>
#18 0x7fc831deaaa4 <unknown>
#19 0x7fc831e77a64 __clone
Exception: There are no available spots for this day

Stacktrace:

suite/yclients/client/booking/web/online_booking/master_service_time_scenario/test_service_step_hidden.py:561 in test_mst_scenario_master_and_service_step_hidden_book_again
lib/common/ui/pages/web.py:61 in decorated
lib/apps/yclients/client/booking/web/pages/select_time.py:302 in select_date_and_time
lib/common/ui/pages/web.py:61 in decorated
lib/apps/yclients/client/booking/web/pages/select_time.py:351 in select_time

Seen in: - altegio/biz.erp#226187 — shard 3 — launch 168304 (×1, last 2026-09-27 03:40 MSK)

TimeoutException — 1 occurrence(s) across 1 pipeline(s)

selenium.common.exceptions.TimeoutException: Message: Ожидаем элемент в DOM: "[data-locator="timeslot"]", параметры метода ожидания: ([
    "css selector",
    "None",
    "[data-locator=\"timeslot\"]",
    "<autotests.lib.apps.yclients.client.booking.web.pages.select_time.SelectTimePage object at 0x7f8d2649d820>"
]), условия ожидания: ([
    "timeout: 25s"
])
Stacktrace:
#0 0x55e29fa445e3 <unknown>
#1 0x55e29f7070b7 <unknown>
#2 0x55e29f754f53 <unknown>
#3 0x55e29f755051 <unknown>
#4 0x55e29f79a9c4 <unknown>
#5 0x55e29f77bf1d <unknown>
#6 0x55e29f797b3d <unknown>
#7 0x55e29f77bcc3 <unknown>
#8 0x55e29f7470e4 <unknown>
#9 0x55e29f7480ae <unknown>
#10 0x55e29fa0ace1 <unknown>
#11 0x55e29fa0eb7e <unknown>
#12 0x55e29f9f84b5 <unknown>
#13 0x55e29fa0f7d6 <unknown>
#14 0x55e29f9dbdbf <unknown>
#15 0x55e29fa32748 <unknown>
#16 0x55e29fa32917 <unknown>
#17 0x55e29fa43773 <unknown>
#18 0x7fdc13d97aa4 <unknown>
#19 0x7fdc13e24a64 __clone
Exception: There are no available spots for this day

Stacktrace:

suite/yclients/client/booking/web/online_booking/master_service_time_scenario/test_service_step_hidden.py:561 in test_mst_scenario_master_and_service_step_hidden_book_again
lib/common/ui/pages/web.py:61 in decorated
lib/apps/yclients/client/booking/web/pages/select_time.py:302 in select_date_and_time
lib/common/ui/pages/web.py:61 in decorated
lib/apps/yclients/client/booking/web/pages/select_time.py:351 in select_time

Seen in: - altegio/biz.erp#226187 — shard 3 — launch 168304 (×1, last 2026-09-27 03:40 MSK)

TimeoutException — 1 occurrence(s) across 1 pipeline(s)

selenium.common.exceptions.TimeoutException: Message: Ожидаем элемент в DOM: "[data-locator="timeslot"]", параметры метода ожидания: ([
    "css selector",
    "None",
    "[data-locator=\"timeslot\"]",
    "<autotests.lib.apps.yclients.client.booking.web.pages.select_time.SelectTimePage object at 0x7f22ae6c7920>"
]), условия ожидания: ([
    "timeout: 25s"
])
Stacktrace:
#0 0x55fa5f68d5e3 <unknown>
#1 0x55fa5f3500b7 <unknown>
#2 0x55fa5f39df53 <unknown>
#3 0x55fa5f39e051 <unknown>
#4 0x55fa5f3e39c4 <unknown>
#5 0x55fa5f3c4f1d <unknown>
#6 0x55fa5f3e0b3d <unknown>
#7 0x55fa5f3c4cc3 <unknown>
#8 0x55fa5f3900e4 <unknown>
#9 0x55fa5f3910ae <unknown>
#10 0x55fa5f653ce1 <unknown>
#11 0x55fa5f657b7e <unknown>
#12 0x55fa5f6414b5 <unknown>
#13 0x55fa5f6587d6 <unknown>
#14 0x55fa5f624dbf <unknown>
#15 0x55fa5f67b748 <unknown>
#16 0x55fa5f67b917 <unknown>
#17 0x55fa5f68c773 <unknown>
#18 0x7fee91c99aa4 <unknown>
#19 0x7fee91d26a64 __clone
Exception: There are no available spots for this day

Stacktrace:

suite/yclients/client/booking/web/online_booking/master_service_time_scenario/test_service_step_hidden.py:561 in test_mst_scenario_master_and_service_step_hidden_book_again
lib/common/ui/pages/web.py:61 in decorated
lib/apps/yclients/client/booking/web/pages/select_time.py:302 in select_date_and_time
lib/common/ui/pages/web.py:61 in decorated
lib/apps/yclients/client/booking/web/pages/select_time.py:351 in select_time

Seen in: - altegio/biz.erp#226401 — shard 1 — launch 168544 (×1, last 2026-09-28 05:36 MSK)

TimeoutException — 1 occurrence(s) across 1 pipeline(s)

selenium.common.exceptions.TimeoutException: Message: Ожидаем элемент в DOM: "[data-locator="timeslot"]", параметры метода ожидания: ([
    "css selector",
    "None",
    "[data-locator=\"timeslot\"]",
    "<autotests.lib.apps.yclients.client.booking.web.pages.select_time.SelectTimePage object at 0x7ff716192480>"
]), условия ожидания: ([
    "timeout: 25s"
])
Stacktrace:
#0 0x5602e50cd5e3 <unknown>
#1 0x5602e4d900b7 <unknown>
#2 0x5602e4dddf53 <unknown>
#3 0x5602e4dde051 <unknown>
#4 0x5602e4e239c4 <unknown>
#5 0x5602e4e04f1d <unknown>
#6 0x5602e4e20b3d <unknown>
#7 0x5602e4e04cc3 <unknown>
#8 0x5602e4dd00e4 <unknown>
#9 0x5602e4dd10ae <unknown>
#10 0x5602e5093ce1 <unknown>
#11 0x5602e5097b7e <unknown>
#12 0x5602e50814b5 <unknown>
#13 0x5602e50987d6 <unknown>
#14 0x5602e5064dbf <unknown>
#15 0x5602e50bb748 <unknown>
#16 0x5602e50bb917 <unknown>
#17 0x5602e50cc773 <unknown>
#18 0x7f2d4c753aa4 <unknown>
#19 0x7f2d4c7e0a64 __clone
Exception: There are no available spots for this day

Stacktrace:

suite/yclients/client/booking/web/online_booking/master_service_time_scenario/test_service_step_hidden.py:561 in test_mst_scenario_master_and_service_step_hidden_book_again
lib/common/ui/pages/web.py:61 in decorated
lib/apps/yclients/client/booking/web/pages/select_time.py:302 in select_date_and_time
lib/common/ui/pages/web.py:61 in decorated
lib/apps/yclients/client/booking/web/pages/select_time.py:351 in select_time

Seen in: - altegio/biz.erp#227722 — shard 5 — launch 171516 (×1, last 2026-10-02 04:26 MSK)

TimeoutException — 1 occurrence(s) across 1 pipeline(s)

selenium.common.exceptions.TimeoutException: Message: Ожидаем элемент в DOM: "[data-locator="timeslot"]", параметры метода ожидания: ([
    "css selector",
    "None",
    "[data-locator=\"timeslot\"]",
    "<autotests.lib.apps.yclients.client.booking.web.pages.select_time.SelectTimePage object at 0x7f31ab2aff50>"
]), условия ожидания: ([
    "timeout: 25s"
])
Stacktrace:
#0 0x56107c89a5e3 <unknown>
#1 0x56107c55d0b7 <unknown>
#2 0x56107c5aaf53 <unknown>
#3 0x56107c5ab051 <unknown>
#4 0x56107c5f09c4 <unknown>
#5 0x56107c5d1f1d <unknown>
#6 0x56107c5edb3d <unknown>
#7 0x56107c5d1cc3 <unknown>
#8 0x56107c59d0e4 <unknown>
#9 0x56107c59e0ae <unknown>
#10 0x56107c860ce1 <unknown>
#11 0x56107c864b7e <unknown>
#12 0x56107c84e4b5 <unknown>
#13 0x56107c8657d6 <unknown>
#14 0x56107c831dbf <unknown>
#15 0x56107c888748 <unknown>
#16 0x56107c888917 <unknown>
#17 0x56107c899773 <unknown>
#18 0x7fb35250daa4 <unknown>
#19 0x7fb35259aa64 __clone
Exception: There are no available spots for this day

Stacktrace:

suite/yclients/client/booking/web/online_booking/master_service_time_scenario/test_service_step_hidden.py:561 in test_mst_scenario_master_and_service_step_hidden_book_again
lib/common/ui/pages/web.py:61 in decorated
lib/apps/yclients/client/booking/web/pages/select_time.py:302 in select_date_and_time
lib/common/ui/pages/web.py:61 in decorated
lib/apps/yclients/client/booking/web/pages/select_time.py:351 in select_time

Seen in: - altegio/biz.erp#227722 — shard 5 — launch 171516 (×1, last 2026-10-02 04:26 MSK)

TimeoutException — 1 occurrence(s) across 1 pipeline(s)

selenium.common.exceptions.TimeoutException: Message: Ожидаем элемент в DOM: "[data-locator="timeslot"]", параметры метода ожидания: ([
    "css selector",
    "None",
    "[data-locator=\"timeslot\"]",
    "<autotests.lib.apps.yclients.client.booking.web.pages.select_time.SelectTimePage object at 0x7f1c547b7d10>"
]), условия ожидания: ([
    "timeout: 25s"
])
Stacktrace:
#0 0x557e9366d5e3 <unknown>
#1 0x557e933300b7 <unknown>
#2 0x557e9337df53 <unknown>
#3 0x557e9337e051 <unknown>
#4 0x557e933c39c4 <unknown>
#5 0x557e933a4f1d <unknown>
#6 0x557e933c0b3d <unknown>
#7 0x557e933a4cc3 <unknown>
#8 0x557e933700e4 <unknown>
#9 0x557e933710ae <unknown>
#10 0x557e93633ce1 <unknown>
#11 0x557e93637b7e <unknown>
#12 0x557e936214b5 <unknown>
#13 0x557e936387d6 <unknown>
#14 0x557e93604dbf <unknown>
#15 0x557e9365b748 <unknown>
#16 0x557e9365b917 <unknown>
#17 0x557e9366c773 <unknown>
#18 0x7f39085e2aa4 <unknown>
#19 0x7f390866fa64 __clone
Exception: There are no available spots for this day

Stacktrace:

suite/yclients/client/booking/web/online_booking/master_service_time_scenario/test_service_step_hidden.py:561 in test_mst_scenario_master_and_service_step_hidden_book_again
lib/common/ui/pages/web.py:61 in decorated
lib/apps/yclients/client/booking/web/pages/select_time.py:302 in select_date_and_time
lib/common/ui/pages/web.py:61 in decorated
lib/apps/yclients/client/booking/web/pages/select_time.py:351 in select_time

Seen in: - altegio/biz.erp#227722 — shard 5 — launch 171516 (×1, last 2026-10-02 04:26 MSK)

TimeoutException — 1 occurrence(s) across 1 pipeline(s)

selenium.common.exceptions.TimeoutException: Message: Ожидаем элемент в DOM: "[data-locator="timeslot"]", параметры метода ожидания: ([
    "css selector",
    "None",
    "[data-locator=\"timeslot\"]",
    "<autotests.lib.apps.yclients.client.booking.web.pages.select_time.SelectTimePage object at 0x7fdeb81a0fe0>"
]), условия ожидания: ([
    "timeout: 25s"
])
Stacktrace:
#0 0x55b3742fa5e3 <unknown>
#1 0x55b373fbd0b7 <unknown>
#2 0x55b37400af53 <unknown>
#3 0x55b37400b051 <unknown>
#4 0x55b3740509c4 <unknown>
#5 0x55b374031f1d <unknown>
#6 0x55b37404db3d <unknown>
#7 0x55b374031cc3 <unknown>
#8 0x55b373ffd0e4 <unknown>
#9 0x55b373ffe0ae <unknown>
#10 0x55b3742c0ce1 <unknown>
#11 0x55b3742c4b7e <unknown>
#12 0x55b3742ae4b5 <unknown>
#13 0x55b3742c57d6 <unknown>
#14 0x55b374291dbf <unknown>
#15 0x55b3742e8748 <unknown>
#16 0x55b3742e8917 <unknown>
#17 0x55b3742f9773 <unknown>
#18 0x7f51d808faa4 <unknown>
#19 0x7f51d811ca64 __clone
Exception: There are no available spots for this day

Stacktrace:

suite/yclients/client/booking/web/online_booking/master_service_time_scenario/test_service_step_hidden.py:561 in test_mst_scenario_master_and_service_step_hidden_book_again
lib/common/ui/pages/web.py:61 in decorated
lib/apps/yclients/client/booking/web/pages/select_time.py:302 in select_date_and_time
lib/common/ui/pages/web.py:61 in decorated
lib/apps/yclients/client/booking/web/pages/select_time.py:351 in select_time

Seen in: - altegio/biz.erp#227735 — shard 8 — launch 171549 (×1, last 2026-10-02 06:23 MSK)

TimeoutException — 1 occurrence(s) across 1 pipeline(s)

selenium.common.exceptions.TimeoutException: Message: Ожидаем элемент в DOM: "[data-locator="book_again_btn"]", параметры метода ожидания: ([
    "css selector",
    "None",
    "[data-locator=\"book_again_btn\"]",
    "<autotests.lib.apps.yclients.client.booking.web.pages.created_booking.CreatedBookingPage object at 0x7f4128a45c10>"
]), условия ожидания: ([
    "timeout: 25s"
])
Stacktrace:
#0 0x5580e30755e3 <unknown>
#1 0x5580e2d380b7 <unknown>
#2 0x5580e2d85f53 <unknown>
#3 0x5580e2d86051 <unknown>
#4 0x5580e2dcb9c4 <unknown>
#5 0x5580e2dacf1d <unknown>
#6 0x5580e2dc8b3d <unknown>
#7 0x5580e2daccc3 <unknown>
#8 0x5580e2d780e4 <unknown>
#9 0x5580e2d790ae <unknown>
#10 0x5580e303bce1 <unknown>
#11 0x5580e303fb7e <unknown>
#12 0x5580e30294b5 <unknown>
#13 0x5580e30407d6 <unknown>
#14 0x5580e300cdbf <unknown>
#15 0x5580e3063748 <unknown>
#16 0x5580e3063917 <unknown>
#17 0x5580e3074773 <unknown>
#18 0x7f01fce85aa4 <unknown>
#19 0x7f01fcf12a64 __clone

Stacktrace:

lib/common/ui/pages/web.py:61 in decorated
lib/apps/yclients/client/booking/web/pages/created_booking.py:378 in click_book_again
lib/common/ui/pages/web.py:61 in decorated
lib/common/ui/pages/web.py:148 in wait_for_element
lib/ui/selenium/webdriver/support/wait.py:28 in until

Seen in: - altegio/biz.erp#227735 — shard 8 — launch 171549 (×1, last 2026-10-02 06:23 MSK)

TimeoutException — 1 occurrence(s) across 1 pipeline(s)

selenium.common.exceptions.TimeoutException: Message: Ожидаем элемент в DOM: "[data-locator="book_again_btn"]", параметры метода ожидания: ([
    "css selector",
    "None",
    "[data-locator=\"book_again_btn\"]",
    "<autotests.lib.apps.yclients.client.booking.web.pages.created_booking.CreatedBookingPage object at 0x7fbe1481d970>"
]), условия ожидания: ([
    "timeout: 25s"
])
Stacktrace:
#0 0x559a6f5a65e3 <unknown>
#1 0x559a6f2690b7 <unknown>
#2 0x559a6f2b6f53 <unknown>
#3 0x559a6f2b7051 <unknown>
#4 0x559a6f2fc9c4 <unknown>
#5 0x559a6f2ddf1d <unknown>
#6 0x559a6f2f9b3d <unknown>
#7 0x559a6f2ddcc3 <unknown>
#8 0x559a6f2a90e4 <unknown>
#9 0x559a6f2aa0ae <unknown>
#10 0x559a6f56cce1 <unknown>
#11 0x559a6f570b7e <unknown>
#12 0x559a6f55a4b5 <unknown>
#13 0x559a6f5717d6 <unknown>
#14 0x559a6f53ddbf <unknown>
#15 0x559a6f594748 <unknown>
#16 0x559a6f594917 <unknown>
#17 0x559a6f5a5773 <unknown>
#18 0x7f43edb36aa4 <unknown>
#19 0x7f43edbc3a64 __clone

Stacktrace:

lib/common/ui/pages/web.py:61 in decorated
lib/apps/yclients/client/booking/web/pages/created_booking.py:378 in click_book_again
lib/common/ui/pages/web.py:61 in decorated
lib/common/ui/pages/web.py:148 in wait_for_element
lib/ui/selenium/webdriver/support/wait.py:28 in until

Seen in: - altegio/biz.erp#227735 — shard 8 — launch 171549 (×1, last 2026-10-02 06:23 MSK)

TimeoutException — 1 occurrence(s) across 1 pipeline(s)

selenium.common.exceptions.TimeoutException: Message: Ожидаем элемент в DOM: "[data-locator="book_again_btn"]", параметры метода ожидания: ([
    "css selector",
    "None",
    "[data-locator=\"book_again_btn\"]",
    "<autotests.lib.apps.yclients.client.booking.web.pages.created_booking.CreatedBookingPage object at 0x7f36b8727680>"
]), условия ожидания: ([
    "timeout: 25s"
])
Stacktrace:
#0 0x56502cc855e3 <unknown>
#1 0x56502c9480b7 <unknown>
#2 0x56502c995f53 <unknown>
#3 0x56502c996051 <unknown>
#4 0x56502c9db9c4 <unknown>
#5 0x56502c9bcf1d <unknown>
#6 0x56502c9d8b3d <unknown>
#7 0x56502c9bccc3 <unknown>
#8 0x56502c9880e4 <unknown>
#9 0x56502c9890ae <unknown>
#10 0x56502cc4bce1 <unknown>
#11 0x56502cc4fb7e <unknown>
#12 0x56502cc394b5 <unknown>
#13 0x56502cc507d6 <unknown>
#14 0x56502cc1cdbf <unknown>
#15 0x56502cc73748 <unknown>
#16 0x56502cc73917 <unknown>
#17 0x56502cc84773 <unknown>
#18 0x7fc13be9faa4 <unknown>
#19 0x7fc13bf2ca64 __clone

Stacktrace:

lib/common/ui/pages/web.py:61 in decorated
lib/apps/yclients/client/booking/web/pages/created_booking.py:378 in click_book_again
lib/common/ui/pages/web.py:61 in decorated
lib/common/ui/pages/web.py:148 in wait_for_element
lib/ui/selenium/webdriver/support/wait.py:28 in until

Seen in: - altegio/biz.erp#227749 — shard 6 — launch 171616 (×1, last 2026-10-02 08:20 MSK)

TimeoutException — 1 occurrence(s) across 1 pipeline(s)

selenium.common.exceptions.TimeoutException: Message: Ожидаем элемент в DOM: "[data-locator="book_again_btn"]", параметры метода ожидания: ([
    "css selector",
    "None",
    "[data-locator=\"book_again_btn\"]",
    "<autotests.lib.apps.yclients.client.booking.web.pages.created_booking.CreatedBookingPage object at 0x7fa041bc1550>"
]), условия ожидания: ([
    "timeout: 25s"
])
Stacktrace:
#0 0x557f725255e3 <unknown>
#1 0x557f721e80b7 <unknown>
#2 0x557f72235f53 <unknown>
#3 0x557f72236051 <unknown>
#4 0x557f7227b9c4 <unknown>
#5 0x557f7225cf1d <unknown>
#6 0x557f72278b3d <unknown>
#7 0x557f7225ccc3 <unknown>
#8 0x557f722280e4 <unknown>
#9 0x557f722290ae <unknown>
#10 0x557f724ebce1 <unknown>
#11 0x557f724efb7e <unknown>
#12 0x557f724d94b5 <unknown>
#13 0x557f724f07d6 <unknown>
#14 0x557f724bcdbf <unknown>
#15 0x557f72513748 <unknown>
#16 0x557f72513917 <unknown>
#17 0x557f72524773 <unknown>
#18 0x7f3e63a1eaa4 <unknown>
#19 0x7f3e63aaba64 __clone

Stacktrace:

lib/common/ui/pages/web.py:61 in decorated
lib/apps/yclients/client/booking/web/pages/created_booking.py:378 in click_book_again
lib/common/ui/pages/web.py:61 in decorated
lib/common/ui/pages/web.py:148 in wait_for_element
lib/ui/selenium/webdriver/support/wait.py:28 in until

Seen in: - altegio/biz.erp#227749 — shard 6 — launch 171616 (×1, last 2026-10-02 08:20 MSK)

TimeoutException — 1 occurrence(s) across 1 pipeline(s)

selenium.common.exceptions.TimeoutException: Message: Ожидаем элемент в DOM: "[data-locator="book_again_btn"]", параметры метода ожидания: ([
    "css selector",
    "None",
    "[data-locator=\"book_again_btn\"]",
    "<autotests.lib.apps.yclients.client.booking.web.pages.created_booking.CreatedBookingPage object at 0x7f97dc3bcef0>"
]), условия ожидания: ([
    "timeout: 25s"
])
Stacktrace:
#0 0x555f91f8f5e3 <unknown>
#1 0x555f91c520b7 <unknown>
#2 0x555f91c9ff53 <unknown>
#3 0x555f91ca0051 <unknown>
#4 0x555f91ce59c4 <unknown>
#5 0x555f91cc6f1d <unknown>
#6 0x555f91ce2b3d <unknown>
#7 0x555f91cc6cc3 <unknown>
#8 0x555f91c920e4 <unknown>
#9 0x555f91c930ae <unknown>
#10 0x555f91f55ce1 <unknown>
#11 0x555f91f59b7e <unknown>
#12 0x555f91f434b5 <unknown>
#13 0x555f91f5a7d6 <unknown>
#14 0x555f91f26dbf <unknown>
#15 0x555f91f7d748 <unknown>
#16 0x555f91f7d917 <unknown>
#17 0x555f91f8e773 <unknown>
#18 0x7f131e305aa4 <unknown>
#19 0x7f131e392a64 __clone

Stacktrace:

lib/common/ui/pages/web.py:61 in decorated
lib/apps/yclients/client/booking/web/pages/created_booking.py:378 in click_book_again
lib/common/ui/pages/web.py:61 in decorated
lib/common/ui/pages/web.py:148 in wait_for_element
lib/ui/selenium/webdriver/support/wait.py:28 in until

Seen in: - altegio/biz.erp#227749 — shard 6 — launch 171616 (×1, last 2026-10-02 08:20 MSK)

TimeoutException — 1 occurrence(s) across 1 pipeline(s)

selenium.common.exceptions.TimeoutException: Message: Ожидаем элемент в DOM: "[data-locator="book_again_btn"]", параметры метода ожидания: ([
    "css selector",
    "None",
    "[data-locator=\"book_again_btn\"]",
    "<autotests.lib.apps.yclients.client.booking.web.pages.created_booking.CreatedBookingPage object at 0x7fc3eeffccb0>"
]), условия ожидания: ([
    "timeout: 25s"
])
Stacktrace:
#0 0x55bdaa7345e3 <unknown>
#1 0x55bdaa3f70b7 <unknown>
#2 0x55bdaa444f53 <unknown>
#3 0x55bdaa445051 <unknown>
#4 0x55bdaa48a9c4 <unknown>
#5 0x55bdaa46bf1d <unknown>
#6 0x55bdaa487b3d <unknown>
#7 0x55bdaa46bcc3 <unknown>
#8 0x55bdaa4370e4 <unknown>
#9 0x55bdaa4380ae <unknown>
#10 0x55bdaa6face1 <unknown>
#11 0x55bdaa6feb7e <unknown>
#12 0x55bdaa6e84b5 <unknown>
#13 0x55bdaa6ff7d6 <unknown>
#14 0x55bdaa6cbdbf <unknown>
#15 0x55bdaa722748 <unknown>
#16 0x55bdaa722917 <unknown>
#17 0x55bdaa733773 <unknown>
#18 0x7f5a810c1aa4 <unknown>
#19 0x7f5a8114ea64 __clone

Stacktrace:

lib/common/ui/pages/web.py:61 in decorated
lib/apps/yclients/client/booking/web/pages/created_booking.py:378 in click_book_again
lib/common/ui/pages/web.py:61 in decorated
lib/common/ui/pages/web.py:148 in wait_for_element
lib/ui/selenium/webdriver/support/wait.py:28 in until

Seen in: - altegio/biz.erp#227787 — shard 7 — launch 171752 (×1, last 2026-10-02 11:50 MSK)

WebDriverException — 1 occurrence(s) across 1 pipeline(s)

selenium.common.exceptions.WebDriverException: Message: <unknown>: Failed to read the 'localStorage' property from 'Window': Access is denied for this document.
  (Session info: headless chrome=119.0.6045.199)
Stacktrace:
#0 0x558e633dc5e3 <unknown>
#1 0x558e6309f0b7 <unknown>
#2 0x558e630a52b5 <unknown>
#3 0x558e630a79b1 <unknown>
#4 0x558e6313071f <unknown>
#5 0x558e63113ef2 <unknown>
#6 0x558e6312fb3d <unknown>
#7 0x558e63113cc3 <unknown>
#8 0x558e630df0e4 <unknown>
#9 0x558e630e00ae <unknown>
#10 0x558e633a2ce1 <unknown>
#11 0x558e633a6b7e <unknown>
#12 0x558e633904b5 <unknown>
#13 0x558e633a77d6 <unknown>
#14 0x558e63373dbf <unknown>
#15 0x558e633ca748 <unknown>
#16 0x558e633ca917 <unknown>
#17 0x558e633db773 <unknown>
#18 0x7ff8f7a9aaa4 <unknown>
#19 0x7ff8f7b27a64 __clone

Stacktrace:

lib/common/ui/pages/web.py:61 in decorated
lib/apps/yclients/client/booking/web/pages/__init__.py:80 in open
lib/common/ui/pages/web.py:61 in decorated
lib/apps/yclients/client/booking/web/pages/__init__.py:41 in set_environment
lib/ui/selenium/webdriver/__init__.py:52 in execute_script

Seen in: - altegio/client.booking#224668 — shard 6 — launch 165208 (×1, last 2026-09-21 08:16 MSK)

WebDriverException — 1 occurrence(s) across 1 pipeline(s)

selenium.common.exceptions.WebDriverException: Message: <unknown>: Failed to read the 'localStorage' property from 'Window': Access is denied for this document.
  (Session info: headless chrome=119.0.6045.199)
Stacktrace:
#0 0x560d3b8555e3 <unknown>
#1 0x560d3b5180b7 <unknown>
#2 0x560d3b51e2b5 <unknown>
#3 0x560d3b5209b1 <unknown>
#4 0x560d3b5a971f <unknown>
#5 0x560d3b58cef2 <unknown>
#6 0x560d3b5a8b3d <unknown>
#7 0x560d3b58ccc3 <unknown>
#8 0x560d3b5580e4 <unknown>
#9 0x560d3b5590ae <unknown>
#10 0x560d3b81bce1 <unknown>
#11 0x560d3b81fb7e <unknown>
#12 0x560d3b8094b5 <unknown>
#13 0x560d3b8207d6 <unknown>
#14 0x560d3b7ecdbf <unknown>
#15 0x560d3b843748 <unknown>
#16 0x560d3b843917 <unknown>
#17 0x560d3b854773 <unknown>
#18 0x7f5e6c03aaa4 <unknown>
#19 0x7f5e6c0c7a64 __clone

Stacktrace:

lib/common/ui/pages/web.py:61 in decorated
lib/apps/yclients/client/booking/web/pages/__init__.py:80 in open
lib/common/ui/pages/web.py:61 in decorated
lib/apps/yclients/client/booking/web/pages/__init__.py:41 in set_environment
lib/ui/selenium/webdriver/__init__.py:52 in execute_script

Seen in: - altegio/client.booking#224668 — shard 6 — launch 165208 (×1, last 2026-09-21 08:16 MSK)

WebDriverException — 1 occurrence(s) across 1 pipeline(s)

selenium.common.exceptions.WebDriverException: Message: <unknown>: Failed to read the 'localStorage' property from 'Window': Access is denied for this document.
  (Session info: headless chrome=119.0.6045.199)
Stacktrace:
#0 0x5557cab785e3 <unknown>
#1 0x5557ca83b0b7 <unknown>
#2 0x5557ca8412b5 <unknown>
#3 0x5557ca8439b1 <unknown>
#4 0x5557ca8cc71f <unknown>
#5 0x5557ca8afef2 <unknown>
#6 0x5557ca8cbb3d <unknown>
#7 0x5557ca8afcc3 <unknown>
#8 0x5557ca87b0e4 <unknown>
#9 0x5557ca87c0ae <unknown>
#10 0x5557cab3ece1 <unknown>
#11 0x5557cab42b7e <unknown>
#12 0x5557cab2c4b5 <unknown>
#13 0x5557cab437d6 <unknown>
#14 0x5557cab0fdbf <unknown>
#15 0x5557cab66748 <unknown>
#16 0x5557cab66917 <unknown>
#17 0x5557cab77773 <unknown>
#18 0x7f7ba6a4faa4 <unknown>
#19 0x7f7ba6adca64 __clone

Stacktrace:

lib/common/ui/pages/web.py:61 in decorated
lib/apps/yclients/client/booking/web/pages/__init__.py:80 in open
lib/common/ui/pages/web.py:61 in decorated
lib/apps/yclients/client/booking/web/pages/__init__.py:41 in set_environment
lib/ui/selenium/webdriver/__init__.py:52 in execute_script

Seen in: - altegio/client.booking#224668 — shard 6 — launch 165208 (×1, last 2026-09-21 08:16 MSK)