В шапке виджета есть наименование филиала, нет кнопки назад, при скрытых шагах услуги и сотрудника¶
test_mst_scenario_master_and_service_step_hidden_filial_name_in_title
Failures in last 30 days: 6
Generated at 2026-10-08 03:53 MSK
Last failure: 2026-10-01 00:53 MSK
Filter: pipelines with sandbox_biz_erp ∈ {master, testops-dev} AND autotests_branch ∈ {master, main} only (testops-dev — daytime ticks since 2026-08-05).
By exception class:
- WebDriverException — 3
- AssertionError — 3
Failure signatures (grouped by exception + full message):
AssertionError — 3 occurrence(s) across 1 pipeline(s)¶
AssertionError: Неверный текущий месяц
Expected: 'october'
but: was 'september'
Stacktrace:
suite/yclients/client/booking/web/online_booking/master_service_time_scenario/test_master_step_hidden.py:388 in test_mst_scenario_master_and_service_step_hidden_filial_name_in_title
lib/utils/hamcrest/__init__.py:20 in assert_that
lib/utils/hamcrest/__init__.py:35 in _assert_match
Seen in: - altegio/client.booking#227407 — shard 8 — launch 170831 (×3, last 2026-10-01 00:53 MSK)
WebDriverException — 1 occurrence(s) across 1 pipeline(s)¶
selenium.common.exceptions.WebDriverException: Message: <unknown>: Failed to read the 'localStorage' property from 'Window': Access is denied for this document.
(Session info: headless chrome=119.0.6045.199)
Stacktrace:
#0 0x55b6055835e3 <unknown>
#1 0x55b6052460b7 <unknown>
#2 0x55b60524c2b5 <unknown>
#3 0x55b60524e9b1 <unknown>
#4 0x55b6052d771f <unknown>
#5 0x55b6052baef2 <unknown>
#6 0x55b6052d6b3d <unknown>
#7 0x55b6052bacc3 <unknown>
#8 0x55b6052860e4 <unknown>
#9 0x55b6052870ae <unknown>
#10 0x55b605549ce1 <unknown>
#11 0x55b60554db7e <unknown>
#12 0x55b6055374b5 <unknown>
#13 0x55b60554e7d6 <unknown>
#14 0x55b60551adbf <unknown>
#15 0x55b605571748 <unknown>
#16 0x55b605571917 <unknown>
#17 0x55b605582773 <unknown>
#18 0x7f9d55dccaa4 <unknown>
#19 0x7f9d55e59a64 __clone
Stacktrace:
lib/common/ui/pages/web.py:61 in decorated
lib/apps/yclients/client/booking/web/pages/__init__.py:80 in open
lib/common/ui/pages/web.py:61 in decorated
lib/apps/yclients/client/booking/web/pages/__init__.py:41 in set_environment
lib/ui/selenium/webdriver/__init__.py:52 in execute_script
Seen in: - altegio/client.booking#224668 — shard 7 — launch 165208 (×1, last 2026-09-21 08:16 MSK)
WebDriverException — 1 occurrence(s) across 1 pipeline(s)¶
selenium.common.exceptions.WebDriverException: Message: <unknown>: Failed to read the 'localStorage' property from 'Window': Access is denied for this document.
(Session info: headless chrome=119.0.6045.199)
Stacktrace:
#0 0x5596c6b035e3 <unknown>
#1 0x5596c67c60b7 <unknown>
#2 0x5596c67cc2b5 <unknown>
#3 0x5596c67ce9b1 <unknown>
#4 0x5596c685771f <unknown>
#5 0x5596c683aef2 <unknown>
#6 0x5596c6856b3d <unknown>
#7 0x5596c683acc3 <unknown>
#8 0x5596c68060e4 <unknown>
#9 0x5596c68070ae <unknown>
#10 0x5596c6ac9ce1 <unknown>
#11 0x5596c6acdb7e <unknown>
#12 0x5596c6ab74b5 <unknown>
#13 0x5596c6ace7d6 <unknown>
#14 0x5596c6a9adbf <unknown>
#15 0x5596c6af1748 <unknown>
#16 0x5596c6af1917 <unknown>
#17 0x5596c6b02773 <unknown>
#18 0x7f930a4a6aa4 <unknown>
#19 0x7f930a533a64 __clone
Stacktrace:
lib/common/ui/pages/web.py:61 in decorated
lib/apps/yclients/client/booking/web/pages/__init__.py:80 in open
lib/common/ui/pages/web.py:61 in decorated
lib/apps/yclients/client/booking/web/pages/__init__.py:41 in set_environment
lib/ui/selenium/webdriver/__init__.py:52 in execute_script
Seen in: - altegio/client.booking#224668 — shard 7 — launch 165208 (×1, last 2026-09-21 08:16 MSK)
WebDriverException — 1 occurrence(s) across 1 pipeline(s)¶
selenium.common.exceptions.WebDriverException: Message: <unknown>: Failed to read the 'localStorage' property from 'Window': Access is denied for this document.
(Session info: headless chrome=119.0.6045.199)
Stacktrace:
#0 0x55860798b5e3 <unknown>
#1 0x55860764e0b7 <unknown>
#2 0x5586076542b5 <unknown>
#3 0x5586076569b1 <unknown>
#4 0x5586076df71f <unknown>
#5 0x5586076c2ef2 <unknown>
#6 0x5586076deb3d <unknown>
#7 0x5586076c2cc3 <unknown>
#8 0x55860768e0e4 <unknown>
#9 0x55860768f0ae <unknown>
#10 0x558607951ce1 <unknown>
#11 0x558607955b7e <unknown>
#12 0x55860793f4b5 <unknown>
#13 0x5586079567d6 <unknown>
#14 0x558607922dbf <unknown>
#15 0x558607979748 <unknown>
#16 0x558607979917 <unknown>
#17 0x55860798a773 <unknown>
#18 0x7f837aab4aa4 <unknown>
#19 0x7f837ab41a64 __clone
Stacktrace:
lib/common/ui/pages/web.py:61 in decorated
lib/apps/yclients/client/booking/web/pages/__init__.py:80 in open
lib/common/ui/pages/web.py:61 in decorated
lib/apps/yclients/client/booking/web/pages/__init__.py:41 in set_environment
lib/ui/selenium/webdriver/__init__.py:52 in execute_script
Seen in: - altegio/client.booking#224668 — shard 7 — launch 165208 (×1, last 2026-09-21 08:16 MSK)