В шапке виджета есть иконка для перехода в¶
Личный кабинет при скрытых шагах услуги и сотрудника
test_mst_scenario_master_and_step_hidden_personal_account_button
Failures in last 30 days: 6
Generated at 2026-10-08 03:53 MSK
Last failure: 2026-10-01 00:53 MSK
Filter: pipelines with sandbox_biz_erp ∈ {master, testops-dev} AND autotests_branch ∈ {master, main} only (testops-dev — daytime ticks since 2026-08-05).
By exception class:
- WebDriverException — 3
- AssertionError — 3
Failure signatures (grouped by exception + full message):
AssertionError — 3 occurrence(s) across 1 pipeline(s)¶
AssertionError: Неверный текущий месяц
Expected: 'october'
but: was 'september'
Stacktrace:
suite/yclients/client/booking/web/online_booking/master_service_time_scenario/test_master_step_hidden.py:111 in test_mst_scenario_master_and_step_hidden_personal_account_button
lib/utils/hamcrest/__init__.py:20 in assert_that
lib/utils/hamcrest/__init__.py:35 in _assert_match
Seen in: - altegio/client.booking#227407 — shard 4 — launch 170831 (×3, last 2026-10-01 00:53 MSK)
WebDriverException — 1 occurrence(s) across 1 pipeline(s)¶
selenium.common.exceptions.WebDriverException: Message: <unknown>: Failed to read the 'localStorage' property from 'Window': Access is denied for this document.
(Session info: headless chrome=119.0.6045.199)
Stacktrace:
#0 0x55d0c11f35e3 <unknown>
#1 0x55d0c0eb60b7 <unknown>
#2 0x55d0c0ebc2b5 <unknown>
#3 0x55d0c0ebe9b1 <unknown>
#4 0x55d0c0f4771f <unknown>
#5 0x55d0c0f2aef2 <unknown>
#6 0x55d0c0f46b3d <unknown>
#7 0x55d0c0f2acc3 <unknown>
#8 0x55d0c0ef60e4 <unknown>
#9 0x55d0c0ef70ae <unknown>
#10 0x55d0c11b9ce1 <unknown>
#11 0x55d0c11bdb7e <unknown>
#12 0x55d0c11a74b5 <unknown>
#13 0x55d0c11be7d6 <unknown>
#14 0x55d0c118adbf <unknown>
#15 0x55d0c11e1748 <unknown>
#16 0x55d0c11e1917 <unknown>
#17 0x55d0c11f2773 <unknown>
#18 0x7f51a965caa4 <unknown>
#19 0x7f51a96e9a64 __clone
Stacktrace:
lib/common/ui/pages/web.py:61 in decorated
lib/apps/yclients/client/booking/web/pages/__init__.py:80 in open
lib/common/ui/pages/web.py:61 in decorated
lib/apps/yclients/client/booking/web/pages/__init__.py:41 in set_environment
lib/ui/selenium/webdriver/__init__.py:52 in execute_script
Seen in: - altegio/client.booking#224668 — shard 1 — launch 165208 (×1, last 2026-09-21 08:16 MSK)
WebDriverException — 1 occurrence(s) across 1 pipeline(s)¶
selenium.common.exceptions.WebDriverException: Message: <unknown>: Failed to read the 'localStorage' property from 'Window': Access is denied for this document.
(Session info: headless chrome=119.0.6045.199)
Stacktrace:
#0 0x55b0130495e3 <unknown>
#1 0x55b012d0c0b7 <unknown>
#2 0x55b012d122b5 <unknown>
#3 0x55b012d149b1 <unknown>
#4 0x55b012d9d71f <unknown>
#5 0x55b012d80ef2 <unknown>
#6 0x55b012d9cb3d <unknown>
#7 0x55b012d80cc3 <unknown>
#8 0x55b012d4c0e4 <unknown>
#9 0x55b012d4d0ae <unknown>
#10 0x55b01300fce1 <unknown>
#11 0x55b013013b7e <unknown>
#12 0x55b012ffd4b5 <unknown>
#13 0x55b0130147d6 <unknown>
#14 0x55b012fe0dbf <unknown>
#15 0x55b013037748 <unknown>
#16 0x55b013037917 <unknown>
#17 0x55b013048773 <unknown>
#18 0x7f88d0df5aa4 <unknown>
#19 0x7f88d0e82a64 __clone
Stacktrace:
lib/common/ui/pages/web.py:61 in decorated
lib/apps/yclients/client/booking/web/pages/__init__.py:80 in open
lib/common/ui/pages/web.py:61 in decorated
lib/apps/yclients/client/booking/web/pages/__init__.py:41 in set_environment
lib/ui/selenium/webdriver/__init__.py:52 in execute_script
Seen in: - altegio/client.booking#224668 — shard 1 — launch 165208 (×1, last 2026-09-21 08:16 MSK)
WebDriverException — 1 occurrence(s) across 1 pipeline(s)¶
selenium.common.exceptions.WebDriverException: Message: <unknown>: Failed to read the 'localStorage' property from 'Window': Access is denied for this document.
(Session info: headless chrome=119.0.6045.199)
Stacktrace:
#0 0x56551f5f25e3 <unknown>
#1 0x56551f2b50b7 <unknown>
#2 0x56551f2bb2b5 <unknown>
#3 0x56551f2bd9b1 <unknown>
#4 0x56551f34671f <unknown>
#5 0x56551f329ef2 <unknown>
#6 0x56551f345b3d <unknown>
#7 0x56551f329cc3 <unknown>
#8 0x56551f2f50e4 <unknown>
#9 0x56551f2f60ae <unknown>
#10 0x56551f5b8ce1 <unknown>
#11 0x56551f5bcb7e <unknown>
#12 0x56551f5a64b5 <unknown>
#13 0x56551f5bd7d6 <unknown>
#14 0x56551f589dbf <unknown>
#15 0x56551f5e0748 <unknown>
#16 0x56551f5e0917 <unknown>
#17 0x56551f5f1773 <unknown>
#18 0x7f5217f03aa4 <unknown>
#19 0x7f5217f90a64 __clone
Stacktrace:
lib/common/ui/pages/web.py:61 in decorated
lib/apps/yclients/client/booking/web/pages/__init__.py:80 in open
lib/common/ui/pages/web.py:61 in decorated
lib/apps/yclients/client/booking/web/pages/__init__.py:41 in set_environment
lib/ui/selenium/webdriver/__init__.py:52 in execute_script
Seen in: - altegio/client.booking#224668 — shard 1 — launch 165208 (×1, last 2026-09-21 08:16 MSK)