Skip to content

Создание записи со страницы успешной записи

со скрытым шагом сотрудника. ("Записаться ещё")

test_mst_scenario_master_step_hidden_book_more

Failures in last 30 days: 15

Generated at 2026-10-08 03:48 MSK

Last failure: 2026-10-02 11:50 MSK

Filter: pipelines with sandbox_biz_erp ∈ {master, testops-dev} AND autotests_branch ∈ {master, main} only (testops-dev — daytime ticks since 2026-08-05).

By exception class: - TimeoutException — 11 - WebDriverException — 3 - AssertionError — 1

Failure signatures (grouped by exception + full message):

AssertionError — 1 occurrence(s) across 1 pipeline(s)

AssertionError: На страницах во время теста обнаружены ошибки в ответах сервера:
------------------------------------------------------------
Страница: https://n10996848--client-booking-testops-dev.infra.altegio.cloud/company/16360725/create-record/record?orderStatus=successed&o=m16334394s29044788d2604102000
Ресурс: POST:/api/v1/book_record/16360725
Статус: 500
Детали: {
    "errors": {
        "code": 500,
        "message": "An error occurred"
    },
    "meta": {
        "exception_message": "OOM command not allowed when used memory > 'maxmemory'. script: c481d49b4a48e48a9eeacd5d51655b5fcbb19925, on @user_script:3.",
        "exception_trace": "#0 /app/vendor/symfony/lock/Store/RedisStore.php(295): Symfony\\Component\\Lock\\Store\\RedisStore->evaluate()\n#1 /app/vendor/symfony/lock/Store/RedisStore.php(225): Symfony\\Component\\Lock\\Store\\RedisStore->getN ... [cropped]

------------------------------------------------------------

Stacktrace:

plugins/allure/selenium/plugin.py:112 in pytest_runtest_teardown

Seen in: - altegio/biz.erp#227722 — shard 6 — launch 171516 (×1, last 2026-10-02 04:26 MSK)

TimeoutException — 1 occurrence(s) across 1 pipeline(s)

selenium.common.exceptions.TimeoutException: Message: Ожидаем элемент в DOM: "[data-locator="timeslot"]", параметры метода ожидания: ([
    "css selector",
    "None",
    "[data-locator=\"timeslot\"]",
    "<autotests.lib.apps.yclients.client.booking.web.pages.select_time.SelectTimePage object at 0x7f0b94177d40>"
]), условия ожидания: ([
    "timeout: 25s"
])
Stacktrace:
#0 0x55cccae3c5e3 <unknown>
#1 0x55cccaaff0b7 <unknown>
#2 0x55cccab4cf53 <unknown>
#3 0x55cccab4d051 <unknown>
#4 0x55cccab929c4 <unknown>
#5 0x55cccab73f1d <unknown>
#6 0x55cccab8fb3d <unknown>
#7 0x55cccab73cc3 <unknown>
#8 0x55cccab3f0e4 <unknown>
#9 0x55cccab400ae <unknown>
#10 0x55cccae02ce1 <unknown>
#11 0x55cccae06b7e <unknown>
#12 0x55cccadf04b5 <unknown>
#13 0x55cccae077d6 <unknown>
#14 0x55cccadd3dbf <unknown>
#15 0x55cccae2a748 <unknown>
#16 0x55cccae2a917 <unknown>
#17 0x55cccae3b773 <unknown>
#18 0x7f15bc857aa4 <unknown>
#19 0x7f15bc8e4a64 __clone
Exception: There are no available spots for this day

Stacktrace:

suite/yclients/client/booking/web/online_booking/master_service_time_scenario/test_create_booking.py:508 in test_mst_scenario_master_step_hidden_book_more
lib/common/ui/pages/web.py:61 in decorated
lib/apps/yclients/client/booking/web/pages/select_time.py:302 in select_date_and_time
lib/common/ui/pages/web.py:61 in decorated
lib/apps/yclients/client/booking/web/pages/select_time.py:351 in select_time

Seen in: - altegio/biz.erp#226015 — shard 6 — launch 168200 (×1, last 2026-09-26 05:38 MSK)

TimeoutException — 1 occurrence(s) across 1 pipeline(s)

selenium.common.exceptions.TimeoutException: Message: Ожидаем элемент в DOM: "[data-locator="timeslot"]", параметры метода ожидания: ([
    "css selector",
    "None",
    "[data-locator=\"timeslot\"]",
    "<autotests.lib.apps.yclients.client.booking.web.pages.select_time.SelectTimePage object at 0x7f5e18371f70>"
]), условия ожидания: ([
    "timeout: 25s"
])
Stacktrace:
#0 0x55cb6d8905e3 <unknown>
#1 0x55cb6d5530b7 <unknown>
#2 0x55cb6d5a0f53 <unknown>
#3 0x55cb6d5a1051 <unknown>
#4 0x55cb6d5e69c4 <unknown>
#5 0x55cb6d5c7f1d <unknown>
#6 0x55cb6d5e3b3d <unknown>
#7 0x55cb6d5c7cc3 <unknown>
#8 0x55cb6d5930e4 <unknown>
#9 0x55cb6d5940ae <unknown>
#10 0x55cb6d856ce1 <unknown>
#11 0x55cb6d85ab7e <unknown>
#12 0x55cb6d8444b5 <unknown>
#13 0x55cb6d85b7d6 <unknown>
#14 0x55cb6d827dbf <unknown>
#15 0x55cb6d87e748 <unknown>
#16 0x55cb6d87e917 <unknown>
#17 0x55cb6d88f773 <unknown>
#18 0x7f01c107faa4 <unknown>
#19 0x7f01c110ca64 __clone
Exception: There are no available spots for this day

Stacktrace:

suite/yclients/client/booking/web/online_booking/master_service_time_scenario/test_create_booking.py:508 in test_mst_scenario_master_step_hidden_book_more
lib/common/ui/pages/web.py:61 in decorated
lib/apps/yclients/client/booking/web/pages/select_time.py:302 in select_date_and_time
lib/common/ui/pages/web.py:61 in decorated
lib/apps/yclients/client/booking/web/pages/select_time.py:351 in select_time

Seen in: - altegio/biz.erp#226200 — shard 4 — launch 168337 (×1, last 2026-09-27 05:38 MSK)

TimeoutException — 1 occurrence(s) across 1 pipeline(s)

selenium.common.exceptions.TimeoutException: Message: Ожидаем элемент в DOM: "[data-locator="book_again_btn"]", параметры метода ожидания: ([
    "css selector",
    "None",
    "[data-locator=\"book_again_btn\"]",
    "<autotests.lib.apps.yclients.client.booking.web.pages.created_booking.CreatedBookingPage object at 0x7f6a9532e840>"
]), условия ожидания: ([
    "timeout: 25s"
])
Stacktrace:
#0 0x55609c0225e3 <unknown>
#1 0x55609bce50b7 <unknown>
#2 0x55609bd32f53 <unknown>
#3 0x55609bd33051 <unknown>
#4 0x55609bd789c4 <unknown>
#5 0x55609bd59f1d <unknown>
#6 0x55609bd75b3d <unknown>
#7 0x55609bd59cc3 <unknown>
#8 0x55609bd250e4 <unknown>
#9 0x55609bd260ae <unknown>
#10 0x55609bfe8ce1 <unknown>
#11 0x55609bfecb7e <unknown>
#12 0x55609bfd64b5 <unknown>
#13 0x55609bfed7d6 <unknown>
#14 0x55609bfb9dbf <unknown>
#15 0x55609c010748 <unknown>
#16 0x55609c010917 <unknown>
#17 0x55609c021773 <unknown>
#18 0x7fd6046c6aa4 <unknown>
#19 0x7fd604753a64 __clone

Stacktrace:

lib/common/ui/pages/web.py:61 in decorated
lib/apps/yclients/client/booking/web/pages/created_booking.py:315 in click_book_more
lib/common/ui/pages/web.py:61 in decorated
lib/common/ui/pages/web.py:148 in wait_for_element
lib/ui/selenium/webdriver/support/wait.py:28 in until

Seen in: - altegio/biz.erp#227722 — shard 6 — launch 171516 (×1, last 2026-10-02 04:26 MSK)

TimeoutException — 1 occurrence(s) across 1 pipeline(s)

selenium.common.exceptions.TimeoutException: Message: Ожидаем элемент в DOM: "[data-locator="book_again_btn"]", параметры метода ожидания: ([
    "css selector",
    "None",
    "[data-locator=\"book_again_btn\"]",
    "<autotests.lib.apps.yclients.client.booking.web.pages.created_booking.CreatedBookingPage object at 0x7f40a37ce6c0>"
]), условия ожидания: ([
    "timeout: 25s"
])
Stacktrace:
#0 0x56168dabd5e3 <unknown>
#1 0x56168d7800b7 <unknown>
#2 0x56168d7cdf53 <unknown>
#3 0x56168d7ce051 <unknown>
#4 0x56168d8139c4 <unknown>
#5 0x56168d7f4f1d <unknown>
#6 0x56168d810b3d <unknown>
#7 0x56168d7f4cc3 <unknown>
#8 0x56168d7c00e4 <unknown>
#9 0x56168d7c10ae <unknown>
#10 0x56168da83ce1 <unknown>
#11 0x56168da87b7e <unknown>
#12 0x56168da714b5 <unknown>
#13 0x56168da887d6 <unknown>
#14 0x56168da54dbf <unknown>
#15 0x56168daab748 <unknown>
#16 0x56168daab917 <unknown>
#17 0x56168dabc773 <unknown>
#18 0x7efd4e9a7aa4 <unknown>
#19 0x7efd4ea34a64 __clone

Stacktrace:

lib/common/ui/pages/web.py:61 in decorated
lib/apps/yclients/client/booking/web/pages/created_booking.py:315 in click_book_more
lib/common/ui/pages/web.py:61 in decorated
lib/common/ui/pages/web.py:148 in wait_for_element
lib/ui/selenium/webdriver/support/wait.py:28 in until

Seen in: - altegio/biz.erp#227722 — shard 6 — launch 171516 (×1, last 2026-10-02 04:26 MSK)

TimeoutException — 1 occurrence(s) across 1 pipeline(s)

selenium.common.exceptions.TimeoutException: Message: Ожидаем элемент в DOM: "[data-locator="timeslot"]", параметры метода ожидания: ([
    "css selector",
    "None",
    "[data-locator=\"timeslot\"]",
    "<autotests.lib.apps.yclients.client.booking.web.pages.select_time.SelectTimePage object at 0x7f39de1da480>"
]), условия ожидания: ([
    "timeout: 25s"
])
Stacktrace:
#0 0x5629392a35e3 <unknown>
#1 0x562938f660b7 <unknown>
#2 0x562938fb3f53 <unknown>
#3 0x562938fb4051 <unknown>
#4 0x562938ff99c4 <unknown>
#5 0x562938fdaf1d <unknown>
#6 0x562938ff6b3d <unknown>
#7 0x562938fdacc3 <unknown>
#8 0x562938fa60e4 <unknown>
#9 0x562938fa70ae <unknown>
#10 0x562939269ce1 <unknown>
#11 0x56293926db7e <unknown>
#12 0x5629392574b5 <unknown>
#13 0x56293926e7d6 <unknown>
#14 0x56293923adbf <unknown>
#15 0x562939291748 <unknown>
#16 0x562939291917 <unknown>
#17 0x5629392a2773 <unknown>
#18 0x7f167a17eaa4 <unknown>
#19 0x7f167a20ba64 __clone
Exception: There are no available spots for this day

Stacktrace:

suite/yclients/client/booking/web/online_booking/master_service_time_scenario/test_create_booking.py:508 in test_mst_scenario_master_step_hidden_book_more
lib/common/ui/pages/web.py:61 in decorated
lib/apps/yclients/client/booking/web/pages/select_time.py:302 in select_date_and_time
lib/common/ui/pages/web.py:61 in decorated
lib/apps/yclients/client/booking/web/pages/select_time.py:351 in select_time

Seen in: - altegio/biz.erp#227735 — shard 6 — launch 171549 (×1, last 2026-10-02 06:23 MSK)

TimeoutException — 1 occurrence(s) across 1 pipeline(s)

selenium.common.exceptions.TimeoutException: Message: Ожидаем элемент в DOM: "[data-locator="timeslot"]", параметры метода ожидания: ([
    "css selector",
    "None",
    "[data-locator=\"timeslot\"]",
    "<autotests.lib.apps.yclients.client.booking.web.pages.select_time.SelectTimePage object at 0x7fcf6a09a9c0>"
]), условия ожидания: ([
    "timeout: 25s"
])
Stacktrace:
#0 0x56284fc8e5e3 <unknown>
#1 0x56284f9510b7 <unknown>
#2 0x56284f99ef53 <unknown>
#3 0x56284f99f051 <unknown>
#4 0x56284f9e49c4 <unknown>
#5 0x56284f9c5f1d <unknown>
#6 0x56284f9e1b3d <unknown>
#7 0x56284f9c5cc3 <unknown>
#8 0x56284f9910e4 <unknown>
#9 0x56284f9920ae <unknown>
#10 0x56284fc54ce1 <unknown>
#11 0x56284fc58b7e <unknown>
#12 0x56284fc424b5 <unknown>
#13 0x56284fc597d6 <unknown>
#14 0x56284fc25dbf <unknown>
#15 0x56284fc7c748 <unknown>
#16 0x56284fc7c917 <unknown>
#17 0x56284fc8d773 <unknown>
#18 0x7f32343e2aa4 <unknown>
#19 0x7f323446fa64 __clone
Exception: There are no available spots for this day

Stacktrace:

suite/yclients/client/booking/web/online_booking/master_service_time_scenario/test_create_booking.py:508 in test_mst_scenario_master_step_hidden_book_more
lib/common/ui/pages/web.py:61 in decorated
lib/apps/yclients/client/booking/web/pages/select_time.py:302 in select_date_and_time
lib/common/ui/pages/web.py:61 in decorated
lib/apps/yclients/client/booking/web/pages/select_time.py:351 in select_time

Seen in: - altegio/biz.erp#227735 — shard 6 — launch 171549 (×1, last 2026-10-02 06:23 MSK)

TimeoutException — 1 occurrence(s) across 1 pipeline(s)

selenium.common.exceptions.TimeoutException: Message: Ожидаем элемент в DOM: "[data-locator="timeslot"]", параметры метода ожидания: ([
    "css selector",
    "None",
    "[data-locator=\"timeslot\"]",
    "<autotests.lib.apps.yclients.client.booking.web.pages.select_time.SelectTimePage object at 0x7f924c2abc20>"
]), условия ожидания: ([
    "timeout: 25s"
])
Stacktrace:
#0 0x55fbc9f925e3 <unknown>
#1 0x55fbc9c550b7 <unknown>
#2 0x55fbc9ca2f53 <unknown>
#3 0x55fbc9ca3051 <unknown>
#4 0x55fbc9ce89c4 <unknown>
#5 0x55fbc9cc9f1d <unknown>
#6 0x55fbc9ce5b3d <unknown>
#7 0x55fbc9cc9cc3 <unknown>
#8 0x55fbc9c950e4 <unknown>
#9 0x55fbc9c960ae <unknown>
#10 0x55fbc9f58ce1 <unknown>
#11 0x55fbc9f5cb7e <unknown>
#12 0x55fbc9f464b5 <unknown>
#13 0x55fbc9f5d7d6 <unknown>
#14 0x55fbc9f29dbf <unknown>
#15 0x55fbc9f80748 <unknown>
#16 0x55fbc9f80917 <unknown>
#17 0x55fbc9f91773 <unknown>
#18 0x7fd7af61caa4 <unknown>
#19 0x7fd7af6a9a64 __clone
Exception: There are no available spots for this day

Stacktrace:

suite/yclients/client/booking/web/online_booking/master_service_time_scenario/test_create_booking.py:508 in test_mst_scenario_master_step_hidden_book_more
lib/common/ui/pages/web.py:61 in decorated
lib/apps/yclients/client/booking/web/pages/select_time.py:302 in select_date_and_time
lib/common/ui/pages/web.py:61 in decorated
lib/apps/yclients/client/booking/web/pages/select_time.py:351 in select_time

Seen in: - altegio/biz.erp#227735 — shard 6 — launch 171549 (×1, last 2026-10-02 06:23 MSK)

TimeoutException — 1 occurrence(s) across 1 pipeline(s)

selenium.common.exceptions.TimeoutException: Message: Ожидаем элемент в DOM: "[data-locator="book_again_btn"]", параметры метода ожидания: ([
    "css selector",
    "None",
    "[data-locator=\"book_again_btn\"]",
    "<autotests.lib.apps.yclients.client.booking.web.pages.created_booking.CreatedBookingPage object at 0x7f44f8ed0290>"
]), условия ожидания: ([
    "timeout: 25s"
])
Stacktrace:
#0 0x55b26f6d05e3 <unknown>
#1 0x55b26f3930b7 <unknown>
#2 0x55b26f3e0f53 <unknown>
#3 0x55b26f3e1051 <unknown>
#4 0x55b26f4269c4 <unknown>
#5 0x55b26f407f1d <unknown>
#6 0x55b26f423b3d <unknown>
#7 0x55b26f407cc3 <unknown>
#8 0x55b26f3d30e4 <unknown>
#9 0x55b26f3d40ae <unknown>
#10 0x55b26f696ce1 <unknown>
#11 0x55b26f69ab7e <unknown>
#12 0x55b26f6844b5 <unknown>
#13 0x55b26f69b7d6 <unknown>
#14 0x55b26f667dbf <unknown>
#15 0x55b26f6be748 <unknown>
#16 0x55b26f6be917 <unknown>
#17 0x55b26f6cf773 <unknown>
#18 0x7f7f57e90aa4 <unknown>
#19 0x7f7f57f1da64 __clone

Stacktrace:

lib/common/ui/pages/web.py:61 in decorated
lib/apps/yclients/client/booking/web/pages/created_booking.py:315 in click_book_more
lib/common/ui/pages/web.py:61 in decorated
lib/common/ui/pages/web.py:148 in wait_for_element
lib/ui/selenium/webdriver/support/wait.py:28 in until

Seen in: - altegio/biz.erp#227749 — shard 7 — launch 171616 (×1, last 2026-10-02 08:20 MSK)

TimeoutException — 1 occurrence(s) across 1 pipeline(s)

selenium.common.exceptions.TimeoutException: Message: Ожидаем элемент в DOM: "[data-locator="book_again_btn"]", параметры метода ожидания: ([
    "css selector",
    "None",
    "[data-locator=\"book_again_btn\"]",
    "<autotests.lib.apps.yclients.client.booking.web.pages.created_booking.CreatedBookingPage object at 0x7f8cd59fb9e0>"
]), условия ожидания: ([
    "timeout: 25s"
])
Stacktrace:
#0 0x55b1b05ec5e3 <unknown>
#1 0x55b1b02af0b7 <unknown>
#2 0x55b1b02fcf53 <unknown>
#3 0x55b1b02fd051 <unknown>
#4 0x55b1b03429c4 <unknown>
#5 0x55b1b0323f1d <unknown>
#6 0x55b1b033fb3d <unknown>
#7 0x55b1b0323cc3 <unknown>
#8 0x55b1b02ef0e4 <unknown>
#9 0x55b1b02f00ae <unknown>
#10 0x55b1b05b2ce1 <unknown>
#11 0x55b1b05b6b7e <unknown>
#12 0x55b1b05a04b5 <unknown>
#13 0x55b1b05b77d6 <unknown>
#14 0x55b1b0583dbf <unknown>
#15 0x55b1b05da748 <unknown>
#16 0x55b1b05da917 <unknown>
#17 0x55b1b05eb773 <unknown>
#18 0x7f38b08c1aa4 <unknown>
#19 0x7f38b094ea64 __clone

Stacktrace:

lib/common/ui/pages/web.py:61 in decorated
lib/apps/yclients/client/booking/web/pages/created_booking.py:315 in click_book_more
lib/common/ui/pages/web.py:61 in decorated
lib/common/ui/pages/web.py:148 in wait_for_element
lib/ui/selenium/webdriver/support/wait.py:28 in until

Seen in: - altegio/biz.erp#227749 — shard 7 — launch 171616 (×1, last 2026-10-02 08:20 MSK)

TimeoutException — 1 occurrence(s) across 1 pipeline(s)

selenium.common.exceptions.TimeoutException: Message: Ожидаем элемент в DOM: "[data-locator="book_again_btn"]", параметры метода ожидания: ([
    "css selector",
    "None",
    "[data-locator=\"book_again_btn\"]",
    "<autotests.lib.apps.yclients.client.booking.web.pages.created_booking.CreatedBookingPage object at 0x7fbc6d038f50>"
]), условия ожидания: ([
    "timeout: 25s"
])
Stacktrace:
#0 0x555d8dbcf5e3 <unknown>
#1 0x555d8d8920b7 <unknown>
#2 0x555d8d8dff53 <unknown>
#3 0x555d8d8e0051 <unknown>
#4 0x555d8d9259c4 <unknown>
#5 0x555d8d906f1d <unknown>
#6 0x555d8d922b3d <unknown>
#7 0x555d8d906cc3 <unknown>
#8 0x555d8d8d20e4 <unknown>
#9 0x555d8d8d30ae <unknown>
#10 0x555d8db95ce1 <unknown>
#11 0x555d8db99b7e <unknown>
#12 0x555d8db834b5 <unknown>
#13 0x555d8db9a7d6 <unknown>
#14 0x555d8db66dbf <unknown>
#15 0x555d8dbbd748 <unknown>
#16 0x555d8dbbd917 <unknown>
#17 0x555d8dbce773 <unknown>
#18 0x7f06703eeaa4 <unknown>
#19 0x7f067047ba64 __clone

Stacktrace:

lib/common/ui/pages/web.py:61 in decorated
lib/apps/yclients/client/booking/web/pages/created_booking.py:315 in click_book_more
lib/common/ui/pages/web.py:61 in decorated
lib/common/ui/pages/web.py:148 in wait_for_element
lib/ui/selenium/webdriver/support/wait.py:28 in until

Seen in: - altegio/biz.erp#227749 — shard 7 — launch 171616 (×1, last 2026-10-02 08:20 MSK)

TimeoutException — 1 occurrence(s) across 1 pipeline(s)

selenium.common.exceptions.TimeoutException: Message: Ожидаем элемент в DOM: "[data-locator="book_again_btn"]", параметры метода ожидания: ([
    "css selector",
    "None",
    "[data-locator=\"book_again_btn\"]",
    "<autotests.lib.apps.yclients.client.booking.web.pages.created_booking.CreatedBookingPage object at 0x7f09c4122bd0>"
]), условия ожидания: ([
    "timeout: 25s"
])
Stacktrace:
#0 0x5588ebc8e5e3 <unknown>
#1 0x5588eb9510b7 <unknown>
#2 0x5588eb99ef53 <unknown>
#3 0x5588eb99f051 <unknown>
#4 0x5588eb9e49c4 <unknown>
#5 0x5588eb9c5f1d <unknown>
#6 0x5588eb9e1b3d <unknown>
#7 0x5588eb9c5cc3 <unknown>
#8 0x5588eb9910e4 <unknown>
#9 0x5588eb9920ae <unknown>
#10 0x5588ebc54ce1 <unknown>
#11 0x5588ebc58b7e <unknown>
#12 0x5588ebc424b5 <unknown>
#13 0x5588ebc597d6 <unknown>
#14 0x5588ebc25dbf <unknown>
#15 0x5588ebc7c748 <unknown>
#16 0x5588ebc7c917 <unknown>
#17 0x5588ebc8d773 <unknown>
#18 0x7f3f506fcaa4 <unknown>
#19 0x7f3f50789a64 __clone

Stacktrace:

lib/common/ui/pages/web.py:61 in decorated
lib/apps/yclients/client/booking/web/pages/created_booking.py:315 in click_book_more
lib/common/ui/pages/web.py:61 in decorated
lib/common/ui/pages/web.py:148 in wait_for_element
lib/ui/selenium/webdriver/support/wait.py:28 in until

Seen in: - altegio/biz.erp#227787 — shard 8 — launch 171752 (×1, last 2026-10-02 11:50 MSK)

WebDriverException — 1 occurrence(s) across 1 pipeline(s)

selenium.common.exceptions.WebDriverException: Message: <unknown>: Failed to read the 'localStorage' property from 'Window': Access is denied for this document.
  (Session info: headless chrome=119.0.6045.199)
Stacktrace:
#0 0x55b4360ba5e3 <unknown>
#1 0x55b435d7d0b7 <unknown>
#2 0x55b435d832b5 <unknown>
#3 0x55b435d859b1 <unknown>
#4 0x55b435e0e71f <unknown>
#5 0x55b435df1ef2 <unknown>
#6 0x55b435e0db3d <unknown>
#7 0x55b435df1cc3 <unknown>
#8 0x55b435dbd0e4 <unknown>
#9 0x55b435dbe0ae <unknown>
#10 0x55b436080ce1 <unknown>
#11 0x55b436084b7e <unknown>
#12 0x55b43606e4b5 <unknown>
#13 0x55b4360857d6 <unknown>
#14 0x55b436051dbf <unknown>
#15 0x55b4360a8748 <unknown>
#16 0x55b4360a8917 <unknown>
#17 0x55b4360b9773 <unknown>
#18 0x7ff8f5231aa4 <unknown>
#19 0x7ff8f52bea64 __clone

Stacktrace:

lib/common/ui/pages/web.py:61 in decorated
lib/apps/yclients/client/booking/web/pages/__init__.py:80 in open
lib/common/ui/pages/web.py:61 in decorated
lib/apps/yclients/client/booking/web/pages/__init__.py:41 in set_environment
lib/ui/selenium/webdriver/__init__.py:52 in execute_script

Seen in: - altegio/client.booking#224668 — shard 1 — launch 165208 (×1, last 2026-09-21 08:16 MSK)

WebDriverException — 1 occurrence(s) across 1 pipeline(s)

selenium.common.exceptions.WebDriverException: Message: <unknown>: Failed to read the 'localStorage' property from 'Window': Access is denied for this document.
  (Session info: headless chrome=119.0.6045.199)
Stacktrace:
#0 0x55b2f53835e3 <unknown>
#1 0x55b2f50460b7 <unknown>
#2 0x55b2f504c2b5 <unknown>
#3 0x55b2f504e9b1 <unknown>
#4 0x55b2f50d771f <unknown>
#5 0x55b2f50baef2 <unknown>
#6 0x55b2f50d6b3d <unknown>
#7 0x55b2f50bacc3 <unknown>
#8 0x55b2f50860e4 <unknown>
#9 0x55b2f50870ae <unknown>
#10 0x55b2f5349ce1 <unknown>
#11 0x55b2f534db7e <unknown>
#12 0x55b2f53374b5 <unknown>
#13 0x55b2f534e7d6 <unknown>
#14 0x55b2f531adbf <unknown>
#15 0x55b2f5371748 <unknown>
#16 0x55b2f5371917 <unknown>
#17 0x55b2f5382773 <unknown>
#18 0x7f9205ff8aa4 <unknown>
#19 0x7f9206085a64 __clone

Stacktrace:

lib/common/ui/pages/web.py:61 in decorated
lib/apps/yclients/client/booking/web/pages/__init__.py:80 in open
lib/common/ui/pages/web.py:61 in decorated
lib/apps/yclients/client/booking/web/pages/__init__.py:41 in set_environment
lib/ui/selenium/webdriver/__init__.py:52 in execute_script

Seen in: - altegio/client.booking#224668 — shard 1 — launch 165208 (×1, last 2026-09-21 08:16 MSK)

WebDriverException — 1 occurrence(s) across 1 pipeline(s)

selenium.common.exceptions.WebDriverException: Message: <unknown>: Failed to read the 'localStorage' property from 'Window': Access is denied for this document.
  (Session info: headless chrome=119.0.6045.199)
Stacktrace:
#0 0x555c3fa965e3 <unknown>
#1 0x555c3f7590b7 <unknown>
#2 0x555c3f75f2b5 <unknown>
#3 0x555c3f7619b1 <unknown>
#4 0x555c3f7ea71f <unknown>
#5 0x555c3f7cdef2 <unknown>
#6 0x555c3f7e9b3d <unknown>
#7 0x555c3f7cdcc3 <unknown>
#8 0x555c3f7990e4 <unknown>
#9 0x555c3f79a0ae <unknown>
#10 0x555c3fa5cce1 <unknown>
#11 0x555c3fa60b7e <unknown>
#12 0x555c3fa4a4b5 <unknown>
#13 0x555c3fa617d6 <unknown>
#14 0x555c3fa2ddbf <unknown>
#15 0x555c3fa84748 <unknown>
#16 0x555c3fa84917 <unknown>
#17 0x555c3fa95773 <unknown>
#18 0x7f890faefaa4 <unknown>
#19 0x7f890fb7ca64 __clone

Stacktrace:

lib/common/ui/pages/web.py:61 in decorated
lib/apps/yclients/client/booking/web/pages/__init__.py:80 in open
lib/common/ui/pages/web.py:61 in decorated
lib/apps/yclients/client/booking/web/pages/__init__.py:41 in set_environment
lib/ui/selenium/webdriver/__init__.py:52 in execute_script

Seen in: - altegio/client.booking#224668 — shard 1 — launch 165208 (×1, last 2026-09-21 08:16 MSK)