Skip to content

Переход назад к выбору услуг со страницы

“Ваши данные”. Шаг выбора сотрудника скрыт

test_mst_scenario_master_step_hidden_go_back_from_booking_details_page

Failures in last 30 days: 3

Generated at 2026-10-08 03:53 MSK

Last failure: 2026-09-21 08:16 MSK

Filter: pipelines with sandbox_biz_erp ∈ {master, testops-dev} AND autotests_branch ∈ {master, main} only (testops-dev — daytime ticks since 2026-08-05).

By exception class: - WebDriverException — 3

Failure signatures (grouped by exception + full message):

WebDriverException — 1 occurrence(s) across 1 pipeline(s)

selenium.common.exceptions.WebDriverException: Message: <unknown>: Failed to read the 'localStorage' property from 'Window': Access is denied for this document.
  (Session info: headless chrome=119.0.6045.199)
Stacktrace:
#0 0x55db5179b5e3 <unknown>
#1 0x55db5145e0b7 <unknown>
#2 0x55db514642b5 <unknown>
#3 0x55db514669b1 <unknown>
#4 0x55db514ef71f <unknown>
#5 0x55db514d2ef2 <unknown>
#6 0x55db514eeb3d <unknown>
#7 0x55db514d2cc3 <unknown>
#8 0x55db5149e0e4 <unknown>
#9 0x55db5149f0ae <unknown>
#10 0x55db51761ce1 <unknown>
#11 0x55db51765b7e <unknown>
#12 0x55db5174f4b5 <unknown>
#13 0x55db517667d6 <unknown>
#14 0x55db51732dbf <unknown>
#15 0x55db51789748 <unknown>
#16 0x55db51789917 <unknown>
#17 0x55db5179a773 <unknown>
#18 0x7fa28338baa4 <unknown>
#19 0x7fa283418a64 __clone

Stacktrace:

lib/common/ui/pages/web.py:61 in decorated
lib/apps/yclients/client/booking/web/pages/__init__.py:80 in open
lib/common/ui/pages/web.py:61 in decorated
lib/apps/yclients/client/booking/web/pages/__init__.py:41 in set_environment
lib/ui/selenium/webdriver/__init__.py:52 in execute_script

Seen in: - altegio/client.booking#224668 — shard 5 — launch 165208 (×1, last 2026-09-21 08:16 MSK)

WebDriverException — 1 occurrence(s) across 1 pipeline(s)

selenium.common.exceptions.WebDriverException: Message: <unknown>: Failed to read the 'localStorage' property from 'Window': Access is denied for this document.
  (Session info: headless chrome=119.0.6045.199)
Stacktrace:
#0 0x5598d6ef05e3 <unknown>
#1 0x5598d6bb30b7 <unknown>
#2 0x5598d6bb92b5 <unknown>
#3 0x5598d6bbb9b1 <unknown>
#4 0x5598d6c4471f <unknown>
#5 0x5598d6c27ef2 <unknown>
#6 0x5598d6c43b3d <unknown>
#7 0x5598d6c27cc3 <unknown>
#8 0x5598d6bf30e4 <unknown>
#9 0x5598d6bf40ae <unknown>
#10 0x5598d6eb6ce1 <unknown>
#11 0x5598d6ebab7e <unknown>
#12 0x5598d6ea44b5 <unknown>
#13 0x5598d6ebb7d6 <unknown>
#14 0x5598d6e87dbf <unknown>
#15 0x5598d6ede748 <unknown>
#16 0x5598d6ede917 <unknown>
#17 0x5598d6eef773 <unknown>
#18 0x7fc9a3646aa4 <unknown>
#19 0x7fc9a36d3a64 __clone

Stacktrace:

lib/common/ui/pages/web.py:61 in decorated
lib/apps/yclients/client/booking/web/pages/__init__.py:80 in open
lib/common/ui/pages/web.py:61 in decorated
lib/apps/yclients/client/booking/web/pages/__init__.py:41 in set_environment
lib/ui/selenium/webdriver/__init__.py:52 in execute_script

Seen in: - altegio/client.booking#224668 — shard 5 — launch 165208 (×1, last 2026-09-21 08:16 MSK)

WebDriverException — 1 occurrence(s) across 1 pipeline(s)

selenium.common.exceptions.WebDriverException: Message: <unknown>: Failed to read the 'localStorage' property from 'Window': Access is denied for this document.
  (Session info: headless chrome=119.0.6045.199)
Stacktrace:
#0 0x560356b635e3 <unknown>
#1 0x5603568260b7 <unknown>
#2 0x56035682c2b5 <unknown>
#3 0x56035682e9b1 <unknown>
#4 0x5603568b771f <unknown>
#5 0x56035689aef2 <unknown>
#6 0x5603568b6b3d <unknown>
#7 0x56035689acc3 <unknown>
#8 0x5603568660e4 <unknown>
#9 0x5603568670ae <unknown>
#10 0x560356b29ce1 <unknown>
#11 0x560356b2db7e <unknown>
#12 0x560356b174b5 <unknown>
#13 0x560356b2e7d6 <unknown>
#14 0x560356afadbf <unknown>
#15 0x560356b51748 <unknown>
#16 0x560356b51917 <unknown>
#17 0x560356b62773 <unknown>
#18 0x7ff5893baaa4 <unknown>
#19 0x7ff589447a64 __clone

Stacktrace:

lib/common/ui/pages/web.py:61 in decorated
lib/apps/yclients/client/booking/web/pages/__init__.py:80 in open
lib/common/ui/pages/web.py:61 in decorated
lib/apps/yclients/client/booking/web/pages/__init__.py:41 in set_environment
lib/ui/selenium/webdriver/__init__.py:52 in execute_script

Seen in: - altegio/client.booking#224668 — shard 5 — launch 165208 (×1, last 2026-09-21 08:16 MSK)