Skip to content

Создание записи со страницы успешной

записи со скрытыми шагами сотрудника и услуги. ("Записаться ещё")

test_mst_scenario_service_and_master_step_hidden_book_more

Failures in last 30 days: 16

Generated at 2026-10-08 03:48 MSK

Last failure: 2026-10-02 11:50 MSK

Filter: pipelines with sandbox_biz_erp ∈ {master, testops-dev} AND autotests_branch ∈ {master, main} only (testops-dev — daytime ticks since 2026-08-05).

By exception class: - TimeoutException — 13 - WebDriverException — 3

Failure signatures (grouped by exception + full message):

TimeoutException — 1 occurrence(s) across 1 pipeline(s)

selenium.common.exceptions.TimeoutException: Message: Ожидаем элемент в DOM: "[data-locator="timeslot"]", параметры метода ожидания: ([
    "css selector",
    "None",
    "[data-locator=\"timeslot\"]",
    "<autotests.lib.apps.yclients.client.booking.web.pages.select_time.SelectTimePage object at 0x7f57672f6e70>"
]), условия ожидания: ([
    "timeout: 25s"
])
Stacktrace:
#0 0x55ec6b7df5e3 <unknown>
#1 0x55ec6b4a20b7 <unknown>
#2 0x55ec6b4eff53 <unknown>
#3 0x55ec6b4f0051 <unknown>
#4 0x55ec6b5359c4 <unknown>
#5 0x55ec6b516f1d <unknown>
#6 0x55ec6b532b3d <unknown>
#7 0x55ec6b516cc3 <unknown>
#8 0x55ec6b4e20e4 <unknown>
#9 0x55ec6b4e30ae <unknown>
#10 0x55ec6b7a5ce1 <unknown>
#11 0x55ec6b7a9b7e <unknown>
#12 0x55ec6b7934b5 <unknown>
#13 0x55ec6b7aa7d6 <unknown>
#14 0x55ec6b776dbf <unknown>
#15 0x55ec6b7cd748 <unknown>
#16 0x55ec6b7cd917 <unknown>
#17 0x55ec6b7de773 <unknown>
#18 0x7fa937e79aa4 <unknown>
#19 0x7fa937f06a64 __clone
Exception: There are no available spots for this day

Stacktrace:

suite/yclients/client/booking/web/online_booking/master_service_time_scenario/test_create_booking.py:357 in test_mst_scenario_service_and_master_step_hidden_book_more
lib/common/ui/pages/web.py:61 in decorated
lib/apps/yclients/client/booking/web/pages/select_time.py:302 in select_date_and_time
lib/common/ui/pages/web.py:61 in decorated
lib/apps/yclients/client/booking/web/pages/select_time.py:351 in select_time

Seen in: - altegio/biz.erp#226002 — shard 8 — launch 168167 (×1, last 2026-09-26 03:40 MSK)

TimeoutException — 1 occurrence(s) across 1 pipeline(s)

selenium.common.exceptions.TimeoutException: Message: Ожидаем элемент в DOM: "[data-locator="timeslot"]", параметры метода ожидания: ([
    "css selector",
    "None",
    "[data-locator=\"timeslot\"]",
    "<autotests.lib.apps.yclients.client.booking.web.pages.select_time.SelectTimePage object at 0x7f1da95c54c0>"
]), условия ожидания: ([
    "timeout: 25s"
])
Stacktrace:
#0 0x55dc2f4b05e3 <unknown>
#1 0x55dc2f1730b7 <unknown>
#2 0x55dc2f1c0f53 <unknown>
#3 0x55dc2f1c1051 <unknown>
#4 0x55dc2f2069c4 <unknown>
#5 0x55dc2f1e7f1d <unknown>
#6 0x55dc2f203b3d <unknown>
#7 0x55dc2f1e7cc3 <unknown>
#8 0x55dc2f1b30e4 <unknown>
#9 0x55dc2f1b40ae <unknown>
#10 0x55dc2f476ce1 <unknown>
#11 0x55dc2f47ab7e <unknown>
#12 0x55dc2f4644b5 <unknown>
#13 0x55dc2f47b7d6 <unknown>
#14 0x55dc2f447dbf <unknown>
#15 0x55dc2f49e748 <unknown>
#16 0x55dc2f49e917 <unknown>
#17 0x55dc2f4af773 <unknown>
#18 0x7fd510ffeaa4 <unknown>
#19 0x7fd51108ba64 __clone
Exception: There are no available spots for this day

Stacktrace:

suite/yclients/client/booking/web/online_booking/master_service_time_scenario/test_create_booking.py:357 in test_mst_scenario_service_and_master_step_hidden_book_more
lib/common/ui/pages/web.py:61 in decorated
lib/apps/yclients/client/booking/web/pages/select_time.py:302 in select_date_and_time
lib/common/ui/pages/web.py:61 in decorated
lib/apps/yclients/client/booking/web/pages/select_time.py:351 in select_time

Seen in: - altegio/biz.erp#226200 — shard 8 — launch 168337 (×1, last 2026-09-27 05:38 MSK)

TimeoutException — 1 occurrence(s) across 1 pipeline(s)

selenium.common.exceptions.TimeoutException: Message: Ожидаем элемент в DOM: "[data-locator="timeslot"]", параметры метода ожидания: ([
    "css selector",
    "None",
    "[data-locator=\"timeslot\"]",
    "<autotests.lib.apps.yclients.client.booking.web.pages.select_time.SelectTimePage object at 0x7f380cfeb710>"
]), условия ожидания: ([
    "timeout: 25s"
])
Stacktrace:
#0 0x561e2af335e3 <unknown>
#1 0x561e2abf60b7 <unknown>
#2 0x561e2ac43f53 <unknown>
#3 0x561e2ac44051 <unknown>
#4 0x561e2ac899c4 <unknown>
#5 0x561e2ac6af1d <unknown>
#6 0x561e2ac86b3d <unknown>
#7 0x561e2ac6acc3 <unknown>
#8 0x561e2ac360e4 <unknown>
#9 0x561e2ac370ae <unknown>
#10 0x561e2aef9ce1 <unknown>
#11 0x561e2aefdb7e <unknown>
#12 0x561e2aee74b5 <unknown>
#13 0x561e2aefe7d6 <unknown>
#14 0x561e2aecadbf <unknown>
#15 0x561e2af21748 <unknown>
#16 0x561e2af21917 <unknown>
#17 0x561e2af32773 <unknown>
#18 0x7fbb5430faa4 <unknown>
#19 0x7fbb5439ca64 __clone
Exception: There are no available spots for this day

Stacktrace:

suite/yclients/client/booking/web/online_booking/master_service_time_scenario/test_create_booking.py:357 in test_mst_scenario_service_and_master_step_hidden_book_more
lib/common/ui/pages/web.py:61 in decorated
lib/apps/yclients/client/booking/web/pages/select_time.py:302 in select_date_and_time
lib/common/ui/pages/web.py:61 in decorated
lib/apps/yclients/client/booking/web/pages/select_time.py:351 in select_time

Seen in: - altegio/biz.erp#226388 — shard 5 — launch 168511 (×1, last 2026-09-28 03:42 MSK)

TimeoutException — 1 occurrence(s) across 1 pipeline(s)

selenium.common.exceptions.TimeoutException: Message: Ожидаем элемент в DOM: "[data-locator="book_again_btn"]", параметры метода ожидания: ([
    "css selector",
    "None",
    "[data-locator=\"book_again_btn\"]",
    "<autotests.lib.apps.yclients.client.booking.web.pages.created_booking.CreatedBookingPage object at 0x7fbbc4ec7f20>"
]), условия ожидания: ([
    "timeout: 25s"
])
Stacktrace:
#0 0x55cbe79e45e3 <unknown>
#1 0x55cbe76a70b7 <unknown>
#2 0x55cbe76f4f53 <unknown>
#3 0x55cbe76f5051 <unknown>
#4 0x55cbe773a9c4 <unknown>
#5 0x55cbe771bf1d <unknown>
#6 0x55cbe7737b3d <unknown>
#7 0x55cbe771bcc3 <unknown>
#8 0x55cbe76e70e4 <unknown>
#9 0x55cbe76e80ae <unknown>
#10 0x55cbe79aace1 <unknown>
#11 0x55cbe79aeb7e <unknown>
#12 0x55cbe79984b5 <unknown>
#13 0x55cbe79af7d6 <unknown>
#14 0x55cbe797bdbf <unknown>
#15 0x55cbe79d2748 <unknown>
#16 0x55cbe79d2917 <unknown>
#17 0x55cbe79e3773 <unknown>
#18 0x7f0fca1f1aa4 <unknown>
#19 0x7f0fca27ea64 __clone

Stacktrace:

lib/common/ui/pages/web.py:61 in decorated
lib/apps/yclients/client/booking/web/pages/created_booking.py:315 in click_book_more
lib/common/ui/pages/web.py:61 in decorated
lib/common/ui/pages/web.py:148 in wait_for_element
lib/ui/selenium/webdriver/support/wait.py:28 in until

Seen in: - altegio/biz.erp#227722 — shard 8 — launch 171516 (×1, last 2026-10-02 04:26 MSK)

TimeoutException — 1 occurrence(s) across 1 pipeline(s)

selenium.common.exceptions.TimeoutException: Message: Ожидаем элемент в DOM: "[data-locator="timeslot"]", параметры метода ожидания: ([
    "css selector",
    "None",
    "[data-locator=\"timeslot\"]",
    "<autotests.lib.apps.yclients.client.booking.web.pages.select_time.SelectTimePage object at 0x7f9b5b703140>"
]), условия ожидания: ([
    "timeout: 25s"
])
Stacktrace:
#0 0x5581d91f95e3 <unknown>
#1 0x5581d8ebc0b7 <unknown>
#2 0x5581d8f09f53 <unknown>
#3 0x5581d8f0a051 <unknown>
#4 0x5581d8f4f9c4 <unknown>
#5 0x5581d8f30f1d <unknown>
#6 0x5581d8f4cb3d <unknown>
#7 0x5581d8f30cc3 <unknown>
#8 0x5581d8efc0e4 <unknown>
#9 0x5581d8efd0ae <unknown>
#10 0x5581d91bfce1 <unknown>
#11 0x5581d91c3b7e <unknown>
#12 0x5581d91ad4b5 <unknown>
#13 0x5581d91c47d6 <unknown>
#14 0x5581d9190dbf <unknown>
#15 0x5581d91e7748 <unknown>
#16 0x5581d91e7917 <unknown>
#17 0x5581d91f8773 <unknown>
#18 0x7f2577469aa4 <unknown>
#19 0x7f25774f6a64 __clone
Exception: There are no available spots for this day

Stacktrace:

suite/yclients/client/booking/web/online_booking/master_service_time_scenario/test_create_booking.py:357 in test_mst_scenario_service_and_master_step_hidden_book_more
lib/common/ui/pages/web.py:61 in decorated
lib/apps/yclients/client/booking/web/pages/select_time.py:302 in select_date_and_time
lib/common/ui/pages/web.py:61 in decorated
lib/apps/yclients/client/booking/web/pages/select_time.py:351 in select_time

Seen in: - altegio/biz.erp#227722 — shard 8 — launch 171516 (×1, last 2026-10-02 04:26 MSK)

TimeoutException — 1 occurrence(s) across 1 pipeline(s)

selenium.common.exceptions.TimeoutException: Message: Ожидаем элемент в DOM: "[data-locator="timeslot"]", параметры метода ожидания: ([
    "css selector",
    "None",
    "[data-locator=\"timeslot\"]",
    "<autotests.lib.apps.yclients.client.booking.web.pages.select_time.SelectTimePage object at 0x7f4eec311520>"
]), условия ожидания: ([
    "timeout: 25s"
])
Stacktrace:
#0 0x557dc22005e3 <unknown>
#1 0x557dc1ec30b7 <unknown>
#2 0x557dc1f10f53 <unknown>
#3 0x557dc1f11051 <unknown>
#4 0x557dc1f569c4 <unknown>
#5 0x557dc1f37f1d <unknown>
#6 0x557dc1f53b3d <unknown>
#7 0x557dc1f37cc3 <unknown>
#8 0x557dc1f030e4 <unknown>
#9 0x557dc1f040ae <unknown>
#10 0x557dc21c6ce1 <unknown>
#11 0x557dc21cab7e <unknown>
#12 0x557dc21b44b5 <unknown>
#13 0x557dc21cb7d6 <unknown>
#14 0x557dc2197dbf <unknown>
#15 0x557dc21ee748 <unknown>
#16 0x557dc21ee917 <unknown>
#17 0x557dc21ff773 <unknown>
#18 0x7fede70ecaa4 <unknown>
#19 0x7fede7179a64 __clone
Exception: There are no available spots for this day

Stacktrace:

suite/yclients/client/booking/web/online_booking/master_service_time_scenario/test_create_booking.py:357 in test_mst_scenario_service_and_master_step_hidden_book_more
lib/common/ui/pages/web.py:61 in decorated
lib/apps/yclients/client/booking/web/pages/select_time.py:302 in select_date_and_time
lib/common/ui/pages/web.py:61 in decorated
lib/apps/yclients/client/booking/web/pages/select_time.py:351 in select_time

Seen in: - altegio/biz.erp#227722 — shard 8 — launch 171516 (×1, last 2026-10-02 04:26 MSK)

TimeoutException — 1 occurrence(s) across 1 pipeline(s)

selenium.common.exceptions.TimeoutException: Message: Ожидаем элемент в DOM: "[data-locator="timeslot"]", параметры метода ожидания: ([
    "css selector",
    "None",
    "[data-locator=\"timeslot\"]",
    "<autotests.lib.apps.yclients.client.booking.web.pages.select_time.SelectTimePage object at 0x7f2ceaa32000>"
]), условия ожидания: ([
    "timeout: 25s"
])
Stacktrace:
#0 0x55d76a4cb5e3 <unknown>
#1 0x55d76a18e0b7 <unknown>
#2 0x55d76a1dbf53 <unknown>
#3 0x55d76a1dc051 <unknown>
#4 0x55d76a2219c4 <unknown>
#5 0x55d76a202f1d <unknown>
#6 0x55d76a21eb3d <unknown>
#7 0x55d76a202cc3 <unknown>
#8 0x55d76a1ce0e4 <unknown>
#9 0x55d76a1cf0ae <unknown>
#10 0x55d76a491ce1 <unknown>
#11 0x55d76a495b7e <unknown>
#12 0x55d76a47f4b5 <unknown>
#13 0x55d76a4967d6 <unknown>
#14 0x55d76a462dbf <unknown>
#15 0x55d76a4b9748 <unknown>
#16 0x55d76a4b9917 <unknown>
#17 0x55d76a4ca773 <unknown>
#18 0x7f66533baaa4 <unknown>
#19 0x7f6653447a64 __clone
Exception: There are no available spots for this day

Stacktrace:

suite/yclients/client/booking/web/online_booking/master_service_time_scenario/test_create_booking.py:357 in test_mst_scenario_service_and_master_step_hidden_book_more
lib/common/ui/pages/web.py:61 in decorated
lib/apps/yclients/client/booking/web/pages/select_time.py:302 in select_date_and_time
lib/common/ui/pages/web.py:61 in decorated
lib/apps/yclients/client/booking/web/pages/select_time.py:351 in select_time

Seen in: - altegio/biz.erp#227735 — shard 6 — launch 171549 (×1, last 2026-10-02 06:23 MSK)

TimeoutException — 1 occurrence(s) across 1 pipeline(s)

selenium.common.exceptions.TimeoutException: Message: Ожидаем элемент в DOM: "[data-locator="timeslot"]", параметры метода ожидания: ([
    "css selector",
    "None",
    "[data-locator=\"timeslot\"]",
    "<autotests.lib.apps.yclients.client.booking.web.pages.select_time.SelectTimePage object at 0x7f672c36dfa0>"
]), условия ожидания: ([
    "timeout: 25s"
])
Stacktrace:
#0 0x5591773925e3 <unknown>
#1 0x5591770550b7 <unknown>
#2 0x5591770a2f53 <unknown>
#3 0x5591770a3051 <unknown>
#4 0x5591770e89c4 <unknown>
#5 0x5591770c9f1d <unknown>
#6 0x5591770e5b3d <unknown>
#7 0x5591770c9cc3 <unknown>
#8 0x5591770950e4 <unknown>
#9 0x5591770960ae <unknown>
#10 0x559177358ce1 <unknown>
#11 0x55917735cb7e <unknown>
#12 0x5591773464b5 <unknown>
#13 0x55917735d7d6 <unknown>
#14 0x559177329dbf <unknown>
#15 0x559177380748 <unknown>
#16 0x559177380917 <unknown>
#17 0x559177391773 <unknown>
#18 0x7f550f2c4aa4 <unknown>
#19 0x7f550f351a64 __clone
Exception: There are no available spots for this day

Stacktrace:

suite/yclients/client/booking/web/online_booking/master_service_time_scenario/test_create_booking.py:357 in test_mst_scenario_service_and_master_step_hidden_book_more
lib/common/ui/pages/web.py:61 in decorated
lib/apps/yclients/client/booking/web/pages/select_time.py:302 in select_date_and_time
lib/common/ui/pages/web.py:61 in decorated
lib/apps/yclients/client/booking/web/pages/select_time.py:351 in select_time

Seen in: - altegio/biz.erp#227735 — shard 6 — launch 171549 (×1, last 2026-10-02 06:23 MSK)

TimeoutException — 1 occurrence(s) across 1 pipeline(s)

selenium.common.exceptions.TimeoutException: Message: Ожидаем элемент в DOM: "[data-locator="book_again_btn"]", параметры метода ожидания: ([
    "css selector",
    "None",
    "[data-locator=\"book_again_btn\"]",
    "<autotests.lib.apps.yclients.client.booking.web.pages.created_booking.CreatedBookingPage object at 0x7fb68097b890>"
]), условия ожидания: ([
    "timeout: 25s"
])
Stacktrace:
#0 0x55fe42c935e3 <unknown>
#1 0x55fe429560b7 <unknown>
#2 0x55fe429a3f53 <unknown>
#3 0x55fe429a4051 <unknown>
#4 0x55fe429e99c4 <unknown>
#5 0x55fe429caf1d <unknown>
#6 0x55fe429e6b3d <unknown>
#7 0x55fe429cacc3 <unknown>
#8 0x55fe429960e4 <unknown>
#9 0x55fe429970ae <unknown>
#10 0x55fe42c59ce1 <unknown>
#11 0x55fe42c5db7e <unknown>
#12 0x55fe42c474b5 <unknown>
#13 0x55fe42c5e7d6 <unknown>
#14 0x55fe42c2adbf <unknown>
#15 0x55fe42c81748 <unknown>
#16 0x55fe42c81917 <unknown>
#17 0x55fe42c92773 <unknown>
#18 0x7f2f2c0e9aa4 <unknown>
#19 0x7f2f2c176a64 __clone

Stacktrace:

lib/common/ui/pages/web.py:61 in decorated
lib/apps/yclients/client/booking/web/pages/created_booking.py:315 in click_book_more
lib/common/ui/pages/web.py:61 in decorated
lib/common/ui/pages/web.py:148 in wait_for_element
lib/ui/selenium/webdriver/support/wait.py:28 in until

Seen in: - altegio/biz.erp#227735 — shard 6 — launch 171549 (×1, last 2026-10-02 06:23 MSK)

TimeoutException — 1 occurrence(s) across 1 pipeline(s)

selenium.common.exceptions.TimeoutException: Message: Ожидаем элемент в DOM: "[data-locator="book_again_btn"]", параметры метода ожидания: ([
    "css selector",
    "None",
    "[data-locator=\"book_again_btn\"]",
    "<autotests.lib.apps.yclients.client.booking.web.pages.created_booking.CreatedBookingPage object at 0x7f71a5ff8260>"
]), условия ожидания: ([
    "timeout: 25s"
])
Stacktrace:
#0 0x55cebf6b25e3 <unknown>
#1 0x55cebf3750b7 <unknown>
#2 0x55cebf3c2f53 <unknown>
#3 0x55cebf3c3051 <unknown>
#4 0x55cebf4089c4 <unknown>
#5 0x55cebf3e9f1d <unknown>
#6 0x55cebf405b3d <unknown>
#7 0x55cebf3e9cc3 <unknown>
#8 0x55cebf3b50e4 <unknown>
#9 0x55cebf3b60ae <unknown>
#10 0x55cebf678ce1 <unknown>
#11 0x55cebf67cb7e <unknown>
#12 0x55cebf6664b5 <unknown>
#13 0x55cebf67d7d6 <unknown>
#14 0x55cebf649dbf <unknown>
#15 0x55cebf6a0748 <unknown>
#16 0x55cebf6a0917 <unknown>
#17 0x55cebf6b1773 <unknown>
#18 0x7fcb7447aaa4 <unknown>
#19 0x7fcb74507a64 __clone

Stacktrace:

lib/common/ui/pages/web.py:61 in decorated
lib/apps/yclients/client/booking/web/pages/created_booking.py:315 in click_book_more
lib/common/ui/pages/web.py:61 in decorated
lib/common/ui/pages/web.py:148 in wait_for_element
lib/ui/selenium/webdriver/support/wait.py:28 in until

Seen in: - altegio/biz.erp#227749 — shard 8 — launch 171616 (×1, last 2026-10-02 08:20 MSK)

TimeoutException — 1 occurrence(s) across 1 pipeline(s)

selenium.common.exceptions.TimeoutException: Message: Ожидаем элемент в DOM: "[data-locator="book_again_btn"]", параметры метода ожидания: ([
    "css selector",
    "None",
    "[data-locator=\"book_again_btn\"]",
    "<autotests.lib.apps.yclients.client.booking.web.pages.created_booking.CreatedBookingPage object at 0x7f2f3d6a2930>"
]), условия ожидания: ([
    "timeout: 25s"
])
Stacktrace:
#0 0x5600dd6225e3 <unknown>
#1 0x5600dd2e50b7 <unknown>
#2 0x5600dd332f53 <unknown>
#3 0x5600dd333051 <unknown>
#4 0x5600dd3789c4 <unknown>
#5 0x5600dd359f1d <unknown>
#6 0x5600dd375b3d <unknown>
#7 0x5600dd359cc3 <unknown>
#8 0x5600dd3250e4 <unknown>
#9 0x5600dd3260ae <unknown>
#10 0x5600dd5e8ce1 <unknown>
#11 0x5600dd5ecb7e <unknown>
#12 0x5600dd5d64b5 <unknown>
#13 0x5600dd5ed7d6 <unknown>
#14 0x5600dd5b9dbf <unknown>
#15 0x5600dd610748 <unknown>
#16 0x5600dd610917 <unknown>
#17 0x5600dd621773 <unknown>
#18 0x7f55b5b92aa4 <unknown>
#19 0x7f55b5c1fa64 __clone

Stacktrace:

lib/common/ui/pages/web.py:61 in decorated
lib/apps/yclients/client/booking/web/pages/created_booking.py:315 in click_book_more
lib/common/ui/pages/web.py:61 in decorated
lib/common/ui/pages/web.py:148 in wait_for_element
lib/ui/selenium/webdriver/support/wait.py:28 in until

Seen in: - altegio/biz.erp#227749 — shard 8 — launch 171616 (×1, last 2026-10-02 08:20 MSK)

TimeoutException — 1 occurrence(s) across 1 pipeline(s)

selenium.common.exceptions.TimeoutException: Message: Ожидаем элемент в DOM: "[data-locator="timeslot"]", параметры метода ожидания: ([
    "css selector",
    "None",
    "[data-locator=\"timeslot\"]",
    "<autotests.lib.apps.yclients.client.booking.web.pages.select_time.SelectTimePage object at 0x7f6c6b60a690>"
]), условия ожидания: ([
    "timeout: 25s"
])
Stacktrace:
#0 0x5593049445e3 <unknown>
#1 0x5593046070b7 <unknown>
#2 0x559304654f53 <unknown>
#3 0x559304655051 <unknown>
#4 0x55930469a9c4 <unknown>
#5 0x55930467bf1d <unknown>
#6 0x559304697b3d <unknown>
#7 0x55930467bcc3 <unknown>
#8 0x5593046470e4 <unknown>
#9 0x5593046480ae <unknown>
#10 0x55930490ace1 <unknown>
#11 0x55930490eb7e <unknown>
#12 0x5593048f84b5 <unknown>
#13 0x55930490f7d6 <unknown>
#14 0x5593048dbdbf <unknown>
#15 0x559304932748 <unknown>
#16 0x559304932917 <unknown>
#17 0x559304943773 <unknown>
#18 0x7f9d953c0aa4 <unknown>
#19 0x7f9d9544da64 __clone
Exception: There are no available spots for this day

Stacktrace:

suite/yclients/client/booking/web/online_booking/master_service_time_scenario/test_create_booking.py:414 in test_mst_scenario_service_and_master_step_hidden_book_more
lib/common/ui/pages/web.py:61 in decorated
lib/apps/yclients/client/booking/web/pages/select_time.py:302 in select_date_and_time
lib/common/ui/pages/web.py:61 in decorated
lib/apps/yclients/client/booking/web/pages/select_time.py:351 in select_time

Seen in: - altegio/biz.erp#227749 — shard 8 — launch 171616 (×1, last 2026-10-02 08:20 MSK)

TimeoutException — 1 occurrence(s) across 1 pipeline(s)

selenium.common.exceptions.TimeoutException: Message: Ожидаем элемент в DOM: "[data-locator="book_again_btn"]", параметры метода ожидания: ([
    "css selector",
    "None",
    "[data-locator=\"book_again_btn\"]",
    "<autotests.lib.apps.yclients.client.booking.web.pages.created_booking.CreatedBookingPage object at 0x7f692c1ebd70>"
]), условия ожидания: ([
    "timeout: 25s"
])
Stacktrace:
#0 0x5603b1dd95e3 <unknown>
#1 0x5603b1a9c0b7 <unknown>
#2 0x5603b1ae9f53 <unknown>
#3 0x5603b1aea051 <unknown>
#4 0x5603b1b2f9c4 <unknown>
#5 0x5603b1b10f1d <unknown>
#6 0x5603b1b2cb3d <unknown>
#7 0x5603b1b10cc3 <unknown>
#8 0x5603b1adc0e4 <unknown>
#9 0x5603b1add0ae <unknown>
#10 0x5603b1d9fce1 <unknown>
#11 0x5603b1da3b7e <unknown>
#12 0x5603b1d8d4b5 <unknown>
#13 0x5603b1da47d6 <unknown>
#14 0x5603b1d70dbf <unknown>
#15 0x5603b1dc7748 <unknown>
#16 0x5603b1dc7917 <unknown>
#17 0x5603b1dd8773 <unknown>
#18 0x7f40a78d6aa4 <unknown>
#19 0x7f40a7963a64 __clone

Stacktrace:

lib/common/ui/pages/web.py:61 in decorated
lib/apps/yclients/client/booking/web/pages/created_booking.py:315 in click_book_more
lib/common/ui/pages/web.py:61 in decorated
lib/common/ui/pages/web.py:148 in wait_for_element
lib/ui/selenium/webdriver/support/wait.py:28 in until

Seen in: - altegio/biz.erp#227787 — shard 6 — launch 171752 (×1, last 2026-10-02 11:50 MSK)

WebDriverException — 1 occurrence(s) across 1 pipeline(s)

selenium.common.exceptions.WebDriverException: Message: <unknown>: Failed to read the 'localStorage' property from 'Window': Access is denied for this document.
  (Session info: headless chrome=119.0.6045.199)
Stacktrace:
#0 0x56513e44e5e3 <unknown>
#1 0x56513e1110b7 <unknown>
#2 0x56513e1172b5 <unknown>
#3 0x56513e1199b1 <unknown>
#4 0x56513e1a271f <unknown>
#5 0x56513e185ef2 <unknown>
#6 0x56513e1a1b3d <unknown>
#7 0x56513e185cc3 <unknown>
#8 0x56513e1510e4 <unknown>
#9 0x56513e1520ae <unknown>
#10 0x56513e414ce1 <unknown>
#11 0x56513e418b7e <unknown>
#12 0x56513e4024b5 <unknown>
#13 0x56513e4197d6 <unknown>
#14 0x56513e3e5dbf <unknown>
#15 0x56513e43c748 <unknown>
#16 0x56513e43c917 <unknown>
#17 0x56513e44d773 <unknown>
#18 0x7f18df04faa4 <unknown>
#19 0x7f18df0dca64 __clone

Stacktrace:

lib/common/ui/pages/web.py:61 in decorated
lib/apps/yclients/client/booking/web/pages/__init__.py:80 in open
lib/common/ui/pages/web.py:61 in decorated
lib/apps/yclients/client/booking/web/pages/__init__.py:41 in set_environment
lib/ui/selenium/webdriver/__init__.py:52 in execute_script

Seen in: - altegio/client.booking#224668 — shard 4 — launch 165208 (×1, last 2026-09-21 08:16 MSK)

WebDriverException — 1 occurrence(s) across 1 pipeline(s)

selenium.common.exceptions.WebDriverException: Message: <unknown>: Failed to read the 'localStorage' property from 'Window': Access is denied for this document.
  (Session info: headless chrome=119.0.6045.199)
Stacktrace:
#0 0x563533b4a5e3 <unknown>
#1 0x56353380d0b7 <unknown>
#2 0x5635338132b5 <unknown>
#3 0x5635338159b1 <unknown>
#4 0x56353389e71f <unknown>
#5 0x563533881ef2 <unknown>
#6 0x56353389db3d <unknown>
#7 0x563533881cc3 <unknown>
#8 0x56353384d0e4 <unknown>
#9 0x56353384e0ae <unknown>
#10 0x563533b10ce1 <unknown>
#11 0x563533b14b7e <unknown>
#12 0x563533afe4b5 <unknown>
#13 0x563533b157d6 <unknown>
#14 0x563533ae1dbf <unknown>
#15 0x563533b38748 <unknown>
#16 0x563533b38917 <unknown>
#17 0x563533b49773 <unknown>
#18 0x7f6a0bed6aa4 <unknown>
#19 0x7f6a0bf63a64 __clone

Stacktrace:

lib/common/ui/pages/web.py:61 in decorated
lib/apps/yclients/client/booking/web/pages/__init__.py:80 in open
lib/common/ui/pages/web.py:61 in decorated
lib/apps/yclients/client/booking/web/pages/__init__.py:41 in set_environment
lib/ui/selenium/webdriver/__init__.py:52 in execute_script

Seen in: - altegio/client.booking#224668 — shard 4 — launch 165208 (×1, last 2026-09-21 08:16 MSK)

WebDriverException — 1 occurrence(s) across 1 pipeline(s)

selenium.common.exceptions.WebDriverException: Message: <unknown>: Failed to read the 'localStorage' property from 'Window': Access is denied for this document.
  (Session info: headless chrome=119.0.6045.199)
Stacktrace:
#0 0x561a1e2d55e3 <unknown>
#1 0x561a1df980b7 <unknown>
#2 0x561a1df9e2b5 <unknown>
#3 0x561a1dfa09b1 <unknown>
#4 0x561a1e02971f <unknown>
#5 0x561a1e00cef2 <unknown>
#6 0x561a1e028b3d <unknown>
#7 0x561a1e00ccc3 <unknown>
#8 0x561a1dfd80e4 <unknown>
#9 0x561a1dfd90ae <unknown>
#10 0x561a1e29bce1 <unknown>
#11 0x561a1e29fb7e <unknown>
#12 0x561a1e2894b5 <unknown>
#13 0x561a1e2a07d6 <unknown>
#14 0x561a1e26cdbf <unknown>
#15 0x561a1e2c3748 <unknown>
#16 0x561a1e2c3917 <unknown>
#17 0x561a1e2d4773 <unknown>
#18 0x7f61dbf85aa4 <unknown>
#19 0x7f61dc012a64 __clone

Stacktrace:

lib/common/ui/pages/web.py:61 in decorated
lib/apps/yclients/client/booking/web/pages/__init__.py:80 in open
lib/common/ui/pages/web.py:61 in decorated
lib/apps/yclients/client/booking/web/pages/__init__.py:41 in set_environment
lib/ui/selenium/webdriver/__init__.py:52 in execute_script

Seen in: - altegio/client.booking#224668 — shard 4 — launch 165208 (×1, last 2026-09-21 08:16 MSK)