Создание записи со страницы успешной записи¶
со скрытым шагом услуги. ("Записаться ещё")
test_mst_scenario_service_step_hidden_book_more
Failures in last 30 days: 13
Generated at 2026-10-08 03:48 MSK
Last failure: 2026-10-02 11:50 MSK
Filter: pipelines with sandbox_biz_erp ∈ {master, testops-dev} AND autotests_branch ∈ {master, main} only (testops-dev — daytime ticks since 2026-08-05).
By exception class:
- TimeoutException — 10
- WebDriverException — 3
Failure signatures (grouped by exception + full message):
TimeoutException — 1 occurrence(s) across 1 pipeline(s)¶
selenium.common.exceptions.TimeoutException: Message: Ожидаем элемент в DOM: "[data-locator="timeslot"]", параметры метода ожидания: ([
"css selector",
"None",
"[data-locator=\"timeslot\"]",
"<autotests.lib.apps.yclients.client.booking.web.pages.select_time.SelectTimePage object at 0x7ff664bae5d0>"
]), условия ожидания: ([
"timeout: 25s"
])
Stacktrace:
#0 0x55a44e94b5e3 <unknown>
#1 0x55a44e60e0b7 <unknown>
#2 0x55a44e65bf53 <unknown>
#3 0x55a44e65c051 <unknown>
#4 0x55a44e6a19c4 <unknown>
#5 0x55a44e682f1d <unknown>
#6 0x55a44e69eb3d <unknown>
#7 0x55a44e682cc3 <unknown>
#8 0x55a44e64e0e4 <unknown>
#9 0x55a44e64f0ae <unknown>
#10 0x55a44e911ce1 <unknown>
#11 0x55a44e915b7e <unknown>
#12 0x55a44e8ff4b5 <unknown>
#13 0x55a44e9167d6 <unknown>
#14 0x55a44e8e2dbf <unknown>
#15 0x55a44e939748 <unknown>
#16 0x55a44e939917 <unknown>
#17 0x55a44e94a773 <unknown>
#18 0x7ff12e2a0aa4 <unknown>
#19 0x7ff12e32da64 __clone
Exception: There are no available spots for this day
Stacktrace:
suite/yclients/client/booking/web/online_booking/master_service_time_scenario/test_create_booking.py:694 in test_mst_scenario_service_step_hidden_book_more
lib/common/ui/pages/web.py:61 in decorated
lib/apps/yclients/client/booking/web/pages/select_time.py:302 in select_date_and_time
lib/common/ui/pages/web.py:61 in decorated
lib/apps/yclients/client/booking/web/pages/select_time.py:351 in select_time
Seen in: - altegio/biz.erp#227722 — shard 3 — launch 171516 (×1, last 2026-10-02 04:26 MSK)
TimeoutException — 1 occurrence(s) across 1 pipeline(s)¶
selenium.common.exceptions.TimeoutException: Message: Ожидаем элемент в DOM: "[data-locator="timeslot"]", параметры метода ожидания: ([
"css selector",
"None",
"[data-locator=\"timeslot\"]",
"<autotests.lib.apps.yclients.client.booking.web.pages.select_time.SelectTimePage object at 0x7f8694367320>"
]), условия ожидания: ([
"timeout: 25s"
])
Stacktrace:
#0 0x55fcbb9f75e3 <unknown>
#1 0x55fcbb6ba0b7 <unknown>
#2 0x55fcbb707f53 <unknown>
#3 0x55fcbb708051 <unknown>
#4 0x55fcbb74d9c4 <unknown>
#5 0x55fcbb72ef1d <unknown>
#6 0x55fcbb74ab3d <unknown>
#7 0x55fcbb72ecc3 <unknown>
#8 0x55fcbb6fa0e4 <unknown>
#9 0x55fcbb6fb0ae <unknown>
#10 0x55fcbb9bdce1 <unknown>
#11 0x55fcbb9c1b7e <unknown>
#12 0x55fcbb9ab4b5 <unknown>
#13 0x55fcbb9c27d6 <unknown>
#14 0x55fcbb98edbf <unknown>
#15 0x55fcbb9e5748 <unknown>
#16 0x55fcbb9e5917 <unknown>
#17 0x55fcbb9f6773 <unknown>
#18 0x7fab6f5b8aa4 <unknown>
#19 0x7fab6f645a64 __clone
Exception: There are no available spots for this day
Stacktrace:
suite/yclients/client/booking/web/online_booking/master_service_time_scenario/test_create_booking.py:694 in test_mst_scenario_service_step_hidden_book_more
lib/common/ui/pages/web.py:61 in decorated
lib/apps/yclients/client/booking/web/pages/select_time.py:302 in select_date_and_time
lib/common/ui/pages/web.py:61 in decorated
lib/apps/yclients/client/booking/web/pages/select_time.py:351 in select_time
Seen in: - altegio/biz.erp#227722 — shard 3 — launch 171516 (×1, last 2026-10-02 04:26 MSK)
TimeoutException — 1 occurrence(s) across 1 pipeline(s)¶
selenium.common.exceptions.TimeoutException: Message: Ожидаем элемент в DOM: "[data-locator="timeslot"]", параметры метода ожидания: ([
"css selector",
"None",
"[data-locator=\"timeslot\"]",
"<autotests.lib.apps.yclients.client.booking.web.pages.select_time.SelectTimePage object at 0x7f4b31096960>"
]), условия ожидания: ([
"timeout: 25s"
])
Stacktrace:
#0 0x559b933d55e3 <unknown>
#1 0x559b930980b7 <unknown>
#2 0x559b930e5f53 <unknown>
#3 0x559b930e6051 <unknown>
#4 0x559b9312b9c4 <unknown>
#5 0x559b9310cf1d <unknown>
#6 0x559b93128b3d <unknown>
#7 0x559b9310ccc3 <unknown>
#8 0x559b930d80e4 <unknown>
#9 0x559b930d90ae <unknown>
#10 0x559b9339bce1 <unknown>
#11 0x559b9339fb7e <unknown>
#12 0x559b933894b5 <unknown>
#13 0x559b933a07d6 <unknown>
#14 0x559b9336cdbf <unknown>
#15 0x559b933c3748 <unknown>
#16 0x559b933c3917 <unknown>
#17 0x559b933d4773 <unknown>
#18 0x7fb88d491aa4 <unknown>
#19 0x7fb88d51ea64 __clone
Exception: There are no available spots for this day
Stacktrace:
suite/yclients/client/booking/web/online_booking/master_service_time_scenario/test_create_booking.py:694 in test_mst_scenario_service_step_hidden_book_more
lib/common/ui/pages/web.py:61 in decorated
lib/apps/yclients/client/booking/web/pages/select_time.py:302 in select_date_and_time
lib/common/ui/pages/web.py:61 in decorated
lib/apps/yclients/client/booking/web/pages/select_time.py:351 in select_time
Seen in: - altegio/biz.erp#227722 — shard 3 — launch 171516 (×1, last 2026-10-02 04:26 MSK)
TimeoutException — 1 occurrence(s) across 1 pipeline(s)¶
selenium.common.exceptions.TimeoutException: Message: Ожидаем элемент в DOM: "[data-locator="book_again_btn"]", параметры метода ожидания: ([
"css selector",
"None",
"[data-locator=\"book_again_btn\"]",
"<autotests.lib.apps.yclients.client.booking.web.pages.created_booking.CreatedBookingPage object at 0x7fba6afce3c0>"
]), условия ожидания: ([
"timeout: 25s"
])
Stacktrace:
#0 0x55fe11efa5e3 <unknown>
#1 0x55fe11bbd0b7 <unknown>
#2 0x55fe11c0af53 <unknown>
#3 0x55fe11c0b051 <unknown>
#4 0x55fe11c509c4 <unknown>
#5 0x55fe11c31f1d <unknown>
#6 0x55fe11c4db3d <unknown>
#7 0x55fe11c31cc3 <unknown>
#8 0x55fe11bfd0e4 <unknown>
#9 0x55fe11bfe0ae <unknown>
#10 0x55fe11ec0ce1 <unknown>
#11 0x55fe11ec4b7e <unknown>
#12 0x55fe11eae4b5 <unknown>
#13 0x55fe11ec57d6 <unknown>
#14 0x55fe11e91dbf <unknown>
#15 0x55fe11ee8748 <unknown>
#16 0x55fe11ee8917 <unknown>
#17 0x55fe11ef9773 <unknown>
#18 0x7f0f92e33aa4 <unknown>
#19 0x7f0f92ec0a64 __clone
Stacktrace:
lib/common/ui/pages/web.py:61 in decorated
lib/apps/yclients/client/booking/web/pages/created_booking.py:315 in click_book_more
lib/common/ui/pages/web.py:61 in decorated
lib/common/ui/pages/web.py:148 in wait_for_element
lib/ui/selenium/webdriver/support/wait.py:28 in until
Seen in: - altegio/biz.erp#227735 — shard 1 — launch 171549 (×1, last 2026-10-02 06:23 MSK)
TimeoutException — 1 occurrence(s) across 1 pipeline(s)¶
selenium.common.exceptions.TimeoutException: Message: Ожидаем элемент в DOM: "[data-locator="timeslot"]", параметры метода ожидания: ([
"css selector",
"None",
"[data-locator=\"timeslot\"]",
"<autotests.lib.apps.yclients.client.booking.web.pages.select_time.SelectTimePage object at 0x7fb52ef56270>"
]), условия ожидания: ([
"timeout: 25s"
])
Stacktrace:
#0 0x56242d6ae5e3 <unknown>
#1 0x56242d3710b7 <unknown>
#2 0x56242d3bef53 <unknown>
#3 0x56242d3bf051 <unknown>
#4 0x56242d4049c4 <unknown>
#5 0x56242d3e5f1d <unknown>
#6 0x56242d401b3d <unknown>
#7 0x56242d3e5cc3 <unknown>
#8 0x56242d3b10e4 <unknown>
#9 0x56242d3b20ae <unknown>
#10 0x56242d674ce1 <unknown>
#11 0x56242d678b7e <unknown>
#12 0x56242d6624b5 <unknown>
#13 0x56242d6797d6 <unknown>
#14 0x56242d645dbf <unknown>
#15 0x56242d69c748 <unknown>
#16 0x56242d69c917 <unknown>
#17 0x56242d6ad773 <unknown>
#18 0x7f69760d3aa4 <unknown>
#19 0x7f6976160a64 __clone
Exception: There are no available spots for this day
Stacktrace:
suite/yclients/client/booking/web/online_booking/master_service_time_scenario/test_create_booking.py:694 in test_mst_scenario_service_step_hidden_book_more
lib/common/ui/pages/web.py:61 in decorated
lib/apps/yclients/client/booking/web/pages/select_time.py:302 in select_date_and_time
lib/common/ui/pages/web.py:61 in decorated
lib/apps/yclients/client/booking/web/pages/select_time.py:351 in select_time
Seen in: - altegio/biz.erp#227735 — shard 1 — launch 171549 (×1, last 2026-10-02 06:23 MSK)
TimeoutException — 1 occurrence(s) across 1 pipeline(s)¶
selenium.common.exceptions.TimeoutException: Message: Ожидаем элемент в DOM: "[data-locator="book_again_btn"]", параметры метода ожидания: ([
"css selector",
"None",
"[data-locator=\"book_again_btn\"]",
"<autotests.lib.apps.yclients.client.booking.web.pages.created_booking.CreatedBookingPage object at 0x7f03312f4b60>"
]), условия ожидания: ([
"timeout: 25s"
])
Stacktrace:
#0 0x5651524975e3 <unknown>
#1 0x56515215a0b7 <unknown>
#2 0x5651521a7f53 <unknown>
#3 0x5651521a8051 <unknown>
#4 0x5651521ed9c4 <unknown>
#5 0x5651521cef1d <unknown>
#6 0x5651521eab3d <unknown>
#7 0x5651521cecc3 <unknown>
#8 0x56515219a0e4 <unknown>
#9 0x56515219b0ae <unknown>
#10 0x56515245dce1 <unknown>
#11 0x565152461b7e <unknown>
#12 0x56515244b4b5 <unknown>
#13 0x5651524627d6 <unknown>
#14 0x56515242edbf <unknown>
#15 0x565152485748 <unknown>
#16 0x565152485917 <unknown>
#17 0x565152496773 <unknown>
#18 0x7fba394b1aa4 <unknown>
#19 0x7fba3953ea64 __clone
Stacktrace:
lib/common/ui/pages/web.py:61 in decorated
lib/apps/yclients/client/booking/web/pages/created_booking.py:315 in click_book_more
lib/common/ui/pages/web.py:61 in decorated
lib/common/ui/pages/web.py:148 in wait_for_element
lib/ui/selenium/webdriver/support/wait.py:28 in until
Seen in: - altegio/biz.erp#227735 — shard 1 — launch 171549 (×1, last 2026-10-02 06:23 MSK)
TimeoutException — 1 occurrence(s) across 1 pipeline(s)¶
selenium.common.exceptions.TimeoutException: Message: Ожидаем элемент в DOM: "[data-locator="book_again_btn"]", параметры метода ожидания: ([
"css selector",
"None",
"[data-locator=\"book_again_btn\"]",
"<autotests.lib.apps.yclients.client.booking.web.pages.created_booking.CreatedBookingPage object at 0x7f750030bd40>"
]), условия ожидания: ([
"timeout: 25s"
])
Stacktrace:
#0 0x55fb97b195e3 <unknown>
#1 0x55fb977dc0b7 <unknown>
#2 0x55fb97829f53 <unknown>
#3 0x55fb9782a051 <unknown>
#4 0x55fb9786f9c4 <unknown>
#5 0x55fb97850f1d <unknown>
#6 0x55fb9786cb3d <unknown>
#7 0x55fb97850cc3 <unknown>
#8 0x55fb9781c0e4 <unknown>
#9 0x55fb9781d0ae <unknown>
#10 0x55fb97adfce1 <unknown>
#11 0x55fb97ae3b7e <unknown>
#12 0x55fb97acd4b5 <unknown>
#13 0x55fb97ae47d6 <unknown>
#14 0x55fb97ab0dbf <unknown>
#15 0x55fb97b07748 <unknown>
#16 0x55fb97b07917 <unknown>
#17 0x55fb97b18773 <unknown>
#18 0x7f3365942aa4 <unknown>
#19 0x7f33659cfa64 __clone
Stacktrace:
lib/common/ui/pages/web.py:61 in decorated
lib/apps/yclients/client/booking/web/pages/created_booking.py:315 in click_book_more
lib/common/ui/pages/web.py:61 in decorated
lib/common/ui/pages/web.py:148 in wait_for_element
lib/ui/selenium/webdriver/support/wait.py:28 in until
Seen in: - altegio/biz.erp#227749 — shard 1 — launch 171616 (×1, last 2026-10-02 08:20 MSK)
TimeoutException — 1 occurrence(s) across 1 pipeline(s)¶
selenium.common.exceptions.TimeoutException: Message: Ожидаем элемент в DOM: "[data-locator="book_again_btn"]", параметры метода ожидания: ([
"css selector",
"None",
"[data-locator=\"book_again_btn\"]",
"<autotests.lib.apps.yclients.client.booking.web.pages.created_booking.CreatedBookingPage object at 0x7febdc137fb0>"
]), условия ожидания: ([
"timeout: 25s"
])
Stacktrace:
#0 0x56458f9935e3 <unknown>
#1 0x56458f6560b7 <unknown>
#2 0x56458f6a3f53 <unknown>
#3 0x56458f6a4051 <unknown>
#4 0x56458f6e99c4 <unknown>
#5 0x56458f6caf1d <unknown>
#6 0x56458f6e6b3d <unknown>
#7 0x56458f6cacc3 <unknown>
#8 0x56458f6960e4 <unknown>
#9 0x56458f6970ae <unknown>
#10 0x56458f959ce1 <unknown>
#11 0x56458f95db7e <unknown>
#12 0x56458f9474b5 <unknown>
#13 0x56458f95e7d6 <unknown>
#14 0x56458f92adbf <unknown>
#15 0x56458f981748 <unknown>
#16 0x56458f981917 <unknown>
#17 0x56458f992773 <unknown>
#18 0x7f433e6e9aa4 <unknown>
#19 0x7f433e776a64 __clone
Stacktrace:
lib/common/ui/pages/web.py:61 in decorated
lib/apps/yclients/client/booking/web/pages/created_booking.py:315 in click_book_more
lib/common/ui/pages/web.py:61 in decorated
lib/common/ui/pages/web.py:148 in wait_for_element
lib/ui/selenium/webdriver/support/wait.py:28 in until
Seen in: - altegio/biz.erp#227749 — shard 1 — launch 171616 (×1, last 2026-10-02 08:20 MSK)
TimeoutException — 1 occurrence(s) across 1 pipeline(s)¶
selenium.common.exceptions.TimeoutException: Message: Ожидаем элемент в DOM: "[data-locator="book_again_btn"]", параметры метода ожидания: ([
"css selector",
"None",
"[data-locator=\"book_again_btn\"]",
"<autotests.lib.apps.yclients.client.booking.web.pages.created_booking.CreatedBookingPage object at 0x7f463c8d03e0>"
]), условия ожидания: ([
"timeout: 25s"
])
Stacktrace:
#0 0x55b95076e5e3 <unknown>
#1 0x55b9504310b7 <unknown>
#2 0x55b95047ef53 <unknown>
#3 0x55b95047f051 <unknown>
#4 0x55b9504c49c4 <unknown>
#5 0x55b9504a5f1d <unknown>
#6 0x55b9504c1b3d <unknown>
#7 0x55b9504a5cc3 <unknown>
#8 0x55b9504710e4 <unknown>
#9 0x55b9504720ae <unknown>
#10 0x55b950734ce1 <unknown>
#11 0x55b950738b7e <unknown>
#12 0x55b9507224b5 <unknown>
#13 0x55b9507397d6 <unknown>
#14 0x55b950705dbf <unknown>
#15 0x55b95075c748 <unknown>
#16 0x55b95075c917 <unknown>
#17 0x55b95076d773 <unknown>
#18 0x7f4545ae9aa4 <unknown>
#19 0x7f4545b76a64 __clone
Stacktrace:
lib/common/ui/pages/web.py:61 in decorated
lib/apps/yclients/client/booking/web/pages/created_booking.py:315 in click_book_more
lib/common/ui/pages/web.py:61 in decorated
lib/common/ui/pages/web.py:148 in wait_for_element
lib/ui/selenium/webdriver/support/wait.py:28 in until
Seen in: - altegio/biz.erp#227749 — shard 1 — launch 171616 (×1, last 2026-10-02 08:20 MSK)
TimeoutException — 1 occurrence(s) across 1 pipeline(s)¶
selenium.common.exceptions.TimeoutException: Message: Ожидаем элемент в DOM: "[data-locator="book_again_btn"]", параметры метода ожидания: ([
"css selector",
"None",
"[data-locator=\"book_again_btn\"]",
"<autotests.lib.apps.yclients.client.booking.web.pages.created_booking.CreatedBookingPage object at 0x7fc65cf46540>"
]), условия ожидания: ([
"timeout: 25s"
])
Stacktrace:
#0 0x55ddbbe6c5e3 <unknown>
#1 0x55ddbbb2f0b7 <unknown>
#2 0x55ddbbb7cf53 <unknown>
#3 0x55ddbbb7d051 <unknown>
#4 0x55ddbbbc29c4 <unknown>
#5 0x55ddbbba3f1d <unknown>
#6 0x55ddbbbbfb3d <unknown>
#7 0x55ddbbba3cc3 <unknown>
#8 0x55ddbbb6f0e4 <unknown>
#9 0x55ddbbb700ae <unknown>
#10 0x55ddbbe32ce1 <unknown>
#11 0x55ddbbe36b7e <unknown>
#12 0x55ddbbe204b5 <unknown>
#13 0x55ddbbe377d6 <unknown>
#14 0x55ddbbe03dbf <unknown>
#15 0x55ddbbe5a748 <unknown>
#16 0x55ddbbe5a917 <unknown>
#17 0x55ddbbe6b773 <unknown>
#18 0x7fc27940faa4 <unknown>
#19 0x7fc27949ca64 __clone
Stacktrace:
lib/common/ui/pages/web.py:61 in decorated
lib/apps/yclients/client/booking/web/pages/created_booking.py:315 in click_book_more
lib/common/ui/pages/web.py:61 in decorated
lib/common/ui/pages/web.py:148 in wait_for_element
lib/ui/selenium/webdriver/support/wait.py:28 in until
Seen in: - altegio/biz.erp#227787 — shard 8 — launch 171752 (×1, last 2026-10-02 11:50 MSK)
WebDriverException — 1 occurrence(s) across 1 pipeline(s)¶
selenium.common.exceptions.WebDriverException: Message: <unknown>: Failed to read the 'localStorage' property from 'Window': Access is denied for this document.
(Session info: headless chrome=119.0.6045.199)
Stacktrace:
#0 0x55873e0855e3 <unknown>
#1 0x55873dd480b7 <unknown>
#2 0x55873dd4e2b5 <unknown>
#3 0x55873dd509b1 <unknown>
#4 0x55873ddd971f <unknown>
#5 0x55873ddbcef2 <unknown>
#6 0x55873ddd8b3d <unknown>
#7 0x55873ddbccc3 <unknown>
#8 0x55873dd880e4 <unknown>
#9 0x55873dd890ae <unknown>
#10 0x55873e04bce1 <unknown>
#11 0x55873e04fb7e <unknown>
#12 0x55873e0394b5 <unknown>
#13 0x55873e0507d6 <unknown>
#14 0x55873e01cdbf <unknown>
#15 0x55873e073748 <unknown>
#16 0x55873e073917 <unknown>
#17 0x55873e084773 <unknown>
#18 0x7f0b12c58aa4 <unknown>
#19 0x7f0b12ce5a64 __clone
Stacktrace:
lib/common/ui/pages/web.py:61 in decorated
lib/apps/yclients/client/booking/web/pages/__init__.py:80 in open
lib/common/ui/pages/web.py:61 in decorated
lib/apps/yclients/client/booking/web/pages/__init__.py:41 in set_environment
lib/ui/selenium/webdriver/__init__.py:52 in execute_script
Seen in: - altegio/client.booking#224668 — shard 8 — launch 165208 (×1, last 2026-09-21 08:16 MSK)
WebDriverException — 1 occurrence(s) across 1 pipeline(s)¶
selenium.common.exceptions.WebDriverException: Message: <unknown>: Failed to read the 'localStorage' property from 'Window': Access is denied for this document.
(Session info: headless chrome=119.0.6045.199)
Stacktrace:
#0 0x55ccaea725e3 <unknown>
#1 0x55ccae7350b7 <unknown>
#2 0x55ccae73b2b5 <unknown>
#3 0x55ccae73d9b1 <unknown>
#4 0x55ccae7c671f <unknown>
#5 0x55ccae7a9ef2 <unknown>
#6 0x55ccae7c5b3d <unknown>
#7 0x55ccae7a9cc3 <unknown>
#8 0x55ccae7750e4 <unknown>
#9 0x55ccae7760ae <unknown>
#10 0x55ccaea38ce1 <unknown>
#11 0x55ccaea3cb7e <unknown>
#12 0x55ccaea264b5 <unknown>
#13 0x55ccaea3d7d6 <unknown>
#14 0x55ccaea09dbf <unknown>
#15 0x55ccaea60748 <unknown>
#16 0x55ccaea60917 <unknown>
#17 0x55ccaea71773 <unknown>
#18 0x7f71b4841aa4 <unknown>
#19 0x7f71b48cea64 __clone
Stacktrace:
lib/common/ui/pages/web.py:61 in decorated
lib/apps/yclients/client/booking/web/pages/__init__.py:80 in open
lib/common/ui/pages/web.py:61 in decorated
lib/apps/yclients/client/booking/web/pages/__init__.py:41 in set_environment
lib/ui/selenium/webdriver/__init__.py:52 in execute_script
Seen in: - altegio/client.booking#224668 — shard 8 — launch 165208 (×1, last 2026-09-21 08:16 MSK)
WebDriverException — 1 occurrence(s) across 1 pipeline(s)¶
selenium.common.exceptions.WebDriverException: Message: <unknown>: Failed to read the 'localStorage' property from 'Window': Access is denied for this document.
(Session info: headless chrome=119.0.6045.199)
Stacktrace:
#0 0x5618753385e3 <unknown>
#1 0x561874ffb0b7 <unknown>
#2 0x5618750012b5 <unknown>
#3 0x5618750039b1 <unknown>
#4 0x56187508c71f <unknown>
#5 0x56187506fef2 <unknown>
#6 0x56187508bb3d <unknown>
#7 0x56187506fcc3 <unknown>
#8 0x56187503b0e4 <unknown>
#9 0x56187503c0ae <unknown>
#10 0x5618752fece1 <unknown>
#11 0x561875302b7e <unknown>
#12 0x5618752ec4b5 <unknown>
#13 0x5618753037d6 <unknown>
#14 0x5618752cfdbf <unknown>
#15 0x561875326748 <unknown>
#16 0x561875326917 <unknown>
#17 0x561875337773 <unknown>
#18 0x7fe708f93aa4 <unknown>
#19 0x7fe709020a64 __clone
Stacktrace:
lib/common/ui/pages/web.py:61 in decorated
lib/apps/yclients/client/booking/web/pages/__init__.py:80 in open
lib/common/ui/pages/web.py:61 in decorated
lib/apps/yclients/client/booking/web/pages/__init__.py:41 in set_environment
lib/ui/selenium/webdriver/__init__.py:52 in execute_script
Seen in: - altegio/client.booking#224668 — shard 8 — launch 165208 (×1, last 2026-09-21 08:16 MSK)