Список записей. Карточка прошедшей записи. Кнопка назад при повторе записи.¶
test_my_bookings_repeat_booking_back_btn
Failures in last 30 days: 6
Generated at 2026-10-08 03:48 MSK
Last failure: 2026-10-01 00:53 MSK
Filter: pipelines with sandbox_biz_erp ∈ {master, testops-dev} AND autotests_branch ∈ {master, main} only (testops-dev — daytime ticks since 2026-08-05).
By exception class:
- WebDriverException — 3
- TimeoutException — 3
Failure signatures (grouped by exception + full message):
TimeoutException — 1 occurrence(s) across 1 pipeline(s)¶
selenium.common.exceptions.TimeoutException: Message: Ожидаем элемент в DOM: "[data-locator="repeat_booking_btn"]", параметры метода ожидания: ([
"css selector",
"None",
"[data-locator=\"repeat_booking_btn\"]",
"BookingCard (service_title='Услуга #1, service_price=79,641 R$, booking_date_time='(datetime.datetime(1900, 9, 30, 19, 0), datetime.datetime(1900, 9, 30, 20, 0)), master_specialization=специалист, master_name='Сотрудник #1'services_count_text='' "
]), условия ожидания: ([
"timeout: 25s"
])
Stacktrace:
#0 0x55baa37105e3 <unknown>
#1 0x55baa33d30b7 <unknown>
#2 0x55baa3420f53 <unknown>
#3 0x55baa3421051 <unknown>
#4 0x55baa3414b36 <unknown>
#5 0x55baa3447f1d <unknown>
#6 0x55baa3414a02 <unknown>
#7 0x55baa34480be <unknown>
#8 0x55baa3463b3d <unknown>
#9 0x55baa3447cc3 <unknown>
#10 0x55baa34130e4 <unknown>
#11 0x55baa34140ae <unknown>
#12 0x55baa36d6ce1 <unknown>
#13 0x55baa36dab7e <unknown>
#14 0x55baa36c44b5 <unknown>
#15 0x55baa36db7d6 <unknown>
#16 0x55baa36a7dbf <unknown>
#17 0x55baa36fe748 <unknown>
#18 0x55baa36fe917 <unknown>
#19 0x55baa370f773 <unknown>
#20 0x7efca2c61aa4 <unknown>
#21 0x7efca2ceea64 __clone
Stacktrace:
lib/common/ui/pages/web.py:61 in decorated
lib/apps/yclients/client/booking/web/pages/components/booking_card.py:192 in click_repeat_button
lib/common/ui/pages/web.py:61 in decorated
lib/common/ui/pages/web.py:148 in wait_for_element
lib/ui/selenium/webdriver/support/wait.py:28 in until
Seen in: - altegio/client.booking#227407 — shard 3 — launch 170831 (×1, last 2026-10-01 00:53 MSK)
TimeoutException — 1 occurrence(s) across 1 pipeline(s)¶
selenium.common.exceptions.TimeoutException: Message: Ожидаем элемент в DOM: "[data-locator="repeat_booking_btn"]", параметры метода ожидания: ([
"css selector",
"None",
"[data-locator=\"repeat_booking_btn\"]",
"BookingCard (service_title='Услуга #1, service_price=74,378 R$, booking_date_time='(datetime.datetime(1900, 9, 30, 19, 30), datetime.datetime(1900, 9, 30, 20, 30)), master_specialization=специалист, master_name='Сотрудник #1'services_count_text='' "
]), условия ожидания: ([
"timeout: 25s"
])
Stacktrace:
#0 0x5646919c85e3 <unknown>
#1 0x56469168b0b7 <unknown>
#2 0x5646916d8f53 <unknown>
#3 0x5646916d9051 <unknown>
#4 0x5646916ccb36 <unknown>
#5 0x5646916fff1d <unknown>
#6 0x5646916cca02 <unknown>
#7 0x5646917000be <unknown>
#8 0x56469171bb3d <unknown>
#9 0x5646916ffcc3 <unknown>
#10 0x5646916cb0e4 <unknown>
#11 0x5646916cc0ae <unknown>
#12 0x56469198ece1 <unknown>
#13 0x564691992b7e <unknown>
#14 0x56469197c4b5 <unknown>
#15 0x5646919937d6 <unknown>
#16 0x56469195fdbf <unknown>
#17 0x5646919b6748 <unknown>
#18 0x5646919b6917 <unknown>
#19 0x5646919c7773 <unknown>
#20 0x7f0ce5a30aa4 <unknown>
#21 0x7f0ce5abda64 __clone
Stacktrace:
lib/common/ui/pages/web.py:61 in decorated
lib/apps/yclients/client/booking/web/pages/components/booking_card.py:192 in click_repeat_button
lib/common/ui/pages/web.py:61 in decorated
lib/common/ui/pages/web.py:148 in wait_for_element
lib/ui/selenium/webdriver/support/wait.py:28 in until
Seen in: - altegio/client.booking#227407 — shard 3 — launch 170831 (×1, last 2026-10-01 00:53 MSK)
TimeoutException — 1 occurrence(s) across 1 pipeline(s)¶
selenium.common.exceptions.TimeoutException: Message: Ожидаем элемент в DOM: "[data-locator="repeat_booking_btn"]", параметры метода ожидания: ([
"css selector",
"None",
"[data-locator=\"repeat_booking_btn\"]",
"BookingCard (service_title='Услуга #1, service_price=88,933 R$, booking_date_time='(datetime.datetime(1900, 9, 30, 19, 30), datetime.datetime(1900, 9, 30, 20, 30)), master_specialization=специалист, master_name='Сотрудник #1'services_count_text='' "
]), условия ожидания: ([
"timeout: 25s"
])
Stacktrace:
#0 0x56364bc775e3 <unknown>
#1 0x56364b93a0b7 <unknown>
#2 0x56364b987f53 <unknown>
#3 0x56364b988051 <unknown>
#4 0x56364b97bb36 <unknown>
#5 0x56364b9aef1d <unknown>
#6 0x56364b97ba02 <unknown>
#7 0x56364b9af0be <unknown>
#8 0x56364b9cab3d <unknown>
#9 0x56364b9aecc3 <unknown>
#10 0x56364b97a0e4 <unknown>
#11 0x56364b97b0ae <unknown>
#12 0x56364bc3dce1 <unknown>
#13 0x56364bc41b7e <unknown>
#14 0x56364bc2b4b5 <unknown>
#15 0x56364bc427d6 <unknown>
#16 0x56364bc0edbf <unknown>
#17 0x56364bc65748 <unknown>
#18 0x56364bc65917 <unknown>
#19 0x56364bc76773 <unknown>
#20 0x7f661a699aa4 <unknown>
#21 0x7f661a726a64 __clone
Stacktrace:
lib/common/ui/pages/web.py:61 in decorated
lib/apps/yclients/client/booking/web/pages/components/booking_card.py:192 in click_repeat_button
lib/common/ui/pages/web.py:61 in decorated
lib/common/ui/pages/web.py:148 in wait_for_element
lib/ui/selenium/webdriver/support/wait.py:28 in until
Seen in: - altegio/client.booking#227407 — shard 3 — launch 170831 (×1, last 2026-10-01 00:53 MSK)
WebDriverException — 1 occurrence(s) across 1 pipeline(s)¶
selenium.common.exceptions.WebDriverException: Message: <unknown>: Failed to read the 'localStorage' property from 'Window': Access is denied for this document.
(Session info: headless chrome=119.0.6045.199)
Stacktrace:
#0 0x55cbb92d95e3 <unknown>
#1 0x55cbb8f9c0b7 <unknown>
#2 0x55cbb8fa22b5 <unknown>
#3 0x55cbb8fa49b1 <unknown>
#4 0x55cbb902d71f <unknown>
#5 0x55cbb9010ef2 <unknown>
#6 0x55cbb902cb3d <unknown>
#7 0x55cbb9010cc3 <unknown>
#8 0x55cbb8fdc0e4 <unknown>
#9 0x55cbb8fdd0ae <unknown>
#10 0x55cbb929fce1 <unknown>
#11 0x55cbb92a3b7e <unknown>
#12 0x55cbb928d4b5 <unknown>
#13 0x55cbb92a47d6 <unknown>
#14 0x55cbb9270dbf <unknown>
#15 0x55cbb92c7748 <unknown>
#16 0x55cbb92c7917 <unknown>
#17 0x55cbb92d8773 <unknown>
#18 0x7fa1f2a3baa4 <unknown>
#19 0x7fa1f2ac8a64 __clone
Stacktrace:
lib/common/ui/pages/web.py:61 in decorated
lib/apps/yclients/client/booking/web/pages/__init__.py:80 in open
lib/common/ui/pages/web.py:61 in decorated
lib/apps/yclients/client/booking/web/pages/__init__.py:41 in set_environment
lib/ui/selenium/webdriver/__init__.py:52 in execute_script
Seen in: - altegio/client.booking#224668 — shard 6 — launch 165208 (×1, last 2026-09-21 08:16 MSK)
WebDriverException — 1 occurrence(s) across 1 pipeline(s)¶
selenium.common.exceptions.WebDriverException: Message: <unknown>: Failed to read the 'localStorage' property from 'Window': Access is denied for this document.
(Session info: headless chrome=119.0.6045.199)
Stacktrace:
#0 0x5573dc1815e3 <unknown>
#1 0x5573dbe440b7 <unknown>
#2 0x5573dbe4a2b5 <unknown>
#3 0x5573dbe4c9b1 <unknown>
#4 0x5573dbed571f <unknown>
#5 0x5573dbeb8ef2 <unknown>
#6 0x5573dbed4b3d <unknown>
#7 0x5573dbeb8cc3 <unknown>
#8 0x5573dbe840e4 <unknown>
#9 0x5573dbe850ae <unknown>
#10 0x5573dc147ce1 <unknown>
#11 0x5573dc14bb7e <unknown>
#12 0x5573dc1354b5 <unknown>
#13 0x5573dc14c7d6 <unknown>
#14 0x5573dc118dbf <unknown>
#15 0x5573dc16f748 <unknown>
#16 0x5573dc16f917 <unknown>
#17 0x5573dc180773 <unknown>
#18 0x7f8be4b12aa4 <unknown>
#19 0x7f8be4b9fa64 __clone
Stacktrace:
lib/common/ui/pages/web.py:61 in decorated
lib/apps/yclients/client/booking/web/pages/__init__.py:80 in open
lib/common/ui/pages/web.py:61 in decorated
lib/apps/yclients/client/booking/web/pages/__init__.py:41 in set_environment
lib/ui/selenium/webdriver/__init__.py:52 in execute_script
Seen in: - altegio/client.booking#224668 — shard 6 — launch 165208 (×1, last 2026-09-21 08:16 MSK)
WebDriverException — 1 occurrence(s) across 1 pipeline(s)¶
selenium.common.exceptions.WebDriverException: Message: <unknown>: Failed to read the 'localStorage' property from 'Window': Access is denied for this document.
(Session info: headless chrome=119.0.6045.199)
Stacktrace:
#0 0x562e45b9b5e3 <unknown>
#1 0x562e4585e0b7 <unknown>
#2 0x562e458642b5 <unknown>
#3 0x562e458669b1 <unknown>
#4 0x562e458ef71f <unknown>
#5 0x562e458d2ef2 <unknown>
#6 0x562e458eeb3d <unknown>
#7 0x562e458d2cc3 <unknown>
#8 0x562e4589e0e4 <unknown>
#9 0x562e4589f0ae <unknown>
#10 0x562e45b61ce1 <unknown>
#11 0x562e45b65b7e <unknown>
#12 0x562e45b4f4b5 <unknown>
#13 0x562e45b667d6 <unknown>
#14 0x562e45b32dbf <unknown>
#15 0x562e45b89748 <unknown>
#16 0x562e45b89917 <unknown>
#17 0x562e45b9a773 <unknown>
#18 0x7f2a01f6aaa4 <unknown>
#19 0x7f2a01ff7a64 __clone
Stacktrace:
lib/common/ui/pages/web.py:61 in decorated
lib/apps/yclients/client/booking/web/pages/__init__.py:80 in open
lib/common/ui/pages/web.py:61 in decorated
lib/apps/yclients/client/booking/web/pages/__init__.py:41 in set_environment
lib/ui/selenium/webdriver/__init__.py:52 in execute_script
Seen in: - altegio/client.booking#224668 — shard 6 — launch 165208 (×1, last 2026-09-21 08:16 MSK)