#59845 Приглашённый по email пользователь регистрируется и создаёт новую компанию¶
test_onboarding_invited_email_create_company
Failures in last 30 days: 12
Generated at 2026-10-08 03:53 MSK
Last failure: 2026-10-07 11:19 MSK
Filter: pipelines with sandbox_biz_erp ∈ {master, testops-dev} AND autotests_branch ∈ {master, main} only (testops-dev — daytime ticks since 2026-08-05).
By exception class:
- TimeoutError — 9
- AssertionError — 2
- KeyError — 1
Failure signatures (grouped by exception + full message):
AssertionError — 2 occurrence(s) across 2 pipeline(s)¶
AssertionError: Locator expected to be visible
Actual value: None
Error: element(s) not found
Call log:
- Expect "to_be_visible" with timeout 30000ms
- waiting for locator("[data-locator$=\"autocomplete_drop-menu_item_15\"] a").first
Stacktrace:
lib/apps_pw/yclients/biz/erp/web/pages/__init__.py:77 in decorated
lib/apps_pw/yclients/biz/erp/web/pages/guest/signup_v2.py:459 in fill_and_submit
lib/apps_pw/yclients/biz/erp/web/pages/__init__.py:77 in decorated
lib/apps_pw/yclients/biz/erp/web/pages/guest/signup_v2.py:426 in set_biz_type
lib/apps_pw/yclients/biz/erp/web/pages/guest/signup_v2.py:751 in _pick_autocomplete_v2_item
Seen in: - altegio/biz.erp#229148 — shard 2 — launch 173909 (×1, last 2026-10-07 11:19 MSK) - altegio/biz.erp#226388 — shard 7 — launch 168511 (×1, last 2026-09-28 03:42 MSK)
KeyError — 1 occurrence(s) across 1 pipeline(s)¶
KeyError: 'salon_with_entities'
Seen in: - altegio/biz.erp#227787 — shard 7 — launch 171752 (×1, last 2026-10-02 11:50 MSK)
TimeoutError — 1 occurrence(s) across 1 pipeline(s)¶
playwright._impl._errors.TimeoutError: Timeout 30000ms exceeded.
=========================== logs ===========================
waiting for navigation to "<function ImplToApiMapping.wrap_handler.<locals>.wrapper_func at 0x7fa615e67240>" until 'domcontentloaded'
navigated to "https://erp-testops-dev.infra.altegio.cloud/onboarding/fifth/49559"
navigated to "https://erp-testops-dev.infra.altegio.cloud/onboarding/fifth/49559"
navigated to "https://erp-testops-dev.infra.altegio.cloud/signin/JTJGb25ib2FyZGluZyUyRmNvbXBsZXRlJTJGNDk1NTk="
navigated to "https://erp-testops-dev.infra.altegio.cloud/signin/JTJGb25ib2FyZGluZyUyRmNvbXBsZXRlJTJGNDk1NTk="
navigated to "https://erp-testops-dev.infra.altegio.cloud/signin/JTJGb25ib2FyZGluZyUyRmNvbXBsZXRlJTJGNDk1NTk="
============================================================
Stacktrace:
suite/yclients/biz/erp/web/filial/test_onboarding_invited_email_create_company_pw.py:115 in test_onboarding_invited_email_create_company
lib/apps_pw/yclients/biz/erp/web/pages/__init__.py:77 in decorated
lib/apps_pw/yclients/biz/erp/web/pages/guest/signup_v2.py:322 in walk_create_company
lib/apps_pw/yclients/biz/erp/web/pages/__init__.py:77 in decorated
lib/apps_pw/yclients/biz/erp/web/pages/guest/signup_v2.py:608 in fill_and_submit
Seen in: - altegio/biz.erp#227722 — shard 6 — launch 171516 (×1, last 2026-10-02 04:26 MSK)
TimeoutError — 1 occurrence(s) across 1 pipeline(s)¶
playwright._impl._errors.TimeoutError: Timeout 30000ms exceeded.
=========================== logs ===========================
waiting for navigation to "<function ImplToApiMapping.wrap_handler.<locals>.wrapper_func at 0x7f17c0403ba0>" until 'domcontentloaded'
navigated to "https://erp-testops-dev.infra.altegio.cloud/onboarding/fifth/49568"
navigated to "https://erp-testops-dev.infra.altegio.cloud/onboarding/fifth/49568"
navigated to "https://erp-testops-dev.infra.altegio.cloud/signin/JTJGb25ib2FyZGluZyUyRmNvbXBsZXRlJTJGNDk1Njg="
navigated to "https://erp-testops-dev.infra.altegio.cloud/signin/JTJGb25ib2FyZGluZyUyRmNvbXBsZXRlJTJGNDk1Njg="
navigated to "https://erp-testops-dev.infra.altegio.cloud/signin/JTJGb25ib2FyZGluZyUyRmNvbXBsZXRlJTJGNDk1Njg="
============================================================
Stacktrace:
suite/yclients/biz/erp/web/filial/test_onboarding_invited_email_create_company_pw.py:115 in test_onboarding_invited_email_create_company
lib/apps_pw/yclients/biz/erp/web/pages/__init__.py:77 in decorated
lib/apps_pw/yclients/biz/erp/web/pages/guest/signup_v2.py:322 in walk_create_company
lib/apps_pw/yclients/biz/erp/web/pages/__init__.py:77 in decorated
lib/apps_pw/yclients/biz/erp/web/pages/guest/signup_v2.py:608 in fill_and_submit
Seen in: - altegio/biz.erp#227722 — shard 6 — launch 171516 (×1, last 2026-10-02 04:26 MSK)
TimeoutError — 1 occurrence(s) across 1 pipeline(s)¶
playwright._impl._errors.TimeoutError: Timeout 30000ms exceeded.
=========================== logs ===========================
waiting for navigation to "<function ImplToApiMapping.wrap_handler.<locals>.wrapper_func at 0x7fea9c130e00>" until 'domcontentloaded'
navigated to "https://erp-testops-dev.infra.altegio.cloud/onboarding/fifth/49576"
navigated to "https://erp-testops-dev.infra.altegio.cloud/onboarding/fifth/49576"
navigated to "https://erp-testops-dev.infra.altegio.cloud/signin/JTJGb25ib2FyZGluZyUyRmNvbXBsZXRlJTJGNDk1NzY="
navigated to "https://erp-testops-dev.infra.altegio.cloud/signin/JTJGb25ib2FyZGluZyUyRmNvbXBsZXRlJTJGNDk1NzY="
navigated to "https://erp-testops-dev.infra.altegio.cloud/signin/JTJGb25ib2FyZGluZyUyRmNvbXBsZXRlJTJGNDk1NzY="
============================================================
Stacktrace:
suite/yclients/biz/erp/web/filial/test_onboarding_invited_email_create_company_pw.py:115 in test_onboarding_invited_email_create_company
lib/apps_pw/yclients/biz/erp/web/pages/__init__.py:77 in decorated
lib/apps_pw/yclients/biz/erp/web/pages/guest/signup_v2.py:322 in walk_create_company
lib/apps_pw/yclients/biz/erp/web/pages/__init__.py:77 in decorated
lib/apps_pw/yclients/biz/erp/web/pages/guest/signup_v2.py:608 in fill_and_submit
Seen in: - altegio/biz.erp#227722 — shard 6 — launch 171516 (×1, last 2026-10-02 04:26 MSK)
TimeoutError — 1 occurrence(s) across 1 pipeline(s)¶
playwright._impl._errors.TimeoutError: Timeout 30000ms exceeded.
=========================== logs ===========================
waiting for navigation to "<function ImplToApiMapping.wrap_handler.<locals>.wrapper_func at 0x7fd5d8dc2d40>" until 'domcontentloaded'
navigated to "https://erp-testops-dev.infra.altegio.cloud/onboarding/fifth/49580"
navigated to "https://erp-testops-dev.infra.altegio.cloud/onboarding/fifth/49580"
navigated to "https://erp-testops-dev.infra.altegio.cloud/signin/JTJGb25ib2FyZGluZyUyRmNvbXBsZXRlJTJGNDk1ODA="
navigated to "https://erp-testops-dev.infra.altegio.cloud/signin/JTJGb25ib2FyZGluZyUyRmNvbXBsZXRlJTJGNDk1ODA="
navigated to "https://erp-testops-dev.infra.altegio.cloud/signin/JTJGb25ib2FyZGluZyUyRmNvbXBsZXRlJTJGNDk1ODA="
============================================================
Stacktrace:
suite/yclients/biz/erp/web/filial/test_onboarding_invited_email_create_company_pw.py:115 in test_onboarding_invited_email_create_company
lib/apps_pw/yclients/biz/erp/web/pages/__init__.py:77 in decorated
lib/apps_pw/yclients/biz/erp/web/pages/guest/signup_v2.py:322 in walk_create_company
lib/apps_pw/yclients/biz/erp/web/pages/__init__.py:77 in decorated
lib/apps_pw/yclients/biz/erp/web/pages/guest/signup_v2.py:608 in fill_and_submit
Seen in: - altegio/biz.erp#227735 — shard 1 — launch 171549 (×1, last 2026-10-02 06:23 MSK)
TimeoutError — 1 occurrence(s) across 1 pipeline(s)¶
playwright._impl._errors.TimeoutError: Timeout 30000ms exceeded.
=========================== logs ===========================
waiting for navigation to "<function ImplToApiMapping.wrap_handler.<locals>.wrapper_func at 0x7fc23df09620>" until 'domcontentloaded'
navigated to "https://erp-testops-dev.infra.altegio.cloud/onboarding/fifth/49591"
navigated to "https://erp-testops-dev.infra.altegio.cloud/onboarding/fifth/49591"
navigated to "https://erp-testops-dev.infra.altegio.cloud/signin/JTJGb25ib2FyZGluZyUyRmNvbXBsZXRlJTJGNDk1OTE="
navigated to "https://erp-testops-dev.infra.altegio.cloud/signin/JTJGb25ib2FyZGluZyUyRmNvbXBsZXRlJTJGNDk1OTE="
navigated to "https://erp-testops-dev.infra.altegio.cloud/signin/JTJGb25ib2FyZGluZyUyRmNvbXBsZXRlJTJGNDk1OTE="
============================================================
Stacktrace:
suite/yclients/biz/erp/web/filial/test_onboarding_invited_email_create_company_pw.py:115 in test_onboarding_invited_email_create_company
lib/apps_pw/yclients/biz/erp/web/pages/__init__.py:77 in decorated
lib/apps_pw/yclients/biz/erp/web/pages/guest/signup_v2.py:322 in walk_create_company
lib/apps_pw/yclients/biz/erp/web/pages/__init__.py:77 in decorated
lib/apps_pw/yclients/biz/erp/web/pages/guest/signup_v2.py:608 in fill_and_submit
Seen in: - altegio/biz.erp#227735 — shard 1 — launch 171549 (×1, last 2026-10-02 06:23 MSK)
TimeoutError — 1 occurrence(s) across 1 pipeline(s)¶
playwright._impl._errors.TimeoutError: Timeout 30000ms exceeded.
=========================== logs ===========================
waiting for navigation to "<function ImplToApiMapping.wrap_handler.<locals>.wrapper_func at 0x7f33546420c0>" until 'domcontentloaded'
navigated to "https://erp-testops-dev.infra.altegio.cloud/onboarding/fifth/49599"
navigated to "https://erp-testops-dev.infra.altegio.cloud/onboarding/fifth/49599"
navigated to "https://erp-testops-dev.infra.altegio.cloud/signin/JTJGb25ib2FyZGluZyUyRmNvbXBsZXRlJTJGNDk1OTk="
navigated to "https://erp-testops-dev.infra.altegio.cloud/signin/JTJGb25ib2FyZGluZyUyRmNvbXBsZXRlJTJGNDk1OTk="
navigated to "https://erp-testops-dev.infra.altegio.cloud/signin/JTJGb25ib2FyZGluZyUyRmNvbXBsZXRlJTJGNDk1OTk="
============================================================
Stacktrace:
suite/yclients/biz/erp/web/filial/test_onboarding_invited_email_create_company_pw.py:115 in test_onboarding_invited_email_create_company
lib/apps_pw/yclients/biz/erp/web/pages/__init__.py:77 in decorated
lib/apps_pw/yclients/biz/erp/web/pages/guest/signup_v2.py:322 in walk_create_company
lib/apps_pw/yclients/biz/erp/web/pages/__init__.py:77 in decorated
lib/apps_pw/yclients/biz/erp/web/pages/guest/signup_v2.py:608 in fill_and_submit
Seen in: - altegio/biz.erp#227735 — shard 1 — launch 171549 (×1, last 2026-10-02 06:23 MSK)
TimeoutError — 1 occurrence(s) across 1 pipeline(s)¶
playwright._impl._errors.TimeoutError: Timeout 30000ms exceeded.
=========================== logs ===========================
waiting for navigation to "<function ImplToApiMapping.wrap_handler.<locals>.wrapper_func at 0x7f82ce9128e0>" until 'domcontentloaded'
navigated to "https://erp-testops-dev.infra.altegio.cloud/onboarding/fifth/49608"
navigated to "https://erp-testops-dev.infra.altegio.cloud/onboarding/fifth/49608"
navigated to "https://erp-testops-dev.infra.altegio.cloud/signin/JTJGb25ib2FyZGluZyUyRmNvbXBsZXRlJTJGNDk2MDg="
navigated to "https://erp-testops-dev.infra.altegio.cloud/signin/JTJGb25ib2FyZGluZyUyRmNvbXBsZXRlJTJGNDk2MDg="
navigated to "https://erp-testops-dev.infra.altegio.cloud/signin/JTJGb25ib2FyZGluZyUyRmNvbXBsZXRlJTJGNDk2MDg="
============================================================
Stacktrace:
suite/yclients/biz/erp/web/filial/test_onboarding_invited_email_create_company_pw.py:115 in test_onboarding_invited_email_create_company
lib/apps_pw/yclients/biz/erp/web/pages/__init__.py:77 in decorated
lib/apps_pw/yclients/biz/erp/web/pages/guest/signup_v2.py:322 in walk_create_company
lib/apps_pw/yclients/biz/erp/web/pages/__init__.py:77 in decorated
lib/apps_pw/yclients/biz/erp/web/pages/guest/signup_v2.py:608 in fill_and_submit
Seen in: - altegio/biz.erp#227749 — shard 5 — launch 171616 (×1, last 2026-10-02 08:20 MSK)
TimeoutError — 1 occurrence(s) across 1 pipeline(s)¶
playwright._impl._errors.TimeoutError: Timeout 30000ms exceeded.
=========================== logs ===========================
waiting for navigation to "<function ImplToApiMapping.wrap_handler.<locals>.wrapper_func at 0x7f0fb452dbc0>" until 'domcontentloaded'
navigated to "https://erp-testops-dev.infra.altegio.cloud/onboarding/fifth/49620"
navigated to "https://erp-testops-dev.infra.altegio.cloud/onboarding/fifth/49620"
navigated to "https://erp-testops-dev.infra.altegio.cloud/signin/JTJGb25ib2FyZGluZyUyRmNvbXBsZXRlJTJGNDk2MjA="
navigated to "https://erp-testops-dev.infra.altegio.cloud/signin/JTJGb25ib2FyZGluZyUyRmNvbXBsZXRlJTJGNDk2MjA="
navigated to "https://erp-testops-dev.infra.altegio.cloud/signin/JTJGb25ib2FyZGluZyUyRmNvbXBsZXRlJTJGNDk2MjA="
============================================================
Stacktrace:
suite/yclients/biz/erp/web/filial/test_onboarding_invited_email_create_company_pw.py:115 in test_onboarding_invited_email_create_company
lib/apps_pw/yclients/biz/erp/web/pages/__init__.py:77 in decorated
lib/apps_pw/yclients/biz/erp/web/pages/guest/signup_v2.py:322 in walk_create_company
lib/apps_pw/yclients/biz/erp/web/pages/__init__.py:77 in decorated
lib/apps_pw/yclients/biz/erp/web/pages/guest/signup_v2.py:608 in fill_and_submit
Seen in: - altegio/biz.erp#227749 — shard 5 — launch 171616 (×1, last 2026-10-02 08:20 MSK)
TimeoutError — 1 occurrence(s) across 1 pipeline(s)¶
playwright._impl._errors.TimeoutError: Timeout 30000ms exceeded.
=========================== logs ===========================
waiting for navigation to "<function ImplToApiMapping.wrap_handler.<locals>.wrapper_func at 0x7fb327639da0>" until 'domcontentloaded'
navigated to "https://erp-testops-dev.infra.altegio.cloud/onboarding/fifth/49627"
navigated to "https://erp-testops-dev.infra.altegio.cloud/onboarding/fifth/49627"
navigated to "https://erp-testops-dev.infra.altegio.cloud/signin/JTJGb25ib2FyZGluZyUyRmNvbXBsZXRlJTJGNDk2Mjc="
navigated to "https://erp-testops-dev.infra.altegio.cloud/signin/JTJGb25ib2FyZGluZyUyRmNvbXBsZXRlJTJGNDk2Mjc="
navigated to "https://erp-testops-dev.infra.altegio.cloud/signin/JTJGb25ib2FyZGluZyUyRmNvbXBsZXRlJTJGNDk2Mjc="
============================================================
Stacktrace:
suite/yclients/biz/erp/web/filial/test_onboarding_invited_email_create_company_pw.py:115 in test_onboarding_invited_email_create_company
lib/apps_pw/yclients/biz/erp/web/pages/__init__.py:77 in decorated
lib/apps_pw/yclients/biz/erp/web/pages/guest/signup_v2.py:322 in walk_create_company
lib/apps_pw/yclients/biz/erp/web/pages/__init__.py:77 in decorated
lib/apps_pw/yclients/biz/erp/web/pages/guest/signup_v2.py:608 in fill_and_submit
Seen in: - altegio/biz.erp#227749 — shard 5 — launch 171616 (×1, last 2026-10-02 08:20 MSK)