#19215 Удаление графика посещений у клиента в событии. Запись в прошедшем событии остается¶
test_past_records_remain_after_client_schedule_deletion
Failures in last 30 days: 18
Generated at 2026-10-08 03:53 MSK
Last failure: 2026-10-05 17:28 MSK
Filter: pipelines with sandbox_biz_erp ∈ {master, testops-dev} AND autotests_branch ∈ {master, main} only (testops-dev — daytime ticks since 2026-08-05).
🏥 3 of these ran under the quarantine tier: XFAIL, pipeline stayed green, excluded from the red statistics and incidents (see Карантин).
By exception class:
- AssertionError — 9
- TimeoutError — 5
- SigninRedirectMissingError — 4
Failure signatures (grouped by exception + full message):
AssertionError — 1 occurrence(s) across 1 pipeline(s)¶
AssertionError: Locator expected to have count '0'
Actual value: 1
Call log:
- Expect "to_have_count" with timeout 60000ms
- waiting for locator("[id=\"erp-activity-modal\"]").locator("[data-locator=\"record_20328866_item\"]")
63 × locator resolved to 1 element
- unexpected value "1"
Stacktrace:
suite/yclients/biz/erp/web/activities/test_activity_schedule_pw.py:2073 in test_past_records_remain_after_client_schedule_deletion
lib/apps_pw/yclients/biz/erp/web/pages/__init__.py:76 in decorated
lib/apps_pw/yclients/biz/erp/web/pages/popup/tabs/timetable/activities.py:1894 in delete_client_schedule
Seen in: - altegio/biz.erp#222665 — shard 1 — launch 160382 (×1, last 2026-09-10 03:42 MSK)
AssertionError — 1 occurrence(s) across 1 pipeline(s)¶
AssertionError: Locator expected to have count '0'
Actual value: 1
Call log:
- Expect "to_have_count" with timeout 60000ms
- waiting for locator("[id=\"erp-activity-modal\"]").locator("[data-locator=\"record_20254364_item\"]")
63 × locator resolved to 1 element
- unexpected value "1"
Stacktrace:
suite/yclients/biz/erp/web/activities/test_activity_schedule_pw.py:2073 in test_past_records_remain_after_client_schedule_deletion
lib/apps_pw/yclients/biz/erp/web/pages/__init__.py:76 in decorated
lib/apps_pw/yclients/biz/erp/web/pages/popup/tabs/timetable/activities.py:1894 in delete_client_schedule
Seen in: - altegio/biz.erp#222968 — shard 4 — launch 161286 (×1, last 2026-09-11 11:36 MSK)
AssertionError — 1 occurrence(s) across 1 pipeline(s)¶
AssertionError: Locator expected to have count '0'
Actual value: 1
Call log:
- Expect "to_have_count" with timeout 60000ms
- waiting for locator("[id=\"erp-activity-modal\"]").locator("[data-locator=\"record_20270814_item\"]")
63 × locator resolved to 1 element
- unexpected value "1"
Stacktrace:
suite/yclients/biz/erp/web/activities/test_activity_schedule_pw.py:2073 in test_past_records_remain_after_client_schedule_deletion
lib/apps_pw/yclients/biz/erp/web/pages/__init__.py:77 in decorated
lib/apps_pw/yclients/biz/erp/web/pages/popup/tabs/timetable/activities.py:2000 in delete_client_schedule
Seen in: - altegio/biz.erp#224352 — shard 7 — launch 164574 (×1, last 2026-09-18 12:43 MSK)
AssertionError — 1 occurrence(s) across 1 pipeline(s)¶
AssertionError: Locator expected to have count '0'
Actual value: 1
Call log:
- Expect "to_have_count" with timeout 60000ms
- waiting for locator("[id=\"erp-activity-modal\"]").locator("[data-locator=\"record_20403627_item\"]")
63 × locator resolved to 1 element
- unexpected value "1"
Stacktrace:
suite/yclients/biz/erp/web/activities/test_activity_schedule_pw.py:2073 in test_past_records_remain_after_client_schedule_deletion
lib/apps_pw/yclients/biz/erp/web/pages/__init__.py:77 in decorated
lib/apps_pw/yclients/biz/erp/web/pages/popup/tabs/timetable/activities.py:2021 in delete_client_schedule
Seen in: - altegio/biz.erp#225234 — shard 5 — launch 166510 (×1, last 2026-09-23 05:43 MSK)
AssertionError — 1 occurrence(s) across 1 pipeline(s)¶
AssertionError: Locator expected to have count '0'
Actual value: 1
Call log:
- Expect "to_have_count" with timeout 60000ms
- waiting for locator("[id=\"erp-activity-modal\"]").locator("[data-locator=\"record_20411001_item\"]")
63 × locator resolved to 1 element
- unexpected value "1"
Stacktrace:
suite/yclients/biz/erp/web/activities/test_activity_schedule_pw.py:2073 in test_past_records_remain_after_client_schedule_deletion
lib/apps_pw/yclients/biz/erp/web/pages/__init__.py:77 in decorated
lib/apps_pw/yclients/biz/erp/web/pages/popup/tabs/timetable/activities.py:2021 in delete_client_schedule
Seen in: - altegio/biz.erp#225544 — shard 6 — launch 167182 (×1, last 2026-09-24 05:38 MSK)
AssertionError — 1 occurrence(s) across 1 pipeline(s)¶
AssertionError: Locator expected to have count '0'
Actual value: 1
Call log:
- Expect "to_have_count" with timeout 60000ms
- waiting for locator("[id=\"erp-activity-modal\"]").locator("[data-locator=\"record_20415991_item\"]")
63 × locator resolved to 1 element
- unexpected value "1"
Stacktrace:
suite/yclients/biz/erp/web/activities/test_activity_schedule_pw.py:2073 in test_past_records_remain_after_client_schedule_deletion
lib/apps_pw/yclients/biz/erp/web/pages/__init__.py:77 in decorated
lib/apps_pw/yclients/biz/erp/web/pages/popup/tabs/timetable/activities.py:2021 in delete_client_schedule
Seen in: - altegio/biz.erp#225655 — shard 5 — launch 167578 (×1, last 2026-09-24 17:27 MSK)
AssertionError — 1 occurrence(s) across 1 pipeline(s)¶
AssertionError: Locator expected to have count '0'
Actual value: 1
Call log:
- Expect "to_have_count" with timeout 60000ms
- waiting for locator("[id=\"erp-activity-modal\"]").locator("[data-locator=\"record_20458305_item\"]")
63 × locator resolved to 1 element
- unexpected value "1"
Stacktrace:
suite/yclients/biz/erp/web/activities/test_activity_schedule_pw.py:2073 in test_past_records_remain_after_client_schedule_deletion
lib/apps_pw/yclients/biz/erp/web/pages/__init__.py:77 in decorated
lib/apps_pw/yclients/biz/erp/web/pages/popup/tabs/timetable/activities.py:2021 in delete_client_schedule
Seen in: - altegio/biz.erp#227596 — shard 8 — launch 171280 (×1, last 2026-10-01 17:40 MSK)
🏥 AssertionError — 1 occurrence(s) across 1 pipeline(s)¶
AssertionError: Locator expected to have count '0'
Actual value: 1
Call log:
- Expect "to_have_count" with timeout 60000ms
- waiting for locator("[id=\"erp-activity-modal\"]").locator("[data-locator=\"record_20471058_item\"]")
63 × locator resolved to 1 element
- unexpected value "1"
Stacktrace:
suite/yclients/biz/erp/web/activities/test_activity_schedule_pw.py:2073 in test_past_records_remain_after_client_schedule_deletion
lib/apps_pw/yclients/biz/erp/web/pages/__init__.py:77 in decorated
lib/apps_pw/yclients/biz/erp/web/pages/popup/tabs/timetable/activities.py:2021 in delete_client_schedule
Seen in: - altegio/biz.erp#227866 — shard 1 — launch 172032 (×1, last 2026-10-02 15:28 MSK)
AssertionError — 1 occurrence(s) across 1 pipeline(s)¶
AssertionError: Клиент записан
Expected: <0>
but: was <1>
Stacktrace:
suite/yclients/biz/erp/web/activities/test_activity_schedule_pw.py:2086 in test_past_records_remain_after_client_schedule_deletion
lib/utils/hamcrest/__init__.py:20 in assert_that
lib/utils/hamcrest/__init__.py:35 in _assert_match
Seen in: - altegio/biz.erp#228572 — shard 1 — launch 173210 (×1, last 2026-10-05 17:28 MSK)
SigninRedirectMissingError — 1 occurrence(s) across 1 pipeline(s)¶
autotests.lib.exception.SigninRedirectMissingError: login-XHR завершился со статусом 200, но редиректа со /signin/ не случилось за 30 с — подозрение на фронт biz.erp
--- причина (playwright) ---
Timeout 30000ms exceeded.
=========================== logs ===========================
waiting for navigation to "<function ImplToApiMapping.wrap_handler.<locals>.wrapper_func at 0x7f4ebc4b7560>" until 'commit'
navigated to "https://erp-testops-dev.infra.altegio.cloud/signin/"
navigated to "https://erp-testops-dev.infra.altegio.cloud/signin/"
navigated to "https://erp-testops-dev.infra.altegio.cloud/signin/JTJGdGltZXRhYmxlJTJGMTYzNTk3MzYlMkY="
navigated to "https://erp-testops-dev.infra.altegio.cloud/signin/JTJGdGltZXRhYmxlJTJGMTYzNTk3MzYlMkY="
navigated to "https://erp-testops-dev.infra.altegio.cloud/signin/JTJGdGltZXRhYmxlJTJGMTYzNTk3MzYlMkY="
============================================================
Stacktrace:
suite/yclients/biz/erp/web/activities/test_activity_schedule_pw.py:2045 in test_past_records_remain_after_client_schedule_deletion
lib/apps_pw/yclients/biz/erp/web/pages/guest/signin.py:115 in sign_in
Seen in: - altegio/biz.erp#227722 — shard 2 — launch 171516 (×1, last 2026-10-02 04:26 MSK)
SigninRedirectMissingError — 1 occurrence(s) across 1 pipeline(s)¶
autotests.lib.exception.SigninRedirectMissingError: login-XHR завершился со статусом 200, но редиректа со /signin/ не случилось за 30 с — подозрение на фронт biz.erp
--- причина (playwright) ---
Timeout 30000ms exceeded.
=========================== logs ===========================
waiting for navigation to "<function ImplToApiMapping.wrap_handler.<locals>.wrapper_func at 0x7f67831dbec0>" until 'commit'
navigated to "https://erp-testops-dev.infra.altegio.cloud/signin/"
navigated to "https://erp-testops-dev.infra.altegio.cloud/signin/"
navigated to "https://erp-testops-dev.infra.altegio.cloud/signin/JTJGdGltZXRhYmxlJTJGMTYzNjA4NzYlMkY="
navigated to "https://erp-testops-dev.infra.altegio.cloud/signin/JTJGdGltZXRhYmxlJTJGMTYzNjA4NzYlMkY="
navigated to "https://erp-testops-dev.infra.altegio.cloud/signin/JTJGdGltZXRhYmxlJTJGMTYzNjA4NzYlMkY="
============================================================
Stacktrace:
suite/yclients/biz/erp/web/activities/test_activity_schedule_pw.py:2045 in test_past_records_remain_after_client_schedule_deletion
lib/apps_pw/yclients/biz/erp/web/pages/guest/signin.py:115 in sign_in
Seen in: - altegio/biz.erp#227722 — shard 2 — launch 171516 (×1, last 2026-10-02 04:26 MSK)
🏥 SigninRedirectMissingError — 1 occurrence(s) across 1 pipeline(s)¶
autotests.lib.exception.SigninRedirectMissingError: login-XHR завершился со статусом 200, но редиректа со /signin/ не случилось за 30 с — подозрение на фронт biz.erp
--- причина (playwright) ---
Timeout 30000ms exceeded.
=========================== logs ===========================
waiting for navigation to "<function ImplToApiMapping.wrap_handler.<locals>.wrapper_func at 0x7f38551205e0>" until 'commit'
navigated to "https://erp-testops-dev.infra.altegio.cloud/signin/"
navigated to "https://erp-testops-dev.infra.altegio.cloud/signin/"
navigated to "https://erp-testops-dev.infra.altegio.cloud/signin/JTJGdGltZXRhYmxlJTJGMTYzNjU1NTglMkY="
navigated to "https://erp-testops-dev.infra.altegio.cloud/signin/JTJGdGltZXRhYmxlJTJGMTYzNjU1NTglMkY="
navigated to "https://erp-testops-dev.infra.altegio.cloud/signin/JTJGdGltZXRhYmxlJTJGMTYzNjU1NTglMkY="
============================================================
Stacktrace:
suite/yclients/biz/erp/web/activities/test_activity_schedule_pw.py:2045 in test_past_records_remain_after_client_schedule_deletion
lib/apps_pw/yclients/biz/erp/web/pages/guest/signin.py:115 in sign_in
Seen in: - altegio/biz.erp#227749 — shard 6 — launch 171616 (×1, last 2026-10-02 08:20 MSK)
🏥 SigninRedirectMissingError — 1 occurrence(s) across 1 pipeline(s)¶
autotests.lib.exception.SigninRedirectMissingError: login-XHR завершился со статусом 200, но редиректа со /signin/ не случилось за 30 с — подозрение на фронт biz.erp
--- причина (playwright) ---
Timeout 30000ms exceeded.
=========================== logs ===========================
waiting for navigation to "<function ImplToApiMapping.wrap_handler.<locals>.wrapper_func at 0x7fb2d3152c00>" until 'commit'
navigated to "https://erp-testops-dev.infra.altegio.cloud/signin/"
navigated to "https://erp-testops-dev.infra.altegio.cloud/signin/"
navigated to "https://erp-testops-dev.infra.altegio.cloud/signin/JTJGdGltZXRhYmxlJTJGMTYzNzEwMjYlMkY="
navigated to "https://erp-testops-dev.infra.altegio.cloud/signin/JTJGdGltZXRhYmxlJTJGMTYzNzEwMjYlMkY="
navigated to "https://erp-testops-dev.infra.altegio.cloud/signin/JTJGdGltZXRhYmxlJTJGMTYzNzEwMjYlMkY="
============================================================
Stacktrace:
suite/yclients/biz/erp/web/activities/test_activity_schedule_pw.py:2045 in test_past_records_remain_after_client_schedule_deletion
lib/apps_pw/yclients/biz/erp/web/pages/guest/signin.py:115 in sign_in
Seen in: - altegio/biz.erp#227787 — shard 5 — launch 171752 (×1, last 2026-10-02 11:50 MSK)
TimeoutError — 1 occurrence(s) across 1 pipeline(s)¶
TimeoutError: timed out
pymysql.err.OperationalError: (2013, 'Lost connection to MySQL server during query (timed out)')
sqlalchemy.exc.OperationalError: (pymysql.err.OperationalError) (2013, 'Lost connection to MySQL server during query (timed out)')
[SQL: INSERT INTO documents (user_id, salon_id, storage_id, category_id, visit_id, record_id, type, comment, date_create, date, number, services_count) VALUES (%(user_id)s, %(salon_id)s, %(storage_id)s, %(category_id)s, %(visit_id)s, %(record_id)s, %(type)s, %(comment)s, %(date_create)s, %(date)s, %(number)s, %(services_count)s)]
[parameters: {'user_id': 20305700, 'salon_id': 16118723, 'storage_id': 0, 'category_id': 0, 'visit_id': 15083335, 'record_id': 20309819, 'type': 7, 'comment': '', 'date_create': datetime.datetime(2026, 9, 28, 22, 33, 5, 763449), 'date': '0000-00-00 00:00:00', 'number': 1, 'services_count': 1}]
(Background on this error at: http://sqlalche.me/e/e3q8)
Stacktrace:
lib/fixture/salon/__init__.py:196 in salon_with_entities
lib/preconditions/__init__.py:86 in create
data/db/orm/__init__.py:365 in add_entities
data/db/orm/__init__.py:73 in call_with_session
data/db/orm/__init__.py:245 in add_all
Seen in: - altegio/biz.erp#226698 — shard 2 — launch 169315 (×1, last 2026-09-28 22:50 MSK)
TimeoutError — 1 occurrence(s) across 1 pipeline(s)¶
TimeoutError: timed out
pymysql.err.OperationalError: (2013, 'Lost connection to MySQL server during query (timed out)')
sqlalchemy.exc.OperationalError: (pymysql.err.OperationalError) (2013, 'Lost connection to MySQL server during query (timed out)')
[SQL: INSERT INTO documents (user_id, salon_id, storage_id, category_id, visit_id, record_id, type, comment, date_create, date, number, services_count) VALUES (%(user_id)s, %(salon_id)s, %(storage_id)s, %(category_id)s, %(visit_id)s, %(record_id)s, %(type)s, %(comment)s, %(date_create)s, %(date)s, %(number)s, %(services_count)s)]
[parameters: {'user_id': 20306410, 'salon_id': 16119427, 'storage_id': 0, 'category_id': 0, 'visit_id': 15084135, 'record_id': 20310740, 'type': 7, 'comment': '', 'date_create': datetime.datetime(2026, 9, 28, 22, 41, 32, 192450), 'date': '0000-00-00 00:00:00', 'number': 1, 'services_count': 1}]
(Background on this error at: http://sqlalche.me/e/e3q8)
Stacktrace:
lib/fixture/salon/__init__.py:196 in salon_with_entities
lib/preconditions/__init__.py:86 in create
data/db/orm/__init__.py:365 in add_entities
data/db/orm/__init__.py:73 in call_with_session
data/db/orm/__init__.py:245 in add_all
Seen in: - altegio/biz.erp#226698 — shard 2 — launch 169315 (×1, last 2026-09-28 22:50 MSK)
TimeoutError — 1 occurrence(s) across 1 pipeline(s)¶
playwright._impl._errors.TimeoutError: Locator.click: Timeout 30000ms exceeded.
Call log:
- waiting for locator("div#calendar-block").locator("td[data-handler=\"selectDay\"]:not([class*=\"ui-datepicker-other-month\"])").filter(has=locator("[class*=\"ui-datepicker-day-text\"]").filter(has_text=re.compile(r"^\s*2\s*$"))).first.locator("a")
- locator resolved to <a href="#" class="ui-state-default">…</a>
- attempting click action
2 × waiting for element to be visible, enabled and stable
- element is visible, enabled and stable
- scrolling into view if needed
- done scrolling
- <a target="_self" class="yc-link yc-link_light" href="https://erp-testops-dev.infra.altegio.cloud/timetable/16356484/#mode=1">Reload this Page</a> from <div class="v-error-modal v-error-modal--unauthorized v-error-modal__fade-enter-active v-error-modal__fade-enter-to">…</div> subtree intercepts pointer events
- retrying click action
- waiting 20ms
- waiting for element to be visible, enabled and stable
- element is visible, enabled and stable
- scrolling into view if needed
- done scrolling
- <a target="_self" class="yc-link yc-link_light" href="https://erp-testops-dev.infra.altegio.cloud/timetable/16356484/#mode=1">Reload this Page</a> from <div class="v-error-modal v-error-modal--unauthorized v-error-modal__fade-enter-active v-error-modal__fade-enter-to">…</div> subtree intercepts pointer events
2 × retrying click action
- waiting 100ms
- waiting for element to be visible, enabled and stable
- element is visible, enabled and stable
- scrolling into view if needed
- done scrolling
- <div class="v-error-modal v-error-modal--unauthorized">…</div> intercepts pointer events
13 × retrying click action
- waiting 500ms
- waiting for element to be visible, enabled and stable
- element is visible, enabled and stable
- scrolling into view if needed
- done scrolling
- <a target="_self" class="yc-link yc-link_light" href="https://erp-testops-dev.infra.altegio.cloud/timetable/16356484/#mode=1">Reload this Page</a> from <div class="v-error-modal v-error-modal--unauthorized">…</div> subtree intercepts pointer events
- retrying click action
- waiting 500ms
- waiting for element to be visible, enabled and stable
- element is visible, enabled and stable
- scrolling into view if needed
- done scrolling
- <a target="_self" class="yc-link yc-link_light" href="https://erp-testops-dev.infra.altegio.cloud/timetable/16356484/#mode=1">Reload this Page</a> from <div class="v-error-modal v-error-modal--unauthorized">…</div> subtree intercepts pointer events
- retrying click action
- waiting 500ms
- waiting for element to be visible, enabled and stable
- element is visible, enabled and stable
- scrolling into view if needed
- done scrolling
- <div class="v-error-modal v-error-modal--unauthorized">…</div> intercepts pointer events
- retrying click action
- waiting 500ms
- waiting for element to be visible, enabled and stable
- element is visible, enabled and stable
- scrolling into view if needed
- done scrolling
- <div class="v-error-modal v-error-modal--unauthorized">…</div> intercepts pointer events
2 × retrying click action
- waiting 500ms
- waiting for element to be visible, enabled and stable
- element is visible, enabled and stable
- scrolling into view if needed
- done scrolling
- <a target="_self" class="yc-link yc-link_light" href="https://erp-testops-dev.infra.altegio.cloud/timetable/16356484/#mode=1">Reload this Page</a> from <div class="v-error-modal v-error-modal--unauthorized">…</div> subtree intercepts pointer events
- retrying click action
- waiting 500ms
- waiting for element to be visible, enabled and stable
- element is visible, enab... [truncated]
Stacktrace:
suite/yclients/biz/erp/web/activities/test_activity_schedule_pw.py:2051 in test_past_records_remain_after_client_schedule_deletion
lib/apps_pw/yclients/biz/erp/web/pages/__init__.py:77 in decorated
lib/apps_pw/yclients/biz/erp/web/pages/user.py:497 in open_timetable
lib/apps_pw/yclients/biz/erp/web/pages/user.py:635 in _set_calendar_date
lib/apps_pw/yclients/biz/erp/web/pages/user.py:621 in _navigate_and_click
Seen in: - altegio/biz.erp#227596 — shard 8 — launch 171280 (×1, last 2026-10-01 17:40 MSK)
TimeoutError — 1 occurrence(s) across 1 pipeline(s)¶
playwright._impl._errors.TimeoutError: Locator.click: Timeout 30000ms exceeded.
Call log:
- waiting for locator("div#calendar-block").locator("td[data-handler=\"selectDay\"]:not([class*=\"ui-datepicker-other-month\"])").filter(has=locator("[class*=\"ui-datepicker-day-text\"]").filter(has_text=re.compile(r"^\s*2\s*$"))).first.locator("a")
- locator resolved to <a href="#" class="ui-state-default">…</a>
- attempting click action
2 × waiting for element to be visible, enabled and stable
- element is visible, enabled and stable
- scrolling into view if needed
- done scrolling
- <a target="_self" class="yc-link yc-link_light" href="https://erp-testops-dev.infra.altegio.cloud/timetable/16356684/#mode=1">Reload this Page</a> from <div class="v-error-modal v-error-modal--unauthorized v-error-modal__fade-enter-active v-error-modal__fade-enter-to">…</div> subtree intercepts pointer events
- retrying click action
- waiting 20ms
- waiting for element to be visible, enabled and stable
- element is visible, enabled and stable
- scrolling into view if needed
- done scrolling
- <a target="_self" class="yc-link yc-link_light" href="https://erp-testops-dev.infra.altegio.cloud/timetable/16356684/#mode=1">Reload this Page</a> from <div class="v-error-modal v-error-modal--unauthorized v-error-modal__fade-enter-active v-error-modal__fade-enter-to">…</div> subtree intercepts pointer events
2 × retrying click action
- waiting 100ms
- waiting for element to be visible, enabled and stable
- element is visible, enabled and stable
- scrolling into view if needed
- done scrolling
- <div class="v-error-modal v-error-modal--unauthorized">…</div> intercepts pointer events
13 × retrying click action
- waiting 500ms
- waiting for element to be visible, enabled and stable
- element is visible, enabled and stable
- scrolling into view if needed
- done scrolling
- <a target="_self" class="yc-link yc-link_light" href="https://erp-testops-dev.infra.altegio.cloud/timetable/16356684/#mode=1">Reload this Page</a> from <div class="v-error-modal v-error-modal--unauthorized">…</div> subtree intercepts pointer events
- retrying click action
- waiting 500ms
- waiting for element to be visible, enabled and stable
- element is visible, enabled and stable
- scrolling into view if needed
- done scrolling
- <a target="_self" class="yc-link yc-link_light" href="https://erp-testops-dev.infra.altegio.cloud/timetable/16356684/#mode=1">Reload this Page</a> from <div class="v-error-modal v-error-modal--unauthorized">…</div> subtree intercepts pointer events
- retrying click action
- waiting 500ms
- waiting for element to be visible, enabled and stable
- element is visible, enabled and stable
- scrolling into view if needed
- done scrolling
- <div class="v-error-modal v-error-modal--unauthorized">…</div> intercepts pointer events
- retrying click action
- waiting 500ms
- waiting for element to be visible, enabled and stable
- element is visible, enabled and stable
- scrolling into view if needed
- done scrolling
- <div class="v-error-modal v-error-modal--unauthorized">…</div> intercepts pointer events
2 × retrying click action
- waiting 500ms
- waiting for element to be visible, enabled and stable
- element is visible, enabled and stable
- scrolling into view if needed
- done scrolling
- <a target="_self" class="yc-link yc-link_light" href="https://erp-testops-dev.infra.altegio.cloud/timetable/16356684/#mode=1">Reload this Page</a> from <div class="v-error-modal v-error-modal--unauthorized">…</div> subtree intercepts pointer events
- retrying click action
- waiting 500ms
- waiting for element to be visible, enabled and stable
- element is visible, enab... [truncated]
Stacktrace:
suite/yclients/biz/erp/web/activities/test_activity_schedule_pw.py:2051 in test_past_records_remain_after_client_schedule_deletion
lib/apps_pw/yclients/biz/erp/web/pages/__init__.py:77 in decorated
lib/apps_pw/yclients/biz/erp/web/pages/user.py:497 in open_timetable
lib/apps_pw/yclients/biz/erp/web/pages/user.py:635 in _set_calendar_date
lib/apps_pw/yclients/biz/erp/web/pages/user.py:621 in _navigate_and_click
Seen in: - altegio/biz.erp#227596 — shard 8 — launch 171280 (×1, last 2026-10-01 17:40 MSK)
TimeoutError — 1 occurrence(s) across 1 pipeline(s)¶
playwright._impl._errors.TimeoutError: Locator.click: Timeout 30000ms exceeded.
Call log:
- waiting for locator("div#calendar-block").locator("td[data-handler=\"selectDay\"]:not([class*=\"ui-datepicker-other-month\"])").filter(has=locator("[class*=\"ui-datepicker-day-text\"]").filter(has_text=re.compile(r"^\s*3\s*$"))).first.locator("a")
- locator resolved to <a href="#" class="ui-state-default">…</a>
- attempting click action
2 × waiting for element to be visible, enabled and stable
- element is visible, enabled and stable
- scrolling into view if needed
- done scrolling
- <a target="_self" class="yc-link yc-link_light" href="https://erp-testops-dev.infra.altegio.cloud/timetable/16358547/#mode=1">Reload this Page</a> from <div class="v-error-modal v-error-modal--unauthorized v-error-modal__fade-enter-active v-error-modal__fade-enter-to">…</div> subtree intercepts pointer events
- retrying click action
- waiting 20ms
- waiting for element to be visible, enabled and stable
- element is visible, enabled and stable
- scrolling into view if needed
- done scrolling
- <a target="_self" class="yc-link yc-link_light" href="https://erp-testops-dev.infra.altegio.cloud/timetable/16358547/#mode=1">Reload this Page</a> from <div class="v-error-modal v-error-modal--unauthorized v-error-modal__fade-enter-active v-error-modal__fade-enter-to">…</div> subtree intercepts pointer events
2 × retrying click action
- waiting 100ms
- waiting for element to be visible, enabled and stable
- element is visible, enabled and stable
- scrolling into view if needed
- done scrolling
- <div class="v-error-modal v-error-modal--unauthorized">…</div> intercepts pointer events
13 × retrying click action
- waiting 500ms
- waiting for element to be visible, enabled and stable
- element is visible, enabled and stable
- scrolling into view if needed
- done scrolling
- <a target="_self" class="yc-link yc-link_light" href="https://erp-testops-dev.infra.altegio.cloud/timetable/16358547/#mode=1">Reload this Page</a> from <div class="v-error-modal v-error-modal--unauthorized">…</div> subtree intercepts pointer events
- retrying click action
- waiting 500ms
- waiting for element to be visible, enabled and stable
- element is visible, enabled and stable
- scrolling into view if needed
- done scrolling
- <a target="_self" class="yc-link yc-link_light" href="https://erp-testops-dev.infra.altegio.cloud/timetable/16358547/#mode=1">Reload this Page</a> from <div class="v-error-modal v-error-modal--unauthorized">…</div> subtree intercepts pointer events
- retrying click action
- waiting 500ms
- waiting for element to be visible, enabled and stable
- element is visible, enabled and stable
- scrolling into view if needed
- done scrolling
- <div class="v-error-modal v-error-modal--unauthorized">…</div> intercepts pointer events
- retrying click action
- waiting 500ms
- waiting for element to be visible, enabled and stable
- element is visible, enabled and stable
- scrolling into view if needed
- done scrolling
- <div class="v-error-modal v-error-modal--unauthorized">…</div> intercepts pointer events
2 × retrying click action
- waiting 500ms
- waiting for element to be visible, enabled and stable
- element is visible, enabled and stable
- scrolling into view if needed
- done scrolling
- <a target="_self" class="yc-link yc-link_light" href="https://erp-testops-dev.infra.altegio.cloud/timetable/16358547/#mode=1">Reload this Page</a> from <div class="v-error-modal v-error-modal--unauthorized">…</div> subtree intercepts pointer events
- retrying click action
- waiting 500ms
- waiting for element to be visible, enabled and stable
- element is visible, enab... [truncated]
Stacktrace:
suite/yclients/biz/erp/web/activities/test_activity_schedule_pw.py:2051 in test_past_records_remain_after_client_schedule_deletion
lib/apps_pw/yclients/biz/erp/web/pages/__init__.py:77 in decorated
lib/apps_pw/yclients/biz/erp/web/pages/user.py:497 in open_timetable
lib/apps_pw/yclients/biz/erp/web/pages/user.py:635 in _set_calendar_date
lib/apps_pw/yclients/biz/erp/web/pages/user.py:621 in _navigate_and_click
Seen in: - altegio/biz.erp#227722 — shard 2 — launch 171516 (×1, last 2026-10-02 04:26 MSK)