#52261 Staff tab: only active masters providing services displayed (FR-1.12)¶
test_payment_policy_staff_active_only
Failures in last 30 days: 24
Generated at 2026-10-08 03:53 MSK
Last failure: 2026-10-02 11:50 MSK
Filter: pipelines with sandbox_biz_erp ∈ {master, testops-dev} AND autotests_branch ∈ {master, main} only (testops-dev — daytime ticks since 2026-08-05).
🏥 7 of these ran under the quarantine tier: XFAIL, pipeline stayed green, excluded from the red statistics and incidents (see Карантин).
By exception class:
- AssertionError — 13
- SigninRedirectMissingError — 11
Failure signatures (grouped by exception + full message):
AssertionError — 13 occurrence(s) across 9 pipeline(s) (🏥 7 of 13 quarantined)¶
AssertionError: 'Payment Policy → Staff' tab does not show exactly one staff member (only the active Master_1 providing a service is expected)
Expected value: '1'
Actual value: 2
Call log:
- Expect "to_have_count" with timeout 30000ms
- waiting for locator("[data-locator^=\"payment_policy_staff_checkbox_\"]")
34 × locator resolved to 2 elements
- unexpected value "2"
Stacktrace:
suite/yclients/biz/erp/web/settings/payment_policy/test_payment_policy_staff_active_only_pw.py:90 in test_payment_policy_staff_active_only
Seen in: - altegio/biz.erp#226816 — shard 8 — launch 169602 (×1, last 2026-09-29 11:47 MSK) - altegio/biz.erp#226810 — shard 7 — launch 169534 (×1, last 2026-09-29 11:20 MSK) - altegio/biz.erp#226762 — shard 1 — launch 169417 (×1, last 2026-09-29 07:36 MSK) - altegio/biz.erp#226747 — shard 7 — launch 169383 (×1, last 2026-09-29 05:54 MSK) - altegio/biz.erp#226734 — shard 4 — launch 169350 (×1, last 2026-09-29 03:37 MSK) - altegio/biz.erp#226703 — shard 7 — launch 169316 (×1, last 2026-09-28 23:09 MSK) - altegio/biz.erp#226698 — shard 5 — launch 169315 (×1, last 2026-09-28 22:50 MSK) - altegio/biz.erp#226633 — shard 6 — launch 169248 (×3, last 2026-09-28 18:27 MSK) - altegio/biz.erp#226609 — shard 3 — launch 169235 (×3, last 2026-09-28 17:21 MSK)
SigninRedirectMissingError — 1 occurrence(s) across 1 pipeline(s)¶
autotests.lib.exception.SigninRedirectMissingError: login-XHR завершился со статусом 200, но редиректа со /signin/ не случилось за 30 с — подозрение на фронт biz.erp
--- причина (playwright) ---
Timeout 30000ms exceeded.
=========================== logs ===========================
waiting for navigation to "<function ImplToApiMapping.wrap_handler.<locals>.wrapper_func at 0x7f022e869080>" until 'commit'
navigated to "https://erp-testops-dev.infra.altegio.cloud/signin/"
navigated to "https://erp-testops-dev.infra.altegio.cloud/signin/"
navigated to "https://erp-testops-dev.infra.altegio.cloud/signin/JTJGdGltZXRhYmxlJTJGMTYzNTc2MjclMkY="
navigated to "https://erp-testops-dev.infra.altegio.cloud/signin/JTJGdGltZXRhYmxlJTJGMTYzNTc2MjclMkY="
navigated to "https://erp-testops-dev.infra.altegio.cloud/signin/JTJGdGltZXRhYmxlJTJGMTYzNTc2MjclMkY="
============================================================
Stacktrace:
suite/yclients/biz/erp/web/settings/payment_policy/test_payment_policy_staff_active_only_pw.py:54 in test_payment_policy_staff_active_only
lib/apps_pw/yclients/biz/erp/web/pages/guest/signin.py:115 in sign_in
Seen in: - altegio/biz.erp#227722 — shard 7 — launch 171516 (×1, last 2026-10-02 04:26 MSK)
SigninRedirectMissingError — 1 occurrence(s) across 1 pipeline(s)¶
autotests.lib.exception.SigninRedirectMissingError: login-XHR завершился со статусом 200, но редиректа со /signin/ не случилось за 30 с — подозрение на фронт biz.erp
--- причина (playwright) ---
Timeout 30000ms exceeded.
=========================== logs ===========================
waiting for navigation to "<function ImplToApiMapping.wrap_handler.<locals>.wrapper_func at 0x7fb033f258a0>" until 'commit'
navigated to "https://erp-testops-dev.infra.altegio.cloud/signin/"
navigated to "https://erp-testops-dev.infra.altegio.cloud/signin/"
navigated to "https://erp-testops-dev.infra.altegio.cloud/signin/JTJGdGltZXRhYmxlJTJGMTYzNTg5NzAlMkY="
navigated to "https://erp-testops-dev.infra.altegio.cloud/signin/JTJGdGltZXRhYmxlJTJGMTYzNTg5NzAlMkY="
navigated to "https://erp-testops-dev.infra.altegio.cloud/signin/JTJGdGltZXRhYmxlJTJGMTYzNTg5NzAlMkY="
============================================================
Stacktrace:
suite/yclients/biz/erp/web/settings/payment_policy/test_payment_policy_staff_active_only_pw.py:54 in test_payment_policy_staff_active_only
lib/apps_pw/yclients/biz/erp/web/pages/guest/signin.py:115 in sign_in
Seen in: - altegio/biz.erp#227722 — shard 7 — launch 171516 (×1, last 2026-10-02 04:26 MSK)
SigninRedirectMissingError — 1 occurrence(s) across 1 pipeline(s)¶
autotests.lib.exception.SigninRedirectMissingError: login-XHR завершился со статусом 200, но редиректа со /signin/ не случилось за 30 с — подозрение на фронт biz.erp
--- причина (playwright) ---
Timeout 30000ms exceeded.
=========================== logs ===========================
waiting for navigation to "<function ImplToApiMapping.wrap_handler.<locals>.wrapper_func at 0x7f213062ff60>" until 'commit'
navigated to "https://erp-testops-dev.infra.altegio.cloud/signin/"
navigated to "https://erp-testops-dev.infra.altegio.cloud/signin/"
navigated to "https://erp-testops-dev.infra.altegio.cloud/signin/JTJGdGltZXRhYmxlJTJGMTYzNjAwMzYlMkY="
navigated to "https://erp-testops-dev.infra.altegio.cloud/signin/JTJGdGltZXRhYmxlJTJGMTYzNjAwMzYlMkY="
navigated to "https://erp-testops-dev.infra.altegio.cloud/signin/JTJGdGltZXRhYmxlJTJGMTYzNjAwMzYlMkY="
============================================================
Stacktrace:
suite/yclients/biz/erp/web/settings/payment_policy/test_payment_policy_staff_active_only_pw.py:54 in test_payment_policy_staff_active_only
lib/apps_pw/yclients/biz/erp/web/pages/guest/signin.py:115 in sign_in
Seen in: - altegio/biz.erp#227722 — shard 7 — launch 171516 (×1, last 2026-10-02 04:26 MSK)
SigninRedirectMissingError — 1 occurrence(s) across 1 pipeline(s)¶
autotests.lib.exception.SigninRedirectMissingError: login-XHR завершился со статусом 200, но редиректа со /signin/ не случилось за 30 с — подозрение на фронт biz.erp
--- причина (playwright) ---
Timeout 30000ms exceeded.
=========================== logs ===========================
waiting for navigation to "<function ImplToApiMapping.wrap_handler.<locals>.wrapper_func at 0x7f239207aac0>" until 'commit'
navigated to "https://erp-testops-dev.infra.altegio.cloud/signin/"
navigated to "https://erp-testops-dev.infra.altegio.cloud/signin/"
navigated to "https://erp-testops-dev.infra.altegio.cloud/signin/JTJGdGltZXRhYmxlJTJGMTYzNjIyNjAlMkY="
navigated to "https://erp-testops-dev.infra.altegio.cloud/signin/JTJGdGltZXRhYmxlJTJGMTYzNjIyNjAlMkY="
navigated to "https://erp-testops-dev.infra.altegio.cloud/signin/JTJGdGltZXRhYmxlJTJGMTYzNjIyNjAlMkY="
============================================================
Stacktrace:
suite/yclients/biz/erp/web/settings/payment_policy/test_payment_policy_staff_active_only_pw.py:54 in test_payment_policy_staff_active_only
lib/apps_pw/yclients/biz/erp/web/pages/guest/signin.py:115 in sign_in
Seen in: - altegio/biz.erp#227735 — shard 4 — launch 171549 (×1, last 2026-10-02 06:23 MSK)
SigninRedirectMissingError — 1 occurrence(s) across 1 pipeline(s)¶
autotests.lib.exception.SigninRedirectMissingError: login-XHR завершился со статусом 200, но редиректа со /signin/ не случилось за 30 с — подозрение на фронт biz.erp
--- причина (playwright) ---
Timeout 30000ms exceeded.
=========================== logs ===========================
waiting for navigation to "<function ImplToApiMapping.wrap_handler.<locals>.wrapper_func at 0x7f8f4c3d6f20>" until 'commit'
navigated to "https://erp-testops-dev.infra.altegio.cloud/signin/"
navigated to "https://erp-testops-dev.infra.altegio.cloud/signin/"
navigated to "https://erp-testops-dev.infra.altegio.cloud/signin/JTJGdGltZXRhYmxlJTJGMTYzNjM2MTQlMkY="
navigated to "https://erp-testops-dev.infra.altegio.cloud/signin/JTJGdGltZXRhYmxlJTJGMTYzNjM2MTQlMkY="
navigated to "https://erp-testops-dev.infra.altegio.cloud/signin/JTJGdGltZXRhYmxlJTJGMTYzNjM2MTQlMkY="
============================================================
Stacktrace:
suite/yclients/biz/erp/web/settings/payment_policy/test_payment_policy_staff_active_only_pw.py:54 in test_payment_policy_staff_active_only
lib/apps_pw/yclients/biz/erp/web/pages/guest/signin.py:115 in sign_in
Seen in: - altegio/biz.erp#227735 — shard 4 — launch 171549 (×1, last 2026-10-02 06:23 MSK)
SigninRedirectMissingError — 1 occurrence(s) across 1 pipeline(s)¶
autotests.lib.exception.SigninRedirectMissingError: login-XHR завершился со статусом 200, но редиректа со /signin/ не случилось за 30 с — подозрение на фронт biz.erp
--- причина (playwright) ---
Timeout 30000ms exceeded.
=========================== logs ===========================
waiting for navigation to "<function ImplToApiMapping.wrap_handler.<locals>.wrapper_func at 0x7f0005eaa480>" until 'commit'
navigated to "https://erp-testops-dev.infra.altegio.cloud/signin/"
navigated to "https://erp-testops-dev.infra.altegio.cloud/signin/"
navigated to "https://erp-testops-dev.infra.altegio.cloud/signin/JTJGdGltZXRhYmxlJTJGMTYzNjQ3NzElMkY="
navigated to "https://erp-testops-dev.infra.altegio.cloud/signin/JTJGdGltZXRhYmxlJTJGMTYzNjQ3NzElMkY="
navigated to "https://erp-testops-dev.infra.altegio.cloud/signin/JTJGdGltZXRhYmxlJTJGMTYzNjQ3NzElMkY="
============================================================
Stacktrace:
suite/yclients/biz/erp/web/settings/payment_policy/test_payment_policy_staff_active_only_pw.py:54 in test_payment_policy_staff_active_only
lib/apps_pw/yclients/biz/erp/web/pages/guest/signin.py:115 in sign_in
Seen in: - altegio/biz.erp#227735 — shard 4 — launch 171549 (×1, last 2026-10-02 06:23 MSK)
SigninRedirectMissingError — 1 occurrence(s) across 1 pipeline(s)¶
autotests.lib.exception.SigninRedirectMissingError: login-XHR завершился со статусом 200, но редиректа со /signin/ не случилось за 30 с — подозрение на фронт biz.erp
--- причина (playwright) ---
Timeout 30000ms exceeded.
=========================== logs ===========================
waiting for navigation to "<function ImplToApiMapping.wrap_handler.<locals>.wrapper_func at 0x7f2635d8a7a0>" until 'commit'
navigated to "https://erp-testops-dev.infra.altegio.cloud/signin/"
navigated to "https://erp-testops-dev.infra.altegio.cloud/signin/"
navigated to "https://erp-testops-dev.infra.altegio.cloud/signin/JTJGdGltZXRhYmxlJTJGMTYzNjY1OTQlMkY="
navigated to "https://erp-testops-dev.infra.altegio.cloud/signin/JTJGdGltZXRhYmxlJTJGMTYzNjY1OTQlMkY="
navigated to "https://erp-testops-dev.infra.altegio.cloud/signin/JTJGdGltZXRhYmxlJTJGMTYzNjY1OTQlMkY="
============================================================
Stacktrace:
suite/yclients/biz/erp/web/settings/payment_policy/test_payment_policy_staff_active_only_pw.py:54 in test_payment_policy_staff_active_only
lib/apps_pw/yclients/biz/erp/web/pages/guest/signin.py:115 in sign_in
Seen in: - altegio/biz.erp#227749 — shard 1 — launch 171616 (×1, last 2026-10-02 08:20 MSK)
SigninRedirectMissingError — 1 occurrence(s) across 1 pipeline(s)¶
autotests.lib.exception.SigninRedirectMissingError: login-XHR завершился со статусом 200, но редиректа со /signin/ не случилось за 30 с — подозрение на фронт biz.erp
--- причина (playwright) ---
Timeout 30000ms exceeded.
=========================== logs ===========================
waiting for navigation to "<function ImplToApiMapping.wrap_handler.<locals>.wrapper_func at 0x7f8e387556c0>" until 'commit'
navigated to "https://erp-testops-dev.infra.altegio.cloud/signin/"
navigated to "https://erp-testops-dev.infra.altegio.cloud/signin/"
navigated to "https://erp-testops-dev.infra.altegio.cloud/signin/JTJGdGltZXRhYmxlJTJGMTYzNjgwODMlMkY="
navigated to "https://erp-testops-dev.infra.altegio.cloud/signin/JTJGdGltZXRhYmxlJTJGMTYzNjgwODMlMkY="
navigated to "https://erp-testops-dev.infra.altegio.cloud/signin/JTJGdGltZXRhYmxlJTJGMTYzNjgwODMlMkY="
============================================================
Stacktrace:
suite/yclients/biz/erp/web/settings/payment_policy/test_payment_policy_staff_active_only_pw.py:54 in test_payment_policy_staff_active_only
lib/apps_pw/yclients/biz/erp/web/pages/guest/signin.py:115 in sign_in
Seen in: - altegio/biz.erp#227749 — shard 1 — launch 171616 (×1, last 2026-10-02 08:20 MSK)
SigninRedirectMissingError — 1 occurrence(s) across 1 pipeline(s)¶
autotests.lib.exception.SigninRedirectMissingError: login-XHR завершился со статусом 200, но редиректа со /signin/ не случилось за 30 с — подозрение на фронт biz.erp
--- причина (playwright) ---
Timeout 30000ms exceeded.
=========================== logs ===========================
waiting for navigation to "<function ImplToApiMapping.wrap_handler.<locals>.wrapper_func at 0x7ffa9c7d7920>" until 'commit'
navigated to "https://erp-testops-dev.infra.altegio.cloud/signin/"
navigated to "https://erp-testops-dev.infra.altegio.cloud/signin/"
navigated to "https://erp-testops-dev.infra.altegio.cloud/signin/JTJGdGltZXRhYmxlJTJGMTYzNjkxODUlMkY="
navigated to "https://erp-testops-dev.infra.altegio.cloud/signin/JTJGdGltZXRhYmxlJTJGMTYzNjkxODUlMkY="
navigated to "https://erp-testops-dev.infra.altegio.cloud/signin/JTJGdGltZXRhYmxlJTJGMTYzNjkxODUlMkY="
============================================================
Stacktrace:
suite/yclients/biz/erp/web/settings/payment_policy/test_payment_policy_staff_active_only_pw.py:54 in test_payment_policy_staff_active_only
lib/apps_pw/yclients/biz/erp/web/pages/guest/signin.py:115 in sign_in
Seen in: - altegio/biz.erp#227749 — shard 1 — launch 171616 (×1, last 2026-10-02 08:20 MSK)
SigninRedirectMissingError — 1 occurrence(s) across 1 pipeline(s)¶
autotests.lib.exception.SigninRedirectMissingError: login-XHR завершился со статусом 200, но редиректа со /signin/ не случилось за 30 с — подозрение на фронт biz.erp
--- причина (playwright) ---
Timeout 30000ms exceeded.
=========================== logs ===========================
waiting for navigation to "<function ImplToApiMapping.wrap_handler.<locals>.wrapper_func at 0x7ff6b251bc40>" until 'commit'
navigated to "https://erp-testops-dev.infra.altegio.cloud/signin/"
navigated to "https://erp-testops-dev.infra.altegio.cloud/signin/"
navigated to "https://erp-testops-dev.infra.altegio.cloud/signin/JTJGdGltZXRhYmxlJTJGMTYzNjk0MDQlMkY="
navigated to "https://erp-testops-dev.infra.altegio.cloud/signin/JTJGdGltZXRhYmxlJTJGMTYzNjk0MDQlMkY="
navigated to "https://erp-testops-dev.infra.altegio.cloud/signin/JTJGdGltZXRhYmxlJTJGMTYzNjk0MDQlMkY="
============================================================
Stacktrace:
suite/yclients/biz/erp/web/settings/payment_policy/test_payment_policy_staff_active_only_pw.py:54 in test_payment_policy_staff_active_only
lib/apps_pw/yclients/biz/erp/web/pages/guest/signin.py:115 in sign_in
Seen in: - altegio/biz.erp#227787 — shard 6 — launch 171752 (×1, last 2026-10-02 11:50 MSK)
SigninRedirectMissingError — 1 occurrence(s) across 1 pipeline(s)¶
autotests.lib.exception.SigninRedirectMissingError: login-XHR завершился со статусом 200, но редиректа со /signin/ не случилось за 30 с — подозрение на фронт biz.erp
--- причина (playwright) ---
Timeout 30000ms exceeded.
=========================== logs ===========================
waiting for navigation to "<function ImplToApiMapping.wrap_handler.<locals>.wrapper_func at 0x7f5291bb4180>" until 'commit'
navigated to "https://erp-testops-dev.infra.altegio.cloud/signin/"
navigated to "https://erp-testops-dev.infra.altegio.cloud/signin/"
navigated to "https://erp-testops-dev.infra.altegio.cloud/signin/JTJGdGltZXRhYmxlJTJGMTYzNzEzMTYlMkY="
navigated to "https://erp-testops-dev.infra.altegio.cloud/signin/JTJGdGltZXRhYmxlJTJGMTYzNzEzMTYlMkY="
navigated to "https://erp-testops-dev.infra.altegio.cloud/signin/JTJGdGltZXRhYmxlJTJGMTYzNzEzMTYlMkY="
============================================================
Stacktrace:
suite/yclients/biz/erp/web/settings/payment_policy/test_payment_policy_staff_active_only_pw.py:54 in test_payment_policy_staff_active_only
lib/apps_pw/yclients/biz/erp/web/pages/guest/signin.py:115 in sign_in
Seen in: - altegio/biz.erp#227787 — shard 6 — launch 171752 (×1, last 2026-10-02 11:50 MSK)