Skip to content

#39032 Include amounts paid during promotions - OFF + Specify payout value % for promotional payments - 50$

test_payroll_product_sale_using_discount_excluding_promotions_fix_promotion_payout

Failures in last 30 days: 11

Generated at 2026-10-08 03:53 MSK

Last failure: 2026-10-06 19:04 MSK

Filter: pipelines with sandbox_biz_erp ∈ {master, testops-dev} AND autotests_branch ∈ {master, main} only (testops-dev — daytime ticks since 2026-08-05).

By exception class: - SigninRedirectMissingError — 8 - TimeoutError — 2 - AssertionError — 1

Failure signatures (grouped by exception + full message):

AssertionError — 1 occurrence(s) across 1 pipeline(s)

AssertionError: Employee Сотрудник 1 should have payroll amount of 275
Expected: a sequence containing a dictionary containing {'name': 'Сотрудник 1', 'payroll_amount': Decimal('275.00')}
     but: was <[{'id': 16107183, 'name': 'Сотрудник 1', 'payroll_amount': Decimal('250')}]>

Stacktrace:

suite/yclients/biz/erp/web/payroll/test_payroll_product_sale_pw.py:72 in test_payroll_product_sale_using_discount_excluding_promotions_fix_promotion_payout
lib/utils/hamcrest/__init__.py:20 in assert_that
lib/utils/hamcrest/__init__.py:35 in _assert_match

Seen in: - altegio/biz.erp#228956 — shard 7 — launch 173620 (×1, last 2026-10-06 19:04 MSK)

SigninRedirectMissingError — 1 occurrence(s) across 1 pipeline(s)

autotests.lib.exception.SigninRedirectMissingError: login-XHR завершился со статусом 200, но редиректа со /signin/ не случилось за 30 с — подозрение на фронт biz.erp
--- причина (playwright) ---
Timeout 30000ms exceeded.
=========================== logs ===========================
waiting for navigation to "<function ImplToApiMapping.wrap_handler.<locals>.wrapper_func at 0x7f0af9a7f9c0>" until 'commit'
  navigated to "https://erp-testops-dev.infra.altegio.cloud/signin/"
  navigated to "https://erp-testops-dev.infra.altegio.cloud/signin/"
  navigated to "https://erp-testops-dev.infra.altegio.cloud/signin/JTJGdGltZXRhYmxlJTJGMTYzNTg3MTklMkY="
  navigated to "https://erp-testops-dev.infra.altegio.cloud/signin/JTJGdGltZXRhYmxlJTJGMTYzNTg3MTklMkY="
  navigated to "https://erp-testops-dev.infra.altegio.cloud/signin/JTJGdGltZXRhYmxlJTJGMTYzNTg3MTklMkY="
============================================================

Stacktrace:

suite/yclients/biz/erp/web/payroll/test_payroll_product_sale_pw.py:50 in test_payroll_product_sale_using_discount_excluding_promotions_fix_promotion_payout
lib/apps_pw/yclients/biz/erp/web/pages/guest/signin.py:115 in sign_in

Seen in: - altegio/biz.erp#227722 — shard 4 — launch 171516 (×1, last 2026-10-02 04:26 MSK)

SigninRedirectMissingError — 1 occurrence(s) across 1 pipeline(s)

autotests.lib.exception.SigninRedirectMissingError: login-XHR завершился со статусом 200, но редиректа со /signin/ не случилось за 30 с — подозрение на фронт biz.erp
--- причина (playwright) ---
Timeout 30000ms exceeded.
=========================== logs ===========================
waiting for navigation to "<function ImplToApiMapping.wrap_handler.<locals>.wrapper_func at 0x7fe596615b20>" until 'commit'
  navigated to "https://erp-testops-dev.infra.altegio.cloud/signin/"
  navigated to "https://erp-testops-dev.infra.altegio.cloud/signin/"
  navigated to "https://erp-testops-dev.infra.altegio.cloud/signin/JTJGdGltZXRhYmxlJTJGMTYzNTk4MzAlMkY="
  navigated to "https://erp-testops-dev.infra.altegio.cloud/signin/JTJGdGltZXRhYmxlJTJGMTYzNTk4MzAlMkY="
  navigated to "https://erp-testops-dev.infra.altegio.cloud/signin/JTJGdGltZXRhYmxlJTJGMTYzNTk4MzAlMkY="
============================================================

Stacktrace:

suite/yclients/biz/erp/web/payroll/test_payroll_product_sale_pw.py:50 in test_payroll_product_sale_using_discount_excluding_promotions_fix_promotion_payout
lib/apps_pw/yclients/biz/erp/web/pages/guest/signin.py:115 in sign_in

Seen in: - altegio/biz.erp#227722 — shard 4 — launch 171516 (×1, last 2026-10-02 04:26 MSK)

SigninRedirectMissingError — 1 occurrence(s) across 1 pipeline(s)

autotests.lib.exception.SigninRedirectMissingError: login-XHR завершился со статусом 200, но редиректа со /signin/ не случилось за 30 с — подозрение на фронт biz.erp
--- причина (playwright) ---
Timeout 30000ms exceeded.
=========================== logs ===========================
waiting for navigation to "<function ImplToApiMapping.wrap_handler.<locals>.wrapper_func at 0x7f0758783920>" until 'commit'
  navigated to "https://erp-testops-dev.infra.altegio.cloud/signin/"
  navigated to "https://erp-testops-dev.infra.altegio.cloud/signin/"
  navigated to "https://erp-testops-dev.infra.altegio.cloud/signin/JTJGdGltZXRhYmxlJTJGMTYzNjA3OTclMkY="
  navigated to "https://erp-testops-dev.infra.altegio.cloud/signin/JTJGdGltZXRhYmxlJTJGMTYzNjA3OTclMkY="
  navigated to "https://erp-testops-dev.infra.altegio.cloud/signin/JTJGdGltZXRhYmxlJTJGMTYzNjA3OTclMkY="
============================================================

Stacktrace:

suite/yclients/biz/erp/web/payroll/test_payroll_product_sale_pw.py:50 in test_payroll_product_sale_using_discount_excluding_promotions_fix_promotion_payout
lib/apps_pw/yclients/biz/erp/web/pages/guest/signin.py:115 in sign_in

Seen in: - altegio/biz.erp#227722 — shard 4 — launch 171516 (×1, last 2026-10-02 04:26 MSK)

SigninRedirectMissingError — 1 occurrence(s) across 1 pipeline(s)

autotests.lib.exception.SigninRedirectMissingError: login-XHR завершился со статусом 200, но редиректа со /signin/ не случилось за 30 с — подозрение на фронт biz.erp
--- причина (playwright) ---
Timeout 30000ms exceeded.
=========================== logs ===========================
waiting for navigation to "<function ImplToApiMapping.wrap_handler.<locals>.wrapper_func at 0x7fd204b96a20>" until 'commit'
  navigated to "https://erp-testops-dev.infra.altegio.cloud/signin/"
  navigated to "https://erp-testops-dev.infra.altegio.cloud/signin/"
  navigated to "https://erp-testops-dev.infra.altegio.cloud/signin/JTJGdGltZXRhYmxlJTJGMTYzNjY2NTUlMkY="
  navigated to "https://erp-testops-dev.infra.altegio.cloud/signin/JTJGdGltZXRhYmxlJTJGMTYzNjY2NTUlMkY="
  navigated to "https://erp-testops-dev.infra.altegio.cloud/signin/JTJGdGltZXRhYmxlJTJGMTYzNjY2NTUlMkY="
============================================================

Stacktrace:

suite/yclients/biz/erp/web/payroll/test_payroll_product_sale_pw.py:50 in test_payroll_product_sale_using_discount_excluding_promotions_fix_promotion_payout
lib/apps_pw/yclients/biz/erp/web/pages/guest/signin.py:115 in sign_in

Seen in: - altegio/biz.erp#227749 — shard 4 — launch 171616 (×1, last 2026-10-02 08:20 MSK)

SigninRedirectMissingError — 1 occurrence(s) across 1 pipeline(s)

autotests.lib.exception.SigninRedirectMissingError: login-XHR завершился со статусом 200, но редиректа со /signin/ не случилось за 30 с — подозрение на фронт biz.erp
--- причина (playwright) ---
Timeout 30000ms exceeded.
=========================== logs ===========================
waiting for navigation to "<function ImplToApiMapping.wrap_handler.<locals>.wrapper_func at 0x7f6b5c63ac00>" until 'commit'
  navigated to "https://erp-testops-dev.infra.altegio.cloud/signin/"
  navigated to "https://erp-testops-dev.infra.altegio.cloud/signin/"
  navigated to "https://erp-testops-dev.infra.altegio.cloud/signin/JTJGdGltZXRhYmxlJTJGMTYzNjc5ODglMkY="
  navigated to "https://erp-testops-dev.infra.altegio.cloud/signin/JTJGdGltZXRhYmxlJTJGMTYzNjc5ODglMkY="
  navigated to "https://erp-testops-dev.infra.altegio.cloud/signin/JTJGdGltZXRhYmxlJTJGMTYzNjc5ODglMkY="
============================================================

Stacktrace:

suite/yclients/biz/erp/web/payroll/test_payroll_product_sale_pw.py:50 in test_payroll_product_sale_using_discount_excluding_promotions_fix_promotion_payout
lib/apps_pw/yclients/biz/erp/web/pages/guest/signin.py:115 in sign_in

Seen in: - altegio/biz.erp#227749 — shard 4 — launch 171616 (×1, last 2026-10-02 08:20 MSK)

SigninRedirectMissingError — 1 occurrence(s) across 1 pipeline(s)

autotests.lib.exception.SigninRedirectMissingError: login-XHR завершился со статусом 200, но редиректа со /signin/ не случилось за 30 с — подозрение на фронт biz.erp
--- причина (playwright) ---
Timeout 30000ms exceeded.
=========================== logs ===========================
waiting for navigation to "<function ImplToApiMapping.wrap_handler.<locals>.wrapper_func at 0x7f481878a660>" until 'commit'
  navigated to "https://erp-testops-dev.infra.altegio.cloud/signin/"
  navigated to "https://erp-testops-dev.infra.altegio.cloud/signin/"
  navigated to "https://erp-testops-dev.infra.altegio.cloud/signin/JTJGdGltZXRhYmxlJTJGMTYzNjkwNzklMkY="
  navigated to "https://erp-testops-dev.infra.altegio.cloud/signin/JTJGdGltZXRhYmxlJTJGMTYzNjkwNzklMkY="
  navigated to "https://erp-testops-dev.infra.altegio.cloud/signin/JTJGdGltZXRhYmxlJTJGMTYzNjkwNzklMkY="
============================================================

Stacktrace:

suite/yclients/biz/erp/web/payroll/test_payroll_product_sale_pw.py:50 in test_payroll_product_sale_using_discount_excluding_promotions_fix_promotion_payout
lib/apps_pw/yclients/biz/erp/web/pages/guest/signin.py:115 in sign_in

Seen in: - altegio/biz.erp#227749 — shard 4 — launch 171616 (×1, last 2026-10-02 08:20 MSK)

SigninRedirectMissingError — 1 occurrence(s) across 1 pipeline(s)

autotests.lib.exception.SigninRedirectMissingError: login-XHR завершился со статусом 200, но редиректа со /signin/ не случилось за 30 с — подозрение на фронт biz.erp
--- причина (playwright) ---
Timeout 30000ms exceeded.
=========================== logs ===========================
waiting for navigation to "<function ImplToApiMapping.wrap_handler.<locals>.wrapper_func at 0x7f358934a2a0>" until 'commit'
  navigated to "https://erp-testops-dev.infra.altegio.cloud/signin/"
  navigated to "https://erp-testops-dev.infra.altegio.cloud/signin/"
  navigated to "https://erp-testops-dev.infra.altegio.cloud/signin/JTJGdGltZXRhYmxlJTJGMTYzNjk4MzYlMkY="
  navigated to "https://erp-testops-dev.infra.altegio.cloud/signin/JTJGdGltZXRhYmxlJTJGMTYzNjk4MzYlMkY="
  navigated to "https://erp-testops-dev.infra.altegio.cloud/signin/JTJGdGltZXRhYmxlJTJGMTYzNjk4MzYlMkY="
============================================================

Stacktrace:

suite/yclients/biz/erp/web/payroll/test_payroll_product_sale_pw.py:50 in test_payroll_product_sale_using_discount_excluding_promotions_fix_promotion_payout
lib/apps_pw/yclients/biz/erp/web/pages/guest/signin.py:115 in sign_in

Seen in: - altegio/biz.erp#227787 — shard 7 — launch 171752 (×1, last 2026-10-02 11:50 MSK)

SigninRedirectMissingError — 1 occurrence(s) across 1 pipeline(s)

autotests.lib.exception.SigninRedirectMissingError: login-XHR завершился со статусом 200, но редиректа со /signin/ не случилось за 30 с — подозрение на фронт biz.erp
--- причина (playwright) ---
Timeout 30000ms exceeded.
=========================== logs ===========================
waiting for navigation to "<function ImplToApiMapping.wrap_handler.<locals>.wrapper_func at 0x7fa56b70d4e0>" until 'commit'
  navigated to "https://erp-testops-dev.infra.altegio.cloud/signin/"
  navigated to "https://erp-testops-dev.infra.altegio.cloud/signin/"
  navigated to "https://erp-testops-dev.infra.altegio.cloud/signin/JTJGdGltZXRhYmxlJTJGMTYzNzE0NDklMkY="
  navigated to "https://erp-testops-dev.infra.altegio.cloud/signin/JTJGdGltZXRhYmxlJTJGMTYzNzE0NDklMkY="
  navigated to "https://erp-testops-dev.infra.altegio.cloud/signin/JTJGdGltZXRhYmxlJTJGMTYzNzE0NDklMkY="
============================================================

Stacktrace:

suite/yclients/biz/erp/web/payroll/test_payroll_product_sale_pw.py:50 in test_payroll_product_sale_using_discount_excluding_promotions_fix_promotion_payout
lib/apps_pw/yclients/biz/erp/web/pages/guest/signin.py:115 in sign_in

Seen in: - altegio/biz.erp#227787 — shard 7 — launch 171752 (×1, last 2026-10-02 11:50 MSK)

TimeoutError — 1 occurrence(s) across 1 pipeline(s)

TimeoutError: timed out
pymysql.err.OperationalError: (2013, 'Lost connection to MySQL server during query (timed out)')
sqlalchemy.exc.OperationalError: (pymysql.err.OperationalError) (2013, 'Lost connection to MySQL server during query (timed out)')
[SQL: INSERT INTO documents (user_id, salon_id, storage_id, category_id, visit_id, record_id, type, comment, date_create, date, number, services_count) VALUES (%(user_id)s, %(salon_id)s, %(storage_id)s, %(category_id)s, %(visit_id)s, %(record_id)s, %(type)s, %(comment)s, %(date_create)s, %(date)s, %(number)s, %(services_count)s)]
[parameters: {'user_id': 20305990, 'salon_id': 16119014, 'storage_id': 0, 'category_id': 0, 'visit_id': 15083619, 'record_id': 20310124, 'type': 7, 'comment': '', 'date_create': datetime.datetime(2026, 9, 28, 22, 35, 38, 971147), 'date': '0000-00-00 00:00:00', 'number': 1, 'services_count': 0}]
(Background on this error at: http://sqlalche.me/e/e3q8)

Stacktrace:

lib/fixture/salon/__init__.py:196 in salon_with_entities
lib/preconditions/__init__.py:86 in create
data/db/orm/__init__.py:365 in add_entities
data/db/orm/__init__.py:74 in call_with_session

Seen in: - altegio/biz.erp#226698 — shard 8 — launch 169315 (×1, last 2026-09-28 22:50 MSK)

TimeoutError — 1 occurrence(s) across 1 pipeline(s)

TimeoutError: timed out
pymysql.err.OperationalError: (2013, 'Lost connection to MySQL server during query (timed out)')
sqlalchemy.exc.OperationalError: (pymysql.err.OperationalError) (2013, 'Lost connection to MySQL server during query (timed out)')
[SQL: INSERT INTO documents (user_id, salon_id, storage_id, category_id, visit_id, record_id, type, comment, date_create, date, number, services_count) VALUES (%(user_id)s, %(salon_id)s, %(storage_id)s, %(category_id)s, %(visit_id)s, %(record_id)s, %(type)s, %(comment)s, %(date_create)s, %(date)s, %(number)s, %(services_count)s)]
[parameters: {'user_id': 20306488, 'salon_id': 16119505, 'storage_id': 0, 'category_id': 0, 'visit_id': 15084241, 'record_id': 20310863, 'type': 7, 'comment': '', 'date_create': datetime.datetime(2026, 9, 28, 22, 42, 33, 218033), 'date': '0000-00-00 00:00:00', 'number': 1, 'services_count': 0}]
(Background on this error at: http://sqlalche.me/e/e3q8)

Stacktrace:

lib/fixture/salon/__init__.py:196 in salon_with_entities
lib/preconditions/__init__.py:86 in create
data/db/orm/__init__.py:365 in add_entities
data/db/orm/__init__.py:74 in call_with_session

Seen in: - altegio/biz.erp#226698 — shard 8 — launch 169315 (×1, last 2026-09-28 22:50 MSK)