Страница Личной информации. Переход назад в Личный кабинет по стрелке <¶
test_personal_account_personal_information_page_go_back_with_back_btn
Failures in last 30 days: 13
Generated at 2026-10-08 03:35 MSK
Last failure: 2026-10-02 11:50 MSK
Filter: pipelines with sandbox_biz_erp ∈ {master, testops-dev} AND autotests_branch ∈ {master, main} only (testops-dev — daytime ticks since 2026-08-05).
By exception class:
- TimeoutException — 10
- WebDriverException — 3
Failure signatures (grouped by exception + full message):
TimeoutException — 10 occurrence(s) across 4 pipeline(s)¶
selenium.common.exceptions.TimeoutException: Message:
Stacktrace:
suite/yclients/client/booking/web/personal_account/test_personal_account.py:417 in test_personal_account_personal_information_page_go_back_with_back_btn
lib/common/ui/pages/web.py:61 in decorated
lib/common/ui/pages/web.py:646 in wait_for_value_in_db
lib/ui/selenium/webdriver/support/wait.py:28 in until
Seen in: - altegio/biz.erp#227787 — shard 6 — launch 171752 (×1, last 2026-10-02 11:50 MSK) - altegio/biz.erp#227749 — shard 4 — launch 171616 (×3, last 2026-10-02 08:20 MSK) - altegio/biz.erp#227735 — shard 6 — launch 171549 (×3, last 2026-10-02 06:23 MSK) - altegio/biz.erp#227722 — shard 8 — launch 171516 (×3, last 2026-10-02 04:26 MSK)
WebDriverException — 1 occurrence(s) across 1 pipeline(s)¶
selenium.common.exceptions.WebDriverException: Message: <unknown>: Failed to read the 'localStorage' property from 'Window': Access is denied for this document.
(Session info: headless chrome=119.0.6045.199)
Stacktrace:
#0 0x55b43fc7d5e3 <unknown>
#1 0x55b43f9400b7 <unknown>
#2 0x55b43f9462b5 <unknown>
#3 0x55b43f9489b1 <unknown>
#4 0x55b43f9d171f <unknown>
#5 0x55b43f9b4ef2 <unknown>
#6 0x55b43f9d0b3d <unknown>
#7 0x55b43f9b4cc3 <unknown>
#8 0x55b43f9800e4 <unknown>
#9 0x55b43f9810ae <unknown>
#10 0x55b43fc43ce1 <unknown>
#11 0x55b43fc47b7e <unknown>
#12 0x55b43fc314b5 <unknown>
#13 0x55b43fc487d6 <unknown>
#14 0x55b43fc14dbf <unknown>
#15 0x55b43fc6b748 <unknown>
#16 0x55b43fc6b917 <unknown>
#17 0x55b43fc7c773 <unknown>
#18 0x7f1b6fdabaa4 <unknown>
#19 0x7f1b6fe38a64 __clone
Stacktrace:
lib/common/ui/pages/web.py:61 in decorated
lib/apps/yclients/client/booking/web/pages/__init__.py:80 in open
lib/common/ui/pages/web.py:61 in decorated
lib/apps/yclients/client/booking/web/pages/__init__.py:41 in set_environment
lib/ui/selenium/webdriver/__init__.py:52 in execute_script
Seen in: - altegio/client.booking#224668 — shard 4 — launch 165208 (×1, last 2026-09-21 08:16 MSK)
WebDriverException — 1 occurrence(s) across 1 pipeline(s)¶
selenium.common.exceptions.WebDriverException: Message: <unknown>: Failed to read the 'localStorage' property from 'Window': Access is denied for this document.
(Session info: headless chrome=119.0.6045.199)
Stacktrace:
#0 0x55dccf21c5e3 <unknown>
#1 0x55dcceedf0b7 <unknown>
#2 0x55dcceee52b5 <unknown>
#3 0x55dcceee79b1 <unknown>
#4 0x55dccef7071f <unknown>
#5 0x55dccef53ef2 <unknown>
#6 0x55dccef6fb3d <unknown>
#7 0x55dccef53cc3 <unknown>
#8 0x55dccef1f0e4 <unknown>
#9 0x55dccef200ae <unknown>
#10 0x55dccf1e2ce1 <unknown>
#11 0x55dccf1e6b7e <unknown>
#12 0x55dccf1d04b5 <unknown>
#13 0x55dccf1e77d6 <unknown>
#14 0x55dccf1b3dbf <unknown>
#15 0x55dccf20a748 <unknown>
#16 0x55dccf20a917 <unknown>
#17 0x55dccf21b773 <unknown>
#18 0x7f97a35f5aa4 <unknown>
#19 0x7f97a3682a64 __clone
Stacktrace:
lib/common/ui/pages/web.py:61 in decorated
lib/apps/yclients/client/booking/web/pages/__init__.py:80 in open
lib/common/ui/pages/web.py:61 in decorated
lib/apps/yclients/client/booking/web/pages/__init__.py:41 in set_environment
lib/ui/selenium/webdriver/__init__.py:52 in execute_script
Seen in: - altegio/client.booking#224668 — shard 4 — launch 165208 (×1, last 2026-09-21 08:16 MSK)
WebDriverException — 1 occurrence(s) across 1 pipeline(s)¶
selenium.common.exceptions.WebDriverException: Message: <unknown>: Failed to read the 'localStorage' property from 'Window': Access is denied for this document.
(Session info: headless chrome=119.0.6045.199)
Stacktrace:
#0 0x558b1babe5e3 <unknown>
#1 0x558b1b7810b7 <unknown>
#2 0x558b1b7872b5 <unknown>
#3 0x558b1b7899b1 <unknown>
#4 0x558b1b81271f <unknown>
#5 0x558b1b7f5ef2 <unknown>
#6 0x558b1b811b3d <unknown>
#7 0x558b1b7f5cc3 <unknown>
#8 0x558b1b7c10e4 <unknown>
#9 0x558b1b7c20ae <unknown>
#10 0x558b1ba84ce1 <unknown>
#11 0x558b1ba88b7e <unknown>
#12 0x558b1ba724b5 <unknown>
#13 0x558b1ba897d6 <unknown>
#14 0x558b1ba55dbf <unknown>
#15 0x558b1baac748 <unknown>
#16 0x558b1baac917 <unknown>
#17 0x558b1babd773 <unknown>
#18 0x7f231ac26aa4 <unknown>
#19 0x7f231acb3a64 __clone
Stacktrace:
lib/common/ui/pages/web.py:61 in decorated
lib/apps/yclients/client/booking/web/pages/__init__.py:80 in open
lib/common/ui/pages/web.py:61 in decorated
lib/apps/yclients/client/booking/web/pages/__init__.py:41 in set_environment
lib/ui/selenium/webdriver/__init__.py:52 in execute_script
Seen in: - altegio/client.booking#224668 — shard 4 — launch 165208 (×1, last 2026-09-21 08:16 MSK)