Страница Личной информации. Нет фото, нет имени¶
test_personal_account_personal_information_page_no_photo_no_name
Failures in last 30 days: 14
Generated at 2026-10-08 03:48 MSK
Last failure: 2026-10-02 11:50 MSK
Filter: pipelines with sandbox_biz_erp ∈ {master, testops-dev} AND autotests_branch ∈ {master, main} only (testops-dev — daytime ticks since 2026-08-05).
By exception class:
- TimeoutException — 11
- WebDriverException — 3
Failure signatures (grouped by exception + full message):
TimeoutException — 11 occurrence(s) across 4 pipeline(s)¶
selenium.common.exceptions.TimeoutException: Message:
Stacktrace:
suite/yclients/client/booking/web/personal_account/test_personal_account.py:339 in test_personal_account_personal_information_page_no_photo_no_name
lib/common/ui/pages/web.py:61 in decorated
lib/common/ui/pages/web.py:646 in wait_for_value_in_db
lib/ui/selenium/webdriver/support/wait.py:28 in until
Seen in: - altegio/biz.erp#227787 — shard 2 — launch 171752 (×2, last 2026-10-02 11:50 MSK) - altegio/biz.erp#227749 — shard 5 — launch 171616 (×3, last 2026-10-02 08:20 MSK) - altegio/biz.erp#227735 — shard 3 — launch 171549 (×3, last 2026-10-02 06:23 MSK) - altegio/biz.erp#227722 — shard 5 — launch 171516 (×3, last 2026-10-02 04:26 MSK)
WebDriverException — 1 occurrence(s) across 1 pipeline(s)¶
selenium.common.exceptions.WebDriverException: Message: <unknown>: Failed to read the 'localStorage' property from 'Window': Access is denied for this document.
(Session info: headless chrome=119.0.6045.199)
Stacktrace:
#0 0x5650499e55e3 <unknown>
#1 0x5650496a80b7 <unknown>
#2 0x5650496ae2b5 <unknown>
#3 0x5650496b09b1 <unknown>
#4 0x56504973971f <unknown>
#5 0x56504971cef2 <unknown>
#6 0x565049738b3d <unknown>
#7 0x56504971ccc3 <unknown>
#8 0x5650496e80e4 <unknown>
#9 0x5650496e90ae <unknown>
#10 0x5650499abce1 <unknown>
#11 0x5650499afb7e <unknown>
#12 0x5650499994b5 <unknown>
#13 0x5650499b07d6 <unknown>
#14 0x56504997cdbf <unknown>
#15 0x5650499d3748 <unknown>
#16 0x5650499d3917 <unknown>
#17 0x5650499e4773 <unknown>
#18 0x7f49bea5baa4 <unknown>
#19 0x7f49beae8a64 __clone
Stacktrace:
lib/common/ui/pages/web.py:61 in decorated
lib/apps/yclients/client/booking/web/pages/__init__.py:80 in open
lib/common/ui/pages/web.py:61 in decorated
lib/apps/yclients/client/booking/web/pages/__init__.py:41 in set_environment
lib/ui/selenium/webdriver/__init__.py:52 in execute_script
Seen in: - altegio/client.booking#224668 — shard 6 — launch 165208 (×1, last 2026-09-21 08:16 MSK)
WebDriverException — 1 occurrence(s) across 1 pipeline(s)¶
selenium.common.exceptions.WebDriverException: Message: <unknown>: Failed to read the 'localStorage' property from 'Window': Access is denied for this document.
(Session info: headless chrome=119.0.6045.199)
Stacktrace:
#0 0x5590b21f35e3 <unknown>
#1 0x5590b1eb60b7 <unknown>
#2 0x5590b1ebc2b5 <unknown>
#3 0x5590b1ebe9b1 <unknown>
#4 0x5590b1f4771f <unknown>
#5 0x5590b1f2aef2 <unknown>
#6 0x5590b1f46b3d <unknown>
#7 0x5590b1f2acc3 <unknown>
#8 0x5590b1ef60e4 <unknown>
#9 0x5590b1ef70ae <unknown>
#10 0x5590b21b9ce1 <unknown>
#11 0x5590b21bdb7e <unknown>
#12 0x5590b21a74b5 <unknown>
#13 0x5590b21be7d6 <unknown>
#14 0x5590b218adbf <unknown>
#15 0x5590b21e1748 <unknown>
#16 0x5590b21e1917 <unknown>
#17 0x5590b21f2773 <unknown>
#18 0x7f1f760e3aa4 <unknown>
#19 0x7f1f76170a64 __clone
Stacktrace:
lib/common/ui/pages/web.py:61 in decorated
lib/apps/yclients/client/booking/web/pages/__init__.py:80 in open
lib/common/ui/pages/web.py:61 in decorated
lib/apps/yclients/client/booking/web/pages/__init__.py:41 in set_environment
lib/ui/selenium/webdriver/__init__.py:52 in execute_script
Seen in: - altegio/client.booking#224668 — shard 6 — launch 165208 (×1, last 2026-09-21 08:16 MSK)
WebDriverException — 1 occurrence(s) across 1 pipeline(s)¶
selenium.common.exceptions.WebDriverException: Message: <unknown>: Failed to read the 'localStorage' property from 'Window': Access is denied for this document.
(Session info: headless chrome=119.0.6045.199)
Stacktrace:
#0 0x5639c21be5e3 <unknown>
#1 0x5639c1e810b7 <unknown>
#2 0x5639c1e872b5 <unknown>
#3 0x5639c1e899b1 <unknown>
#4 0x5639c1f1271f <unknown>
#5 0x5639c1ef5ef2 <unknown>
#6 0x5639c1f11b3d <unknown>
#7 0x5639c1ef5cc3 <unknown>
#8 0x5639c1ec10e4 <unknown>
#9 0x5639c1ec20ae <unknown>
#10 0x5639c2184ce1 <unknown>
#11 0x5639c2188b7e <unknown>
#12 0x5639c21724b5 <unknown>
#13 0x5639c21897d6 <unknown>
#14 0x5639c2155dbf <unknown>
#15 0x5639c21ac748 <unknown>
#16 0x5639c21ac917 <unknown>
#17 0x5639c21bd773 <unknown>
#18 0x7f9f4519daa4 <unknown>
#19 0x7f9f4522aa64 __clone
Stacktrace:
lib/common/ui/pages/web.py:61 in decorated
lib/apps/yclients/client/booking/web/pages/__init__.py:80 in open
lib/common/ui/pages/web.py:61 in decorated
lib/apps/yclients/client/booking/web/pages/__init__.py:41 in set_environment
lib/ui/selenium/webdriver/__init__.py:52 in execute_script
Seen in: - altegio/client.booking#224668 — shard 6 — launch 165208 (×1, last 2026-09-21 08:16 MSK)