#69660 TC12 — Prepaid appointment keeps its online payment after a No-show cancellation¶
test_prepaid_late_cancel_no_show_state
Failures in last 30 days: 8
Generated at 2026-10-08 03:53 MSK
Last failure: 2026-10-02 11:50 MSK
Filter: pipelines with sandbox_biz_erp ∈ {master, testops-dev} AND autotests_branch ∈ {master, main} only (testops-dev — daytime ticks since 2026-08-05).
By exception class:
- SigninRedirectMissingError — 5
- TimeoutError — 3
Failure signatures (grouped by exception + full message):
SigninRedirectMissingError — 1 occurrence(s) across 1 pipeline(s)¶
autotests.lib.exception.SigninRedirectMissingError: login-XHR завершился со статусом 200, но редиректа со /signin/ не случилось за 30 с — подозрение на фронт biz.erp
--- причина (playwright) ---
Timeout 30000ms exceeded.
=========================== logs ===========================
waiting for navigation to "<function ImplToApiMapping.wrap_handler.<locals>.wrapper_func at 0x7fb32460b600>" until 'commit'
navigated to "https://erp-testops-dev.infra.altegio.cloud/signin/"
navigated to "https://erp-testops-dev.infra.altegio.cloud/signin/"
navigated to "https://erp-testops-dev.infra.altegio.cloud/signin/JTJGdGltZXRhYmxlJTJGMTYzNTc5MTMlMkY="
navigated to "https://erp-testops-dev.infra.altegio.cloud/signin/JTJGdGltZXRhYmxlJTJGMTYzNTc5MTMlMkY="
navigated to "https://erp-testops-dev.infra.altegio.cloud/signin/JTJGdGltZXRhYmxlJTJGMTYzNTc5MTMlMkY="
============================================================
Stacktrace:
suite/yclients/client/booking/web/cancel_with_membership/test_prepaid_no_show_pw.py:104 in test_prepaid_late_cancel_no_show_state
lib/apps_pw/yclients/biz/erp/web/pages/guest/signin.py:115 in sign_in
Seen in: - altegio/biz.erp#227722 — shard 5 — launch 171516 (×1, last 2026-10-02 04:26 MSK)
SigninRedirectMissingError — 1 occurrence(s) across 1 pipeline(s)¶
autotests.lib.exception.SigninRedirectMissingError: login-XHR завершился со статусом 200, но редиректа со /signin/ не случилось за 30 с — подозрение на фронт biz.erp
--- причина (playwright) ---
Timeout 30000ms exceeded.
=========================== logs ===========================
waiting for navigation to "<function ImplToApiMapping.wrap_handler.<locals>.wrapper_func at 0x7fbf166dbd80>" until 'commit'
navigated to "https://erp-testops-dev.infra.altegio.cloud/signin/"
navigated to "https://erp-testops-dev.infra.altegio.cloud/signin/"
navigated to "https://erp-testops-dev.infra.altegio.cloud/signin/JTJGdGltZXRhYmxlJTJGMTYzNjYwNjIlMkY="
navigated to "https://erp-testops-dev.infra.altegio.cloud/signin/JTJGdGltZXRhYmxlJTJGMTYzNjYwNjIlMkY="
navigated to "https://erp-testops-dev.infra.altegio.cloud/signin/JTJGdGltZXRhYmxlJTJGMTYzNjYwNjIlMkY="
============================================================
Stacktrace:
suite/yclients/client/booking/web/cancel_with_membership/test_prepaid_no_show_pw.py:104 in test_prepaid_late_cancel_no_show_state
lib/apps_pw/yclients/biz/erp/web/pages/guest/signin.py:115 in sign_in
Seen in: - altegio/biz.erp#227749 — shard 2 — launch 171616 (×1, last 2026-10-02 08:20 MSK)
SigninRedirectMissingError — 1 occurrence(s) across 1 pipeline(s)¶
autotests.lib.exception.SigninRedirectMissingError: login-XHR завершился со статусом 200, но редиректа со /signin/ не случилось за 30 с — подозрение на фронт biz.erp
--- причина (playwright) ---
Timeout 30000ms exceeded.
=========================== logs ===========================
waiting for navigation to "<function ImplToApiMapping.wrap_handler.<locals>.wrapper_func at 0x7f997c1071a0>" until 'commit'
navigated to "https://erp-testops-dev.infra.altegio.cloud/signin/"
navigated to "https://erp-testops-dev.infra.altegio.cloud/signin/"
navigated to "https://erp-testops-dev.infra.altegio.cloud/signin/JTJGdGltZXRhYmxlJTJGMTYzNjg3OTYlMkY="
navigated to "https://erp-testops-dev.infra.altegio.cloud/signin/JTJGdGltZXRhYmxlJTJGMTYzNjg3OTYlMkY="
navigated to "https://erp-testops-dev.infra.altegio.cloud/signin/JTJGdGltZXRhYmxlJTJGMTYzNjg3OTYlMkY="
============================================================
Stacktrace:
suite/yclients/client/booking/web/cancel_with_membership/test_prepaid_no_show_pw.py:104 in test_prepaid_late_cancel_no_show_state
lib/apps_pw/yclients/biz/erp/web/pages/guest/signin.py:115 in sign_in
Seen in: - altegio/biz.erp#227749 — shard 2 — launch 171616 (×1, last 2026-10-02 08:20 MSK)
SigninRedirectMissingError — 1 occurrence(s) across 1 pipeline(s)¶
autotests.lib.exception.SigninRedirectMissingError: login-XHR завершился со статусом 200, но редиректа со /signin/ не случилось за 30 с — подозрение на фронт biz.erp
--- причина (playwright) ---
Timeout 30000ms exceeded.
=========================== logs ===========================
waiting for navigation to "<function ImplToApiMapping.wrap_handler.<locals>.wrapper_func at 0x7f97cc5a25c0>" until 'commit'
navigated to "https://erp-testops-dev.infra.altegio.cloud/signin/"
navigated to "https://erp-testops-dev.infra.altegio.cloud/signin/"
navigated to "https://erp-testops-dev.infra.altegio.cloud/signin/JTJGdGltZXRhYmxlJTJGMTYzNjk0MDIlMkY="
navigated to "https://erp-testops-dev.infra.altegio.cloud/signin/JTJGdGltZXRhYmxlJTJGMTYzNjk0MDIlMkY="
navigated to "https://erp-testops-dev.infra.altegio.cloud/signin/JTJGdGltZXRhYmxlJTJGMTYzNjk0MDIlMkY="
============================================================
Stacktrace:
suite/yclients/client/booking/web/cancel_with_membership/test_prepaid_no_show_pw.py:104 in test_prepaid_late_cancel_no_show_state
lib/apps_pw/yclients/biz/erp/web/pages/guest/signin.py:115 in sign_in
Seen in: - altegio/biz.erp#227787 — shard 1 — launch 171752 (×1, last 2026-10-02 11:50 MSK)
SigninRedirectMissingError — 1 occurrence(s) across 1 pipeline(s)¶
autotests.lib.exception.SigninRedirectMissingError: login-XHR завершился со статусом 200, но редиректа со /signin/ не случилось за 30 с — подозрение на фронт biz.erp
--- причина (playwright) ---
Timeout 30000ms exceeded.
=========================== logs ===========================
waiting for navigation to "<function ImplToApiMapping.wrap_handler.<locals>.wrapper_func at 0x7f1ddc7fbe20>" until 'commit'
navigated to "https://erp-testops-dev.infra.altegio.cloud/signin/"
navigated to "https://erp-testops-dev.infra.altegio.cloud/signin/"
navigated to "https://erp-testops-dev.infra.altegio.cloud/signin/JTJGdGltZXRhYmxlJTJGMTYzNzExNzElMkY="
navigated to "https://erp-testops-dev.infra.altegio.cloud/signin/JTJGdGltZXRhYmxlJTJGMTYzNzExNzElMkY="
navigated to "https://erp-testops-dev.infra.altegio.cloud/signin/JTJGdGltZXRhYmxlJTJGMTYzNzExNzElMkY="
============================================================
Stacktrace:
suite/yclients/client/booking/web/cancel_with_membership/test_prepaid_no_show_pw.py:104 in test_prepaid_late_cancel_no_show_state
lib/apps_pw/yclients/biz/erp/web/pages/guest/signin.py:115 in sign_in
Seen in: - altegio/biz.erp#227787 — shard 1 — launch 171752 (×1, last 2026-10-02 11:50 MSK)
TimeoutError — 1 occurrence(s) across 1 pipeline(s)¶
playwright._impl._errors.TimeoutError: Locator.click: Timeout 30000ms exceeded.
Call log:
- waiting for locator("[class*=\"erp-nav-menu-mode-switch-footer-button\"]:visible, [class*=\"erp-nav-menu-mode-switch-mini__button\"]:visible").first
- locator resolved to <div data-locator="nav_menu_mode_switch_btn" class="erp-nav-menu-mode-switch-footer-button">…</div>
- attempting click action
2 × waiting for element to be visible, enabled and stable
- element is visible, enabled and stable
- scrolling into view if needed
- done scrolling
- <div class="v-error-modal v-error-modal--unauthorized">…</div> intercepts pointer events
- retrying click action
- waiting 20ms
2 × waiting for element to be visible, enabled and stable
- element is visible, enabled and stable
- scrolling into view if needed
- done scrolling
- <div class="v-error-modal v-error-modal--unauthorized">…</div> intercepts pointer events
- retrying click action
- waiting 100ms
56 × waiting for element to be visible, enabled and stable
- element is visible, enabled and stable
- scrolling into view if needed
- done scrolling
- <div class="v-error-modal v-error-modal--unauthorized">…</div> intercepts pointer events
- retrying click action
- waiting 500ms
AssertionError: Failed to navigate through menu item MENU_ITEM_CLIENTS_DB. Browser diagnostics:
{
"url": "https://erp-testops-dev.infra.altegio.cloud/c/bx0X4/DLzGo?",
"observer": {
"installed": true,
"first_js_error": null,
"js_errors": [],
"js_errors_by_location": {},
"xhr_queue": []
},
"page_errors": [],
"console": [
{
"type": "warning",
"text": "Web Vitals polyfill required",
"location": {
"url": "https://erp-testops-dev.infra.altegio.cloud/js/vue-vite-app/chunk-a6Oo9G3y2.js",
"lineNumber": 0,
"columnNumber": 11968
}
},
{
"type": "error",
"text": "Access to image at 'https://a.tile.openstreetmap.org/15/16384/16384.png' from origin 'https://erp-testops-dev.infra.altegio.cloud' has been blocked by CORS policy: Request header field accept-language is not allowed by Access-Control-Allow-Headers in preflight response.",
"location": {
"url": "https://erp-testops-dev.infra.altegio.cloud/c/bx0X4/DLzGo?",
"lineNumber": 0,
"columnNumber": 0
}
},
{
"type": "error",
"text": "Failed to load resource: net::ERR_FAILED",
"location": {
"url": "https://a.tile.openstreetmap.org/15/16384/16384.png",
"lineNumber": 0,
"columnNumber": 0
}
},
{
"type": "error",
"text": "Access to image at 'https://a.tile.openstreetmap.org/15/16383/16383.png' from origin 'https://erp-testops-dev.infra.altegio.cloud' has been blocked by CORS policy: Request header field accept-language is not allowed by Access-Control-Allow-Headers in preflight response.",
"location": {
"url": "https://erp-testops-dev.infra.altegio.cloud/c/bx0X4/DLzGo?",
"lineNumber": 0,
"columnNumber": 0
}
},
{
"type": "error",
"text": "Failed to load resource: net::ERR_FAILED",
"location": {
"url": "https://a.tile.openstreetmap.org/15/16383/16383.png",
"lineNumber": 0,
"columnNumber": 0
}
},
{
"type": "error",
"text": "Access to image at 'https://c.tile.openstreetmap.org/15/16384/16383.png' from origin 'https://erp-testops-dev.infra.altegio.cloud' has been blocked by CORS policy: Request header field accept-language is not allowed by Access-Control-Allow-Headers in preflight response.",
"location": {
"url": "https://erp-testops-dev.infra.altegio.cloud/c/bx0X4/DLzGo?",
"lineNumber": 0,
"columnNumber": 0
}
},
{
"type": "error",
"text": "Failed to load resource: net::ERR_FAILED",
"location": {
... [truncated]
Stacktrace:
lib/apps_pw/yclients/biz/erp/web/components/menu.py:214 in click_menu
lib/apps_pw/yclients/biz/erp/web/components/menu.py:228 in _click_menu
lib/apps_pw/yclients/biz/erp/web/pages/user.py:464 in _ensure_administration_mode_for_legacy_menu
suite/yclients/client/booking/web/cancel_with_membership/test_prepaid_no_show_pw.py:142 in test_prepaid_late_cancel_no_show_state
lib/apps_pw/yclients/biz/erp/web/components/menu.py:216 in click_menu
Seen in: - altegio/biz.erp#227722 — shard 5 — launch 171516 (×1, last 2026-10-02 04:26 MSK)
TimeoutError — 1 occurrence(s) across 1 pipeline(s)¶
playwright._impl._errors.TimeoutError: Locator.click: Timeout 30000ms exceeded.
Call log:
- waiting for locator("[class*=\"erp-nav-menu-mode-switch-footer-button\"]:visible, [class*=\"erp-nav-menu-mode-switch-mini__button\"]:visible").first
- locator resolved to <div data-locator="nav_menu_mode_switch_btn" class="erp-nav-menu-mode-switch-footer-button">…</div>
- attempting click action
2 × waiting for element to be visible, enabled and stable
- element is visible, enabled and stable
- scrolling into view if needed
- done scrolling
- <div class="v-error-modal v-error-modal--unauthorized">…</div> intercepts pointer events
- retrying click action
- waiting 20ms
2 × waiting for element to be visible, enabled and stable
- element is visible, enabled and stable
- scrolling into view if needed
- done scrolling
- <div class="v-error-modal v-error-modal--unauthorized">…</div> intercepts pointer events
- retrying click action
- waiting 100ms
56 × waiting for element to be visible, enabled and stable
- element is visible, enabled and stable
- scrolling into view if needed
- done scrolling
- <div class="v-error-modal v-error-modal--unauthorized">…</div> intercepts pointer events
- retrying click action
- waiting 500ms
AssertionError: Failed to navigate through menu item MENU_ITEM_CLIENTS_DB. Browser diagnostics:
{
"url": "https://erp-testops-dev.infra.altegio.cloud/c/bx1cw/CHyGO?",
"observer": {
"installed": true,
"first_js_error": null,
"js_errors": [],
"js_errors_by_location": {},
"xhr_queue": []
},
"page_errors": [],
"console": [
{
"type": "warning",
"text": "Web Vitals polyfill required",
"location": {
"url": "https://erp-testops-dev.infra.altegio.cloud/js/vue-vite-app/chunk-a6Oo9G3y2.js",
"lineNumber": 0,
"columnNumber": 11968
}
},
{
"type": "error",
"text": "Access to image at 'https://a.tile.openstreetmap.org/15/16384/16384.png' from origin 'https://erp-testops-dev.infra.altegio.cloud' has been blocked by CORS policy: Request header field accept-language is not allowed by Access-Control-Allow-Headers in preflight response.",
"location": {
"url": "https://erp-testops-dev.infra.altegio.cloud/c/bx1cw/CHyGO?",
"lineNumber": 0,
"columnNumber": 0
}
},
{
"type": "error",
"text": "Failed to load resource: net::ERR_FAILED",
"location": {
"url": "https://a.tile.openstreetmap.org/15/16384/16384.png",
"lineNumber": 0,
"columnNumber": 0
}
},
{
"type": "error",
"text": "Access to image at 'https://a.tile.openstreetmap.org/15/16383/16383.png' from origin 'https://erp-testops-dev.infra.altegio.cloud' has been blocked by CORS policy: Request header field accept-language is not allowed by Access-Control-Allow-Headers in preflight response.",
"location": {
"url": "https://erp-testops-dev.infra.altegio.cloud/c/bx1cw/CHyGO?",
"lineNumber": 0,
"columnNumber": 0
}
},
{
"type": "error",
"text": "Failed to load resource: net::ERR_FAILED",
"location": {
"url": "https://a.tile.openstreetmap.org/15/16383/16383.png",
"lineNumber": 0,
"columnNumber": 0
}
},
{
"type": "error",
"text": "Access to image at 'https://c.tile.openstreetmap.org/15/16384/16383.png' from origin 'https://erp-testops-dev.infra.altegio.cloud' has been blocked by CORS policy: Request header field accept-language is not allowed by Access-Control-Allow-Headers in preflight response.",
"location": {
"url": "https://erp-testops-dev.infra.altegio.cloud/c/bx1cw/CHyGO?",
"lineNumber": 0,
"columnNumber": 0
}
},
{
"type": "error",
"text": "Failed to load resource: net::ERR_FAILED",
"location": {
... [truncated]
Stacktrace:
lib/apps_pw/yclients/biz/erp/web/components/menu.py:214 in click_menu
lib/apps_pw/yclients/biz/erp/web/components/menu.py:228 in _click_menu
lib/apps_pw/yclients/biz/erp/web/pages/user.py:464 in _ensure_administration_mode_for_legacy_menu
suite/yclients/client/booking/web/cancel_with_membership/test_prepaid_no_show_pw.py:142 in test_prepaid_late_cancel_no_show_state
lib/apps_pw/yclients/biz/erp/web/components/menu.py:216 in click_menu
Seen in: - altegio/biz.erp#227722 — shard 5 — launch 171516 (×1, last 2026-10-02 04:26 MSK)
TimeoutError — 1 occurrence(s) across 1 pipeline(s)¶
playwright._impl._errors.TimeoutError: Locator.click: Timeout 30000ms exceeded.
Call log:
- waiting for locator("[class*=\"erp-nav-menu-mode-switch-footer-button\"]:visible, [class*=\"erp-nav-menu-mode-switch-mini__button\"]:visible").first
- locator resolved to <div data-locator="nav_menu_mode_switch_btn" class="erp-nav-menu-mode-switch-footer-button">…</div>
- attempting click action
2 × waiting for element to be visible, enabled and stable
- element is visible, enabled and stable
- scrolling into view if needed
- done scrolling
- <div class="v-error-modal v-error-modal--unauthorized">…</div> intercepts pointer events
- retrying click action
- waiting 20ms
2 × waiting for element to be visible, enabled and stable
- element is visible, enabled and stable
- scrolling into view if needed
- done scrolling
- <div class="v-error-modal v-error-modal--unauthorized">…</div> intercepts pointer events
- retrying click action
- waiting 100ms
56 × waiting for element to be visible, enabled and stable
- element is visible, enabled and stable
- scrolling into view if needed
- done scrolling
- <div class="v-error-modal v-error-modal--unauthorized">…</div> intercepts pointer events
- retrying click action
- waiting 500ms
AssertionError: Failed to navigate through menu item MENU_ITEM_CLIENTS_DB. Browser diagnostics:
{
"url": "https://erp-testops-dev.infra.altegio.cloud/c/bx2qD/InNuH?",
"observer": {
"installed": true,
"first_js_error": null,
"js_errors": [],
"js_errors_by_location": {},
"xhr_queue": []
},
"page_errors": [],
"console": [
{
"type": "warning",
"text": "Web Vitals polyfill required",
"location": {
"url": "https://erp-testops-dev.infra.altegio.cloud/js/vue-vite-app/chunk-a6Oo9G3y2.js",
"lineNumber": 0,
"columnNumber": 11968
}
},
{
"type": "error",
"text": "Access to image at 'https://c.tile.openstreetmap.org/15/16384/16383.png' from origin 'https://erp-testops-dev.infra.altegio.cloud' has been blocked by CORS policy: Request header field accept-language is not allowed by Access-Control-Allow-Headers in preflight response.",
"location": {
"url": "https://erp-testops-dev.infra.altegio.cloud/c/bx2qD/InNuH?",
"lineNumber": 0,
"columnNumber": 0
}
},
{
"type": "error",
"text": "Failed to load resource: net::ERR_FAILED",
"location": {
"url": "https://c.tile.openstreetmap.org/15/16384/16383.png",
"lineNumber": 0,
"columnNumber": 0
}
},
{
"type": "error",
"text": "Access to image at 'https://b.tile.openstreetmap.org/15/16383/16384.png' from origin 'https://erp-testops-dev.infra.altegio.cloud' has been blocked by CORS policy: Request header field accept-language is not allowed by Access-Control-Allow-Headers in preflight response.",
"location": {
"url": "https://erp-testops-dev.infra.altegio.cloud/c/bx2qD/InNuH?",
"lineNumber": 0,
"columnNumber": 0
}
},
{
"type": "error",
"text": "Failed to load resource: net::ERR_FAILED",
"location": {
"url": "https://b.tile.openstreetmap.org/15/16383/16384.png",
"lineNumber": 0,
"columnNumber": 0
}
},
{
"type": "error",
"text": "Access to image at 'https://a.tile.openstreetmap.org/15/16383/16383.png' from origin 'https://erp-testops-dev.infra.altegio.cloud' has been blocked by CORS policy: Request header field accept-language is not allowed by Access-Control-Allow-Headers in preflight response.",
"location": {
"url": "https://erp-testops-dev.infra.altegio.cloud/c/bx2qD/InNuH?",
"lineNumber": 0,
"columnNumber": 0
}
},
{
"type": "error",
"text": "Failed to load resource: net::ERR_FAILED",
"location": {
... [truncated]
Stacktrace:
lib/apps_pw/yclients/biz/erp/web/components/menu.py:214 in click_menu
lib/apps_pw/yclients/biz/erp/web/components/menu.py:228 in _click_menu
lib/apps_pw/yclients/biz/erp/web/pages/user.py:464 in _ensure_administration_mode_for_legacy_menu
suite/yclients/client/booking/web/cancel_with_membership/test_prepaid_no_show_pw.py:142 in test_prepaid_late_cancel_no_show_state
lib/apps_pw/yclients/biz/erp/web/components/menu.py:216 in click_menu
Seen in: - altegio/biz.erp#227749 — shard 2 — launch 171616 (×1, last 2026-10-02 08:20 MSK)