Skip to content

#57583 Privacy: confirming a data-blocking request goes through

POST /api/v1/user/gdpr/blocking_request and the status/date come from the
server response

test_privacy_data_blocking_request_reflects_server_response

Failures in last 30 days: 6

Generated at 2026-10-08 03:48 MSK

Last failure: 2026-10-02 11:50 MSK

Filter: pipelines with sandbox_biz_erp ∈ {master, testops-dev} AND autotests_branch ∈ {master, main} only (testops-dev — daytime ticks since 2026-08-05).

🏥 3 of these ran under the quarantine tier: XFAIL, pipeline stayed green, excluded from the red statistics and incidents (see Карантин).

By exception class: - SigninRedirectMissingError — 3 - TimeoutError — 1 - AssertionError — 1 - KeyError — 1

Failure signatures (grouped by exception + full message):

AssertionError — 1 occurrence(s) across 1 pipeline(s)

AssertionError: The «Data blocking request» button must be present
Actual value: None
Error: element(s) not found
Call log:
  - Expect "to_be_visible" with timeout 30000ms
  - waiting for locator("[data-locator=\"personal_account_privacy_block_btn\"]")

Stacktrace:

suite/yclients/biz/erp/web/personal_account/test_privacy_block_request_pw.py:61 in test_privacy_data_blocking_request_reflects_server_response

Seen in: - altegio/biz.erp#227596 — shard 4 — launch 171280 (×1, last 2026-10-01 17:40 MSK)

🏥 KeyError — 1 occurrence(s) across 1 pipeline(s)

KeyError: 'salon_with_entities'

Seen in: - altegio/biz.erp#227787 — shard 4 — launch 171752 (×1, last 2026-10-02 11:50 MSK)

SigninRedirectMissingError — 1 occurrence(s) across 1 pipeline(s)

autotests.lib.exception.SigninRedirectMissingError: login-XHR завершился со статусом 200, но редиректа со /signin/ не случилось за 30 с — подозрение на фронт biz.erp
--- причина (playwright) ---
Timeout 30000ms exceeded.
=========================== logs ===========================
waiting for navigation to "<function ImplToApiMapping.wrap_handler.<locals>.wrapper_func at 0x7f03bc20a480>" until 'commit'
  navigated to "https://erp-testops-dev.infra.altegio.cloud/signin/"
  navigated to "https://erp-testops-dev.infra.altegio.cloud/signin/"
  navigated to "https://erp-testops-dev.infra.altegio.cloud/signin/JTJGdGltZXRhYmxlJTJGMTYzNTYzODMlMkY="
  navigated to "https://erp-testops-dev.infra.altegio.cloud/signin/JTJGdGltZXRhYmxlJTJGMTYzNTYzODMlMkY="
  navigated to "https://erp-testops-dev.infra.altegio.cloud/signin/JTJGdGltZXRhYmxlJTJGMTYzNTYzODMlMkY="
============================================================

Stacktrace:

suite/yclients/biz/erp/web/personal_account/test_privacy_block_request_pw.py:45 in test_privacy_data_blocking_request_reflects_server_response
lib/apps_pw/yclients/biz/erp/web/pages/guest/signin.py:115 in sign_in

Seen in: - altegio/biz.erp#227596 — shard 4 — launch 171280 (×1, last 2026-10-01 17:40 MSK)

🏥 SigninRedirectMissingError — 1 occurrence(s) across 1 pipeline(s)

autotests.lib.exception.SigninRedirectMissingError: login-XHR завершился со статусом 200, но редиректа со /signin/ не случилось за 30 с — подозрение на фронт biz.erp
--- причина (playwright) ---
Timeout 30000ms exceeded.
=========================== logs ===========================
waiting for navigation to "<function ImplToApiMapping.wrap_handler.<locals>.wrapper_func at 0x7f74b3665ee0>" until 'commit'
  navigated to "https://erp-testops-dev.infra.altegio.cloud/signin/"
  navigated to "https://erp-testops-dev.infra.altegio.cloud/signin/"
  navigated to "https://erp-testops-dev.infra.altegio.cloud/signin/JTJGdGltZXRhYmxlJTJGMTYzNTgzNjAlMkY="
  navigated to "https://erp-testops-dev.infra.altegio.cloud/signin/JTJGdGltZXRhYmxlJTJGMTYzNTgzNjAlMkY="
  navigated to "https://erp-testops-dev.infra.altegio.cloud/signin/JTJGdGltZXRhYmxlJTJGMTYzNTgzNjAlMkY="
============================================================

Stacktrace:

suite/yclients/biz/erp/web/personal_account/test_privacy_block_request_pw.py:45 in test_privacy_data_blocking_request_reflects_server_response
lib/apps_pw/yclients/biz/erp/web/pages/guest/signin.py:115 in sign_in

Seen in: - altegio/biz.erp#227722 — shard 5 — launch 171516 (×1, last 2026-10-02 04:26 MSK)

🏥 SigninRedirectMissingError — 1 occurrence(s) across 1 pipeline(s)

autotests.lib.exception.SigninRedirectMissingError: login-XHR завершился со статусом 200, но редиректа со /signin/ не случилось за 30 с — подозрение на фронт biz.erp
--- причина (playwright) ---
Timeout 30000ms exceeded.
=========================== logs ===========================
waiting for navigation to "<function ImplToApiMapping.wrap_handler.<locals>.wrapper_func at 0x7f8bcbfda160>" until 'commit'
  navigated to "https://erp-testops-dev.infra.altegio.cloud/signin/"
  navigated to "https://erp-testops-dev.infra.altegio.cloud/signin/"
  navigated to "https://erp-testops-dev.infra.altegio.cloud/signin/JTJGdGltZXRhYmxlJTJGMTYzNjYzMDElMkY="
  navigated to "https://erp-testops-dev.infra.altegio.cloud/signin/JTJGdGltZXRhYmxlJTJGMTYzNjYzMDElMkY="
  navigated to "https://erp-testops-dev.infra.altegio.cloud/signin/JTJGdGltZXRhYmxlJTJGMTYzNjYzMDElMkY="
============================================================

Stacktrace:

suite/yclients/biz/erp/web/personal_account/test_privacy_block_request_pw.py:45 in test_privacy_data_blocking_request_reflects_server_response
lib/apps_pw/yclients/biz/erp/web/pages/guest/signin.py:115 in sign_in

Seen in: - altegio/biz.erp#227749 — shard 8 — launch 171616 (×1, last 2026-10-02 08:20 MSK)

TimeoutError — 1 occurrence(s) across 1 pipeline(s)

playwright._impl._errors.TimeoutError: Locator.click: Timeout 30000ms exceeded.
Call log:
  - waiting for locator("[data-locator=\"personal_account_privacy_block_btn\"]")
    - locator resolved to <button tabindex="0" type="button" data-v-d8a56753="" data-locator="personal_account_privacy_block_btn" class="q-btn q-btn-item non-selectable no-outline q-btn--standard q-btn--rectangle q-btn--actionable q-focusable q-hoverable q-btn--no-uppercase yc-btn yc-btn_variant-tertiary yc-btn_small yc-btn_default yc-btn_align-center yc-btn">…</button>
  - attempting click action
    2 × waiting for element to be visible, enabled and stable
      - element is visible, enabled and stable
      - scrolling into view if needed
      - done scrolling
      - <div class="v-error-modal v-error-modal--unauthorized v-error-modal__fade-enter-active v-error-modal__fade-enter-to">…</div> intercepts pointer events
    - retrying click action
    - waiting 20ms
    2 × waiting for element to be visible, enabled and stable
      - element is visible, enabled and stable
      - scrolling into view if needed
      - done scrolling
      - <div class="v-error-modal v-error-modal--unauthorized v-error-modal__fade-enter-active v-error-modal__fade-enter-to">…</div> intercepts pointer events
    - retrying click action
      - waiting 100ms
    58 × waiting for element to be visible, enabled and stable
       - element is visible, enabled and stable
       - scrolling into view if needed
       - done scrolling
       - <div class="v-error-modal v-error-modal--unauthorized">…</div> intercepts pointer events
     - retrying click action
       - waiting 500ms

Stacktrace:

suite/yclients/biz/erp/web/personal_account/test_privacy_block_request_pw.py:62 in test_privacy_data_blocking_request_reflects_server_response
lib/apps_pw/yclients/biz/erp/web/pages/__init__.py:77 in decorated
lib/apps_pw/yclients/biz/erp/web/pages/personal_account.py:588 in open_block_modal

Seen in: - altegio/biz.erp#227596 — shard 4 — launch 171280 (×1, last 2026-10-01 17:40 MSK)