Skip to content

#1856 Боковая панель. Добавление изображения в модальном окне клиента

test_sidebar_adding_picture_in_client_card

Failures in last 30 days: 19

Generated at 2026-10-08 03:48 MSK

Last failure: 2026-10-07 05:34 MSK

Filter: pipelines with sandbox_biz_erp ∈ {master, testops-dev} AND autotests_branch ∈ {master, main} only (testops-dev — daytime ticks since 2026-08-05).

By exception class: - SigninRedirectMissingError — 9 - TimeoutError — 8 - AssertionError — 1 - KeyError — 1

Failure signatures (grouped by exception + full message):

TimeoutError — 5 occurrence(s) across 3 pipeline(s)

playwright._impl._errors.TimeoutError: Locator.get_attribute: Timeout 30000ms exceeded.
Call log:
  - waiting for locator("[data-locator=\"v_sidebar_body\"]").locator("[data-locator=\"client_profile_avatar_preview_image\"]").first

Stacktrace:

suite/yclients/biz/erp/web/client_base/test_client_card_pw.py:221 in test_sidebar_adding_picture_in_client_card
lib/apps_pw/yclients/biz/erp/web/pages/popup/tabs/clients.py:37 in test_images_are_equal

Seen in: - altegio/biz.erp#229100 — shard 4 — launch 173738 (×1, last 2026-10-07 05:34 MSK) - altegio/biz.erp#222801 — shard 3 — launch 160842 (×1, last 2026-09-10 16:29 MSK) - altegio/biz.erp#222500 — shard 4 — launch 159630 (×3, last 2026-09-09 07:41 MSK)

AssertionError — 1 occurrence(s) across 1 pipeline(s)

AssertionError: Неверное значение в поле Имя
Expected: 'Eileen'
     but: was ''

Stacktrace:

suite/yclients/biz/erp/web/client_base/test_client_card_pw.py:215 in test_sidebar_adding_picture_in_client_card
lib/utils/hamcrest/__init__.py:20 in assert_that
lib/utils/hamcrest/__init__.py:35 in _assert_match

Seen in: - altegio/biz.erp#227596 — shard 6 — launch 171280 (×1, last 2026-10-01 17:40 MSK)

KeyError — 1 occurrence(s) across 1 pipeline(s)

KeyError: 'salon_with_entities'

Seen in: - altegio/biz.erp#227787 — shard 4 — launch 171752 (×1, last 2026-10-02 11:50 MSK)

SigninRedirectMissingError — 1 occurrence(s) across 1 pipeline(s)

autotests.lib.exception.SigninRedirectMissingError: login-XHR завершился со статусом 200, но редиректа со /signin/ не случилось за 30 с — подозрение на фронт biz.erp
--- причина (playwright) ---
Timeout 30000ms exceeded.
=========================== logs ===========================
waiting for navigation to "<function ImplToApiMapping.wrap_handler.<locals>.wrapper_func at 0x7ffac44ed8a0>" until 'commit'
  navigated to "https://erp-testops-dev.infra.altegio.cloud/signin/"
  navigated to "https://erp-testops-dev.infra.altegio.cloud/signin/"
  navigated to "https://erp-testops-dev.infra.altegio.cloud/signin/JTJGdGltZXRhYmxlJTJGMTYzNTg1OTElMkY="
  navigated to "https://erp-testops-dev.infra.altegio.cloud/signin/JTJGdGltZXRhYmxlJTJGMTYzNTg1OTElMkY="
  navigated to "https://erp-testops-dev.infra.altegio.cloud/signin/JTJGdGltZXRhYmxlJTJGMTYzNTg1OTElMkY="
============================================================

Stacktrace:

suite/yclients/biz/erp/web/client_base/test_client_card_pw.py:144 in test_sidebar_adding_picture_in_client_card
lib/apps_pw/yclients/biz/erp/web/pages/guest/signin.py:115 in sign_in

Seen in: - altegio/biz.erp#227722 — shard 2 — launch 171516 (×1, last 2026-10-02 04:26 MSK)

SigninRedirectMissingError — 1 occurrence(s) across 1 pipeline(s)

autotests.lib.exception.SigninRedirectMissingError: login-XHR завершился со статусом 200, но редиректа со /signin/ не случилось за 30 с — подозрение на фронт biz.erp
--- причина (playwright) ---
Timeout 30000ms exceeded.
=========================== logs ===========================
waiting for navigation to "<function ImplToApiMapping.wrap_handler.<locals>.wrapper_func at 0x7f81a461ca40>" until 'commit'
  navigated to "https://erp-testops-dev.infra.altegio.cloud/signin/"
  navigated to "https://erp-testops-dev.infra.altegio.cloud/signin/"
  navigated to "https://erp-testops-dev.infra.altegio.cloud/signin/JTJGdGltZXRhYmxlJTJGMTYzNTk3NTElMkY="
  navigated to "https://erp-testops-dev.infra.altegio.cloud/signin/JTJGdGltZXRhYmxlJTJGMTYzNTk3NTElMkY="
  navigated to "https://erp-testops-dev.infra.altegio.cloud/signin/JTJGdGltZXRhYmxlJTJGMTYzNTk3NTElMkY="
============================================================

Stacktrace:

suite/yclients/biz/erp/web/client_base/test_client_card_pw.py:144 in test_sidebar_adding_picture_in_client_card
lib/apps_pw/yclients/biz/erp/web/pages/guest/signin.py:115 in sign_in

Seen in: - altegio/biz.erp#227722 — shard 2 — launch 171516 (×1, last 2026-10-02 04:26 MSK)

SigninRedirectMissingError — 1 occurrence(s) across 1 pipeline(s)

autotests.lib.exception.SigninRedirectMissingError: login-XHR завершился со статусом 200, но редиректа со /signin/ не случилось за 30 с — подозрение на фронт biz.erp
--- причина (playwright) ---
Timeout 30000ms exceeded.
=========================== logs ===========================
waiting for navigation to "<function ImplToApiMapping.wrap_handler.<locals>.wrapper_func at 0x7f4e4882ea20>" until 'commit'
  navigated to "https://erp-testops-dev.infra.altegio.cloud/signin/"
  navigated to "https://erp-testops-dev.infra.altegio.cloud/signin/"
  navigated to "https://erp-testops-dev.infra.altegio.cloud/signin/JTJGdGltZXRhYmxlJTJGMTYzNjI3ODglMkY="
  navigated to "https://erp-testops-dev.infra.altegio.cloud/signin/JTJGdGltZXRhYmxlJTJGMTYzNjI3ODglMkY="
  navigated to "https://erp-testops-dev.infra.altegio.cloud/signin/JTJGdGltZXRhYmxlJTJGMTYzNjI3ODglMkY="
============================================================

Stacktrace:

suite/yclients/biz/erp/web/client_base/test_client_card_pw.py:144 in test_sidebar_adding_picture_in_client_card
lib/apps_pw/yclients/biz/erp/web/pages/guest/signin.py:115 in sign_in

Seen in: - altegio/biz.erp#227735 — shard 4 — launch 171549 (×1, last 2026-10-02 06:23 MSK)

SigninRedirectMissingError — 1 occurrence(s) across 1 pipeline(s)

autotests.lib.exception.SigninRedirectMissingError: login-XHR завершился со статусом 200, но редиректа со /signin/ не случилось за 30 с — подозрение на фронт biz.erp
--- причина (playwright) ---
Timeout 30000ms exceeded.
=========================== logs ===========================
waiting for navigation to "<function ImplToApiMapping.wrap_handler.<locals>.wrapper_func at 0x7fc51433a2a0>" until 'commit'
  navigated to "https://erp-testops-dev.infra.altegio.cloud/signin/"
  navigated to "https://erp-testops-dev.infra.altegio.cloud/signin/"
  navigated to "https://erp-testops-dev.infra.altegio.cloud/signin/JTJGdGltZXRhYmxlJTJGMTYzNjM5ODMlMkY="
  navigated to "https://erp-testops-dev.infra.altegio.cloud/signin/JTJGdGltZXRhYmxlJTJGMTYzNjM5ODMlMkY="
  navigated to "https://erp-testops-dev.infra.altegio.cloud/signin/JTJGdGltZXRhYmxlJTJGMTYzNjM5ODMlMkY="
============================================================

Stacktrace:

suite/yclients/biz/erp/web/client_base/test_client_card_pw.py:144 in test_sidebar_adding_picture_in_client_card
lib/apps_pw/yclients/biz/erp/web/pages/guest/signin.py:115 in sign_in

Seen in: - altegio/biz.erp#227735 — shard 4 — launch 171549 (×1, last 2026-10-02 06:23 MSK)

SigninRedirectMissingError — 1 occurrence(s) across 1 pipeline(s)

autotests.lib.exception.SigninRedirectMissingError: login-XHR завершился со статусом 200, но редиректа со /signin/ не случилось за 30 с — подозрение на фронт biz.erp
--- причина (playwright) ---
Timeout 30000ms exceeded.
=========================== logs ===========================
waiting for navigation to "<function ImplToApiMapping.wrap_handler.<locals>.wrapper_func at 0x7faf5825d760>" until 'commit'
  navigated to "https://erp-testops-dev.infra.altegio.cloud/signin/"
  navigated to "https://erp-testops-dev.infra.altegio.cloud/signin/"
  navigated to "https://erp-testops-dev.infra.altegio.cloud/signin/JTJGdGltZXRhYmxlJTJGMTYzNjUwNDclMkY="
  navigated to "https://erp-testops-dev.infra.altegio.cloud/signin/JTJGdGltZXRhYmxlJTJGMTYzNjUwNDclMkY="
  navigated to "https://erp-testops-dev.infra.altegio.cloud/signin/JTJGdGltZXRhYmxlJTJGMTYzNjUwNDclMkY="
============================================================

Stacktrace:

suite/yclients/biz/erp/web/client_base/test_client_card_pw.py:144 in test_sidebar_adding_picture_in_client_card
lib/apps_pw/yclients/biz/erp/web/pages/guest/signin.py:115 in sign_in

Seen in: - altegio/biz.erp#227735 — shard 4 — launch 171549 (×1, last 2026-10-02 06:23 MSK)

SigninRedirectMissingError — 1 occurrence(s) across 1 pipeline(s)

autotests.lib.exception.SigninRedirectMissingError: login-XHR завершился со статусом 200, но редиректа со /signin/ не случилось за 30 с — подозрение на фронт biz.erp
--- причина (playwright) ---
Timeout 30000ms exceeded.
=========================== logs ===========================
waiting for navigation to "<function ImplToApiMapping.wrap_handler.<locals>.wrapper_func at 0x7f4a3dc4e660>" until 'commit'
  navigated to "https://erp-testops-dev.infra.altegio.cloud/signin/"
  navigated to "https://erp-testops-dev.infra.altegio.cloud/signin/"
  navigated to "https://erp-testops-dev.infra.altegio.cloud/signin/JTJGdGltZXRhYmxlJTJGMTYzNjU4MzclMkY="
  navigated to "https://erp-testops-dev.infra.altegio.cloud/signin/JTJGdGltZXRhYmxlJTJGMTYzNjU4MzclMkY="
  navigated to "https://erp-testops-dev.infra.altegio.cloud/signin/JTJGdGltZXRhYmxlJTJGMTYzNjU4MzclMkY="
============================================================

Stacktrace:

suite/yclients/biz/erp/web/client_base/test_client_card_pw.py:144 in test_sidebar_adding_picture_in_client_card
lib/apps_pw/yclients/biz/erp/web/pages/guest/signin.py:115 in sign_in

Seen in: - altegio/biz.erp#227749 — shard 8 — launch 171616 (×1, last 2026-10-02 08:20 MSK)

SigninRedirectMissingError — 1 occurrence(s) across 1 pipeline(s)

autotests.lib.exception.SigninRedirectMissingError: login-XHR завершился со статусом 200, но редиректа со /signin/ не случилось за 30 с — подозрение на фронт biz.erp
--- причина (playwright) ---
Timeout 30000ms exceeded.
=========================== logs ===========================
waiting for navigation to "<function ImplToApiMapping.wrap_handler.<locals>.wrapper_func at 0x7f0ebc6ae8e0>" until 'commit'
  navigated to "https://erp-testops-dev.infra.altegio.cloud/signin/"
  navigated to "https://erp-testops-dev.infra.altegio.cloud/signin/"
  navigated to "https://erp-testops-dev.infra.altegio.cloud/signin/JTJGdGltZXRhYmxlJTJGMTYzNjc2MTglMkY="
  navigated to "https://erp-testops-dev.infra.altegio.cloud/signin/JTJGdGltZXRhYmxlJTJGMTYzNjc2MTglMkY="
  navigated to "https://erp-testops-dev.infra.altegio.cloud/signin/JTJGdGltZXRhYmxlJTJGMTYzNjc2MTglMkY="
============================================================

Stacktrace:

suite/yclients/biz/erp/web/client_base/test_client_card_pw.py:144 in test_sidebar_adding_picture_in_client_card
lib/apps_pw/yclients/biz/erp/web/pages/guest/signin.py:115 in sign_in

Seen in: - altegio/biz.erp#227749 — shard 8 — launch 171616 (×1, last 2026-10-02 08:20 MSK)

SigninRedirectMissingError — 1 occurrence(s) across 1 pipeline(s)

autotests.lib.exception.SigninRedirectMissingError: login-XHR завершился со статусом 200, но редиректа со /signin/ не случилось за 30 с — подозрение на фронт biz.erp
--- причина (playwright) ---
Timeout 30000ms exceeded.
=========================== logs ===========================
waiting for navigation to "<function ImplToApiMapping.wrap_handler.<locals>.wrapper_func at 0x7f7720f4d3a0>" until 'commit'
  navigated to "https://erp-testops-dev.infra.altegio.cloud/signin/"
  navigated to "https://erp-testops-dev.infra.altegio.cloud/signin/"
  navigated to "https://erp-testops-dev.infra.altegio.cloud/signin/JTJGdGltZXRhYmxlJTJGMTYzNjg3NTUlMkY="
  navigated to "https://erp-testops-dev.infra.altegio.cloud/signin/JTJGdGltZXRhYmxlJTJGMTYzNjg3NTUlMkY="
  navigated to "https://erp-testops-dev.infra.altegio.cloud/signin/JTJGdGltZXRhYmxlJTJGMTYzNjg3NTUlMkY="
============================================================

Stacktrace:

suite/yclients/biz/erp/web/client_base/test_client_card_pw.py:144 in test_sidebar_adding_picture_in_client_card
lib/apps_pw/yclients/biz/erp/web/pages/guest/signin.py:115 in sign_in

Seen in: - altegio/biz.erp#227749 — shard 8 — launch 171616 (×1, last 2026-10-02 08:20 MSK)

SigninRedirectMissingError — 1 occurrence(s) across 1 pipeline(s)

autotests.lib.exception.SigninRedirectMissingError: login-XHR завершился со статусом 200, но редиректа со /signin/ не случилось за 30 с — подозрение на фронт biz.erp
--- причина (playwright) ---
Timeout 30000ms exceeded.
=========================== logs ===========================
waiting for navigation to "<function ImplToApiMapping.wrap_handler.<locals>.wrapper_func at 0x7f59af645da0>" until 'commit'
  navigated to "https://erp-testops-dev.infra.altegio.cloud/signin/"
  navigated to "https://erp-testops-dev.infra.altegio.cloud/signin/"
  navigated to "https://erp-testops-dev.infra.altegio.cloud/signin/JTJGdGltZXRhYmxlJTJGMTYzNzEyNDElMkY="
  navigated to "https://erp-testops-dev.infra.altegio.cloud/signin/JTJGdGltZXRhYmxlJTJGMTYzNzEyNDElMkY="
  navigated to "https://erp-testops-dev.infra.altegio.cloud/signin/JTJGdGltZXRhYmxlJTJGMTYzNzEyNDElMkY="
============================================================

Stacktrace:

suite/yclients/biz/erp/web/client_base/test_client_card_pw.py:144 in test_sidebar_adding_picture_in_client_card
lib/apps_pw/yclients/biz/erp/web/pages/guest/signin.py:115 in sign_in

Seen in: - altegio/biz.erp#227787 — shard 4 — launch 171752 (×1, last 2026-10-02 11:50 MSK)

TimeoutError — 1 occurrence(s) across 1 pipeline(s)

playwright._impl._errors.TimeoutError: Locator.click: Timeout 30000ms exceeded.
Call log:
  - waiting for locator("div#calendar-block").locator("td[data-handler=\"selectDay\"]:not([class*=\"ui-datepicker-other-month\"])").filter(has=locator("[class*=\"ui-datepicker-day-text\"]").filter(has_text=re.compile(r"^\s*1\s*$"))).first.locator("a")
    - locator resolved to <a href="#" class="ui-state-default ui-state-highlight ui-state-active">…</a>
  - attempting click action
    2 × waiting for element to be visible, enabled and stable
      - element is visible, enabled and stable
      - scrolling into view if needed
      - done scrolling
      - <a target="_self" class="yc-link yc-link_light" href="https://erp-testops-dev.infra.altegio.cloud/timetable/16356571/#mode=1">Reload this Page</a> from <div class="v-error-modal v-error-modal--unauthorized">…</div> subtree intercepts pointer events
    - retrying click action
    - waiting 20ms
    - waiting for element to be visible, enabled and stable
    - element is visible, enabled and stable
    - scrolling into view if needed
    - done scrolling
    - <a target="_self" class="yc-link yc-link_light" href="https://erp-testops-dev.infra.altegio.cloud/timetable/16356571/#mode=1">Reload this Page</a> from <div class="v-error-modal v-error-modal--unauthorized">…</div> subtree intercepts pointer events
  2 × retrying click action
      - waiting 100ms
      - waiting for element to be visible, enabled and stable
      - element is visible, enabled and stable
      - scrolling into view if needed
      - done scrolling
      - <div class="v-error-modal v-error-modal--unauthorized">…</div> intercepts pointer events
  13 × retrying click action
       - waiting 500ms
       - waiting for element to be visible, enabled and stable
       - element is visible, enabled and stable
       - scrolling into view if needed
       - done scrolling
       - <a target="_self" class="yc-link yc-link_light" href="https://erp-testops-dev.infra.altegio.cloud/timetable/16356571/#mode=1">Reload this Page</a> from <div class="v-error-modal v-error-modal--unauthorized">…</div> subtree intercepts pointer events
     - retrying click action
       - waiting 500ms
       - waiting for element to be visible, enabled and stable
       - element is visible, enabled and stable
       - scrolling into view if needed
       - done scrolling
       - <a target="_self" class="yc-link yc-link_light" href="https://erp-testops-dev.infra.altegio.cloud/timetable/16356571/#mode=1">Reload this Page</a> from <div class="v-error-modal v-error-modal--unauthorized">…</div> subtree intercepts pointer events
     - retrying click action
       - waiting 500ms
       - waiting for element to be visible, enabled and stable
       - element is visible, enabled and stable
       - scrolling into view if needed
       - done scrolling
       - <div class="v-error-modal v-error-modal--unauthorized">…</div> intercepts pointer events
     - retrying click action
       - waiting 500ms
       - waiting for element to be visible, enabled and stable
       - element is visible, enabled and stable
       - scrolling into view if needed
       - done scrolling
       - <div class="v-error-modal v-error-modal--unauthorized">…</div> intercepts pointer events
  2 × retrying click action
      - waiting 500ms
      - waiting for element to be visible, enabled and stable
      - element is visible, enabled and stable
      - scrolling into view if needed
      - done scrolling
      - <a target="_self" class="yc-link yc-link_light" href="https://erp-testops-dev.infra.altegio.cloud/timetable/16356571/#mode=1">Reload this Page</a> from <div class="v-error-modal v-error-modal--unauthorized">…</div> subtree intercepts pointer events
  - retrying click action
    - waiting 500ms
    - waiting for element to be visible, enabled and stable
    - element is visible, enabled and stable
    - scrolling into view if needed
    - done scrolling
    - <div class=... [truncated]

Stacktrace:

suite/yclients/biz/erp/web/client_base/test_client_card_pw.py:152 in test_sidebar_adding_picture_in_client_card
lib/apps_pw/yclients/biz/erp/web/pages/__init__.py:77 in decorated
lib/apps_pw/yclients/biz/erp/web/pages/user.py:497 in open_timetable
lib/apps_pw/yclients/biz/erp/web/pages/user.py:635 in _set_calendar_date
lib/apps_pw/yclients/biz/erp/web/pages/user.py:621 in _navigate_and_click

Seen in: - altegio/biz.erp#227596 — shard 6 — launch 171280 (×1, last 2026-10-01 17:40 MSK)

TimeoutError — 1 occurrence(s) across 1 pipeline(s)

playwright._impl._errors.TimeoutError: Locator.click: Timeout 30000ms exceeded.
Call log:
  - waiting for locator("div#calendar-block").locator("td[data-handler=\"selectDay\"]:not([class*=\"ui-datepicker-other-month\"])").filter(has=locator("[class*=\"ui-datepicker-day-text\"]").filter(has_text=re.compile(r"^\s*1\s*$"))).first.locator("a")
    - locator resolved to <a href="#" class="ui-state-default ui-state-highlight ui-state-active">…</a>
  - attempting click action
    2 × waiting for element to be visible, enabled and stable
      - element is visible, enabled and stable
      - scrolling into view if needed
      - done scrolling
      - <a target="_self" class="yc-link yc-link_light" href="https://erp-testops-dev.infra.altegio.cloud/timetable/16356739/#mode=1">Reload this Page</a> from <div class="v-error-modal v-error-modal--unauthorized v-error-modal__fade-enter-active v-error-modal__fade-enter-to">…</div> subtree intercepts pointer events
    - retrying click action
    - waiting 20ms
    - waiting for element to be visible, enabled and stable
    - element is visible, enabled and stable
    - scrolling into view if needed
    - done scrolling
    - <a target="_self" class="yc-link yc-link_light" href="https://erp-testops-dev.infra.altegio.cloud/timetable/16356739/#mode=1">Reload this Page</a> from <div class="v-error-modal v-error-modal--unauthorized v-error-modal__fade-enter-active v-error-modal__fade-enter-to">…</div> subtree intercepts pointer events
  2 × retrying click action
      - waiting 100ms
      - waiting for element to be visible, enabled and stable
      - element is visible, enabled and stable
      - scrolling into view if needed
      - done scrolling
      - <div class="v-error-modal v-error-modal--unauthorized">…</div> intercepts pointer events
  13 × retrying click action
       - waiting 500ms
       - waiting for element to be visible, enabled and stable
       - element is visible, enabled and stable
       - scrolling into view if needed
       - done scrolling
       - <a target="_self" class="yc-link yc-link_light" href="https://erp-testops-dev.infra.altegio.cloud/timetable/16356739/#mode=1">Reload this Page</a> from <div class="v-error-modal v-error-modal--unauthorized">…</div> subtree intercepts pointer events
     - retrying click action
       - waiting 500ms
       - waiting for element to be visible, enabled and stable
       - element is visible, enabled and stable
       - scrolling into view if needed
       - done scrolling
       - <a target="_self" class="yc-link yc-link_light" href="https://erp-testops-dev.infra.altegio.cloud/timetable/16356739/#mode=1">Reload this Page</a> from <div class="v-error-modal v-error-modal--unauthorized">…</div> subtree intercepts pointer events
     - retrying click action
       - waiting 500ms
       - waiting for element to be visible, enabled and stable
       - element is visible, enabled and stable
       - scrolling into view if needed
       - done scrolling
       - <div class="v-error-modal v-error-modal--unauthorized">…</div> intercepts pointer events
     - retrying click action
       - waiting 500ms
       - waiting for element to be visible, enabled and stable
       - element is visible, enabled and stable
       - scrolling into view if needed
       - done scrolling
       - <div class="v-error-modal v-error-modal--unauthorized">…</div> intercepts pointer events
  2 × retrying click action
      - waiting 500ms
      - waiting for element to be visible, enabled and stable
      - element is visible, enabled and stable
      - scrolling into view if needed
      - done scrolling
      - <a target="_self" class="yc-link yc-link_light" href="https://erp-testops-dev.infra.altegio.cloud/timetable/16356739/#mode=1">Reload this Page</a> from <div class="v-error-modal v-error-modal--unauthorized">…</div> subtree intercepts pointer events
  - retrying click action
    - waiting 500ms
    - waiting for element to be visible, enabled and st... [truncated]

Stacktrace:

suite/yclients/biz/erp/web/client_base/test_client_card_pw.py:152 in test_sidebar_adding_picture_in_client_card
lib/apps_pw/yclients/biz/erp/web/pages/__init__.py:77 in decorated
lib/apps_pw/yclients/biz/erp/web/pages/user.py:497 in open_timetable
lib/apps_pw/yclients/biz/erp/web/pages/user.py:635 in _set_calendar_date
lib/apps_pw/yclients/biz/erp/web/pages/user.py:621 in _navigate_and_click

Seen in: - altegio/biz.erp#227596 — shard 6 — launch 171280 (×1, last 2026-10-01 17:40 MSK)

TimeoutError — 1 occurrence(s) across 1 pipeline(s)

playwright._impl._errors.TimeoutError: Locator.click: Timeout 30000ms exceeded.
Call log:
  - waiting for locator("div#calendar-block").locator("td[data-handler=\"selectDay\"]:not([class*=\"ui-datepicker-other-month\"])").filter(has=locator("[class*=\"ui-datepicker-day-text\"]").filter(has_text=re.compile(r"^\s*2\s*$"))).first.locator("a")
    - locator resolved to <a href="#" class="ui-state-default ui-state-highlight ui-state-active">…</a>
  - attempting click action
    2 × waiting for element to be visible, enabled and stable
      - element is visible, enabled and stable
      - scrolling into view if needed
      - done scrolling
      - <a target="_self" class="yc-link yc-link_light" href="https://erp-testops-dev.infra.altegio.cloud/timetable/16360879/#mode=1">Reload this Page</a> from <div class="v-error-modal v-error-modal--unauthorized">…</div> subtree intercepts pointer events
    - retrying click action
    - waiting 20ms
    - waiting for element to be visible, enabled and stable
    - element is visible, enabled and stable
    - scrolling into view if needed
    - done scrolling
    - <a target="_self" class="yc-link yc-link_light" href="https://erp-testops-dev.infra.altegio.cloud/timetable/16360879/#mode=1">Reload this Page</a> from <div class="v-error-modal v-error-modal--unauthorized">…</div> subtree intercepts pointer events
  2 × retrying click action
      - waiting 100ms
      - waiting for element to be visible, enabled and stable
      - element is visible, enabled and stable
      - scrolling into view if needed
      - done scrolling
      - <div class="v-error-modal v-error-modal--unauthorized">…</div> intercepts pointer events
  13 × retrying click action
       - waiting 500ms
       - waiting for element to be visible, enabled and stable
       - element is visible, enabled and stable
       - scrolling into view if needed
       - done scrolling
       - <a target="_self" class="yc-link yc-link_light" href="https://erp-testops-dev.infra.altegio.cloud/timetable/16360879/#mode=1">Reload this Page</a> from <div class="v-error-modal v-error-modal--unauthorized">…</div> subtree intercepts pointer events
     - retrying click action
       - waiting 500ms
       - waiting for element to be visible, enabled and stable
       - element is visible, enabled and stable
       - scrolling into view if needed
       - done scrolling
       - <a target="_self" class="yc-link yc-link_light" href="https://erp-testops-dev.infra.altegio.cloud/timetable/16360879/#mode=1">Reload this Page</a> from <div class="v-error-modal v-error-modal--unauthorized">…</div> subtree intercepts pointer events
     - retrying click action
       - waiting 500ms
       - waiting for element to be visible, enabled and stable
       - element is visible, enabled and stable
       - scrolling into view if needed
       - done scrolling
       - <div class="v-error-modal v-error-modal--unauthorized">…</div> intercepts pointer events
     - retrying click action
       - waiting 500ms
       - waiting for element to be visible, enabled and stable
       - element is visible, enabled and stable
       - scrolling into view if needed
       - done scrolling
       - <div class="v-error-modal v-error-modal--unauthorized">…</div> intercepts pointer events
  2 × retrying click action
      - waiting 500ms
      - waiting for element to be visible, enabled and stable
      - element is visible, enabled and stable
      - scrolling into view if needed
      - done scrolling
      - <a target="_self" class="yc-link yc-link_light" href="https://erp-testops-dev.infra.altegio.cloud/timetable/16360879/#mode=1">Reload this Page</a> from <div class="v-error-modal v-error-modal--unauthorized">…</div> subtree intercepts pointer events
  - retrying click action
    - waiting 500ms
    - waiting for element to be visible, enabled and stable
    - element is visible, enabled and stable
    - scrolling into view if needed
    - done scrolling
    - <div class=... [truncated]

Stacktrace:

suite/yclients/biz/erp/web/client_base/test_client_card_pw.py:152 in test_sidebar_adding_picture_in_client_card
lib/apps_pw/yclients/biz/erp/web/pages/__init__.py:77 in decorated
lib/apps_pw/yclients/biz/erp/web/pages/user.py:497 in open_timetable
lib/apps_pw/yclients/biz/erp/web/pages/user.py:635 in _set_calendar_date
lib/apps_pw/yclients/biz/erp/web/pages/user.py:621 in _navigate_and_click

Seen in: - altegio/biz.erp#227722 — shard 2 — launch 171516 (×1, last 2026-10-02 04:26 MSK)