Онлайн-запись - Подтверждение создании записи верным sms кодом¶
test_sms_confirm_number_on_valid_code
Failures in last 30 days: 13
Generated at 2026-10-08 03:35 MSK
Last failure: 2026-10-02 11:50 MSK
Filter: pipelines with sandbox_biz_erp ∈ {master, testops-dev} AND autotests_branch ∈ {master, main} only (testops-dev — daytime ticks since 2026-08-05).
By exception class:
- TimeoutException — 9
- WebDriverException — 3
- AssertionError — 1
Failure signatures (grouped by exception + full message):
TimeoutException — 9 occurrence(s) across 4 pipeline(s)¶
selenium.common.exceptions.TimeoutException: Message:
Stacktrace:
suite/yclients/client/booking/web/online_booking/test_create_booking.py:276 in test_sms_confirm_number_on_valid_code
lib/common/ui/pages/web.py:61 in decorated
lib/common/ui/pages/web.py:646 in wait_for_value_in_db
lib/ui/selenium/webdriver/support/wait.py:28 in until
Seen in: - altegio/biz.erp#227787 — shard 7 — launch 171752 (×1, last 2026-10-02 11:50 MSK) - altegio/biz.erp#227749 — shard 6 — launch 171616 (×3, last 2026-10-02 08:20 MSK) - altegio/biz.erp#227735 — shard 3 — launch 171549 (×3, last 2026-10-02 06:23 MSK) - altegio/biz.erp#227722 — shard 2 — launch 171516 (×2, last 2026-10-02 04:26 MSK)
AssertionError — 1 occurrence(s) across 1 pipeline(s)¶
AssertionError: Не отображается кнопка 'Добавить в google календарь'
Expected: <False>
but: was <True>
Stacktrace:
suite/yclients/client/booking/web/online_booking/test_create_booking.py:288 in test_sms_confirm_number_on_valid_code
Seen in: - altegio/biz.erp#227722 — shard 2 — launch 171516 (×1, last 2026-10-02 04:26 MSK)
WebDriverException — 1 occurrence(s) across 1 pipeline(s)¶
selenium.common.exceptions.WebDriverException: Message: <unknown>: Failed to read the 'localStorage' property from 'Window': Access is denied for this document.
(Session info: headless chrome=119.0.6045.199)
Stacktrace:
#0 0x55847422e5e3 <unknown>
#1 0x558473ef10b7 <unknown>
#2 0x558473ef72b5 <unknown>
#3 0x558473ef99b1 <unknown>
#4 0x558473f8271f <unknown>
#5 0x558473f65ef2 <unknown>
#6 0x558473f81b3d <unknown>
#7 0x558473f65cc3 <unknown>
#8 0x558473f310e4 <unknown>
#9 0x558473f320ae <unknown>
#10 0x5584741f4ce1 <unknown>
#11 0x5584741f8b7e <unknown>
#12 0x5584741e24b5 <unknown>
#13 0x5584741f97d6 <unknown>
#14 0x5584741c5dbf <unknown>
#15 0x55847421c748 <unknown>
#16 0x55847421c917 <unknown>
#17 0x55847422d773 <unknown>
#18 0x7fa142833aa4 <unknown>
#19 0x7fa1428c0a64 __clone
Stacktrace:
lib/common/ui/pages/web.py:61 in decorated
lib/apps/yclients/client/booking/web/pages/__init__.py:80 in open
lib/common/ui/pages/web.py:61 in decorated
lib/apps/yclients/client/booking/web/pages/__init__.py:41 in set_environment
lib/ui/selenium/webdriver/__init__.py:52 in execute_script
Seen in: - altegio/client.booking#224668 — shard 3 — launch 165208 (×1, last 2026-09-21 08:16 MSK)
WebDriverException — 1 occurrence(s) across 1 pipeline(s)¶
selenium.common.exceptions.WebDriverException: Message: <unknown>: Failed to read the 'localStorage' property from 'Window': Access is denied for this document.
(Session info: headless chrome=119.0.6045.199)
Stacktrace:
#0 0x55c26c6945e3 <unknown>
#1 0x55c26c3570b7 <unknown>
#2 0x55c26c35d2b5 <unknown>
#3 0x55c26c35f9b1 <unknown>
#4 0x55c26c3e871f <unknown>
#5 0x55c26c3cbef2 <unknown>
#6 0x55c26c3e7b3d <unknown>
#7 0x55c26c3cbcc3 <unknown>
#8 0x55c26c3970e4 <unknown>
#9 0x55c26c3980ae <unknown>
#10 0x55c26c65ace1 <unknown>
#11 0x55c26c65eb7e <unknown>
#12 0x55c26c6484b5 <unknown>
#13 0x55c26c65f7d6 <unknown>
#14 0x55c26c62bdbf <unknown>
#15 0x55c26c682748 <unknown>
#16 0x55c26c682917 <unknown>
#17 0x55c26c693773 <unknown>
#18 0x7fd69e5feaa4 <unknown>
#19 0x7fd69e68ba64 __clone
Stacktrace:
lib/common/ui/pages/web.py:61 in decorated
lib/apps/yclients/client/booking/web/pages/__init__.py:80 in open
lib/common/ui/pages/web.py:61 in decorated
lib/apps/yclients/client/booking/web/pages/__init__.py:41 in set_environment
lib/ui/selenium/webdriver/__init__.py:52 in execute_script
Seen in: - altegio/client.booking#224668 — shard 3 — launch 165208 (×1, last 2026-09-21 08:16 MSK)
WebDriverException — 1 occurrence(s) across 1 pipeline(s)¶
selenium.common.exceptions.WebDriverException: Message: <unknown>: Failed to read the 'localStorage' property from 'Window': Access is denied for this document.
(Session info: headless chrome=119.0.6045.199)
Stacktrace:
#0 0x56551d7e45e3 <unknown>
#1 0x56551d4a70b7 <unknown>
#2 0x56551d4ad2b5 <unknown>
#3 0x56551d4af9b1 <unknown>
#4 0x56551d53871f <unknown>
#5 0x56551d51bef2 <unknown>
#6 0x56551d537b3d <unknown>
#7 0x56551d51bcc3 <unknown>
#8 0x56551d4e70e4 <unknown>
#9 0x56551d4e80ae <unknown>
#10 0x56551d7aace1 <unknown>
#11 0x56551d7aeb7e <unknown>
#12 0x56551d7984b5 <unknown>
#13 0x56551d7af7d6 <unknown>
#14 0x56551d77bdbf <unknown>
#15 0x56551d7d2748 <unknown>
#16 0x56551d7d2917 <unknown>
#17 0x56551d7e3773 <unknown>
#18 0x7ff507193aa4 <unknown>
#19 0x7ff507220a64 __clone
Stacktrace:
lib/common/ui/pages/web.py:61 in decorated
lib/apps/yclients/client/booking/web/pages/__init__.py:80 in open
lib/common/ui/pages/web.py:61 in decorated
lib/apps/yclients/client/booking/web/pages/__init__.py:41 in set_environment
lib/ui/selenium/webdriver/__init__.py:52 in execute_script
Seen in: - altegio/client.booking#224668 — shard 3 — launch 165208 (×1, last 2026-09-21 08:16 MSK)